<svg xmlns="http://www.w3.org/2000/svg" width="97.975" height="89.722" viewBox="0 0 97.975 89.722">
  <g id="Group_407" data-name="Group 407" transform="translate(-3898.701 -3474.278)">
    <path id="Path_2373" data-name="Path 2373" d="M3946.538,3474.278a26.657,26.657,0,1,0,26.658,26.657A26.66,26.66,0,0,0,3946.538,3474.278Z" transform="translate(1.151)" fill="#f27b7d"/>
    <g id="Group_405" data-name="Group 405" transform="translate(3933.409 3484.771)">
      <path id="Path_2374" data-name="Path 2374" d="M3945.9,3500.023a2.249,2.249,0,1,0,2.249,2.249A2.255,2.255,0,0,0,3945.9,3500.023Zm-13.452-15.793v2.889h27.636v-2.889Zm20.422,14.213.011,2.9h4.418v.936c0,8.122-8.551,14.286-17.129,9.96a9.436,9.436,0,0,1-4.063-3.955,12.614,12.614,0,0,1-1.582-6,11.415,11.415,0,0,1,10.77-11.37l.412-.017h.063v-.011h14.315v-2.888h-14.452c-9.971.205-17.5,10.713-12.335,21.216a12.61,12.61,0,0,0,5.993,5.838c10.559,4.88,20.891-2.763,20.891-12.768v-3.836Z" transform="translate(-3931.62 -3484.23)" fill="#fff"/>
    </g>
    <path id="Path_2375" data-name="Path 2375" d="M3935.975,3536.407v10.459a7.62,7.62,0,0,1-7.617,7.618h-.1v-2.959h.1a4.664,4.664,0,0,0,4.658-4.658v-10.459Z" transform="translate(1.606 3.377)" fill="#66949e"/>
    <rect id="Rectangle_662" data-name="Rectangle 662" width="22.396" height="2.67" transform="translate(3942.955 3532.109) rotate(90)" fill="#66949e"/>
    <rect id="Rectangle_663" data-name="Rectangle 663" width="3.346" height="2.977" transform="translate(3937.586 3535.474) rotate(90)" fill="#66949e"/>
    <rect id="Rectangle_664" data-name="Rectangle 664" width="3.346" height="2.977" transform="translate(3985.519 3558.885) rotate(180)" fill="#66949e"/>
    <g id="Group_406" data-name="Group 406" transform="translate(3910.3 3555.909)">
      <rect id="Rectangle_665" data-name="Rectangle 665" width="3.346" height="2.977" transform="translate(7.953 2.977) rotate(180)" fill="#66949e"/>
      <rect id="Rectangle_666" data-name="Rectangle 666" width="3.346" height="2.977" transform="translate(3.346 2.977) rotate(180)" fill="#66949e"/>
    </g>
    <path id="Path_2376" data-name="Path 2376" d="M3984.72,3550.149h-30.085v-2.643h30.085a6.273,6.273,0,0,0,0-12.546h-11.062v-2.644h11.063a8.916,8.916,0,0,1,0,17.833Z" transform="translate(3.04 3.155)" fill="#66949e"/>
    <path id="Path_2377" data-name="Path 2377" d="M3924.426,3551.331h-17.356a8.368,8.368,0,1,1,0-16.735h2.395v2.7h-2.395a5.663,5.663,0,0,0,0,11.326h17.356a2.722,2.722,0,0,0,0-5.444h-.505a5.427,5.427,0,1,1,0-10.854H3929v2.7h-5.084a2.722,2.722,0,0,0,0,5.445h.505a5.427,5.427,0,0,1,0,10.854Z" transform="translate(0 3.156)" fill="#66949e"/>
    <path id="Path_2378" data-name="Path 2378" d="M3959.418,3550.13h-8.125a8.134,8.134,0,0,1-8.124-8.125v-1.2a8.125,8.125,0,1,1,16.249,0Zm-8.125-14.813a5.491,5.491,0,0,0-5.485,5.486v1.2a5.492,5.492,0,0,0,5.485,5.486h5.485V3540.8A5.492,5.492,0,0,0,3951.293,3535.317Z" transform="translate(2.417 3.174)" fill="#66949e"/>
    <path id="Path_2379" data-name="Path 2379" d="M3951.293,3560.009a8.132,8.132,0,0,1-8.124-8.123v-1.4h2.64v1.4a5.485,5.485,0,0,0,10.969,0v-4.193h2.64v4.193A8.133,8.133,0,0,1,3951.293,3560.009Z" transform="translate(2.417 3.991)" fill="#66949e"/>
  </g>
</svg>
