<svg xmlns="http://www.w3.org/2000/svg" xmlns:xlink="http://www.w3.org/1999/xlink" width="41.47" height="41.47" viewBox="0 0 41.47 41.47">
  <defs>
    <linearGradient id="linear-gradient" x1="-2.406" y1="-3.231" x2="1.728" y2="1.957" gradientUnits="objectBoundingBox">
      <stop offset="0" stop-color="#1b46b9"/>
      <stop offset="1" stop-color="#ef6b9c"/>
    </linearGradient>
  </defs>
  <g id="Group_176" data-name="Group 176" transform="translate(-645 -2812)">
    <circle id="Ellipse_203" data-name="Ellipse 203" cx="20.735" cy="20.735" r="20.735" transform="translate(645 2812)" opacity="0.53" fill="url(#linear-gradient)"/>
    <circle id="Ellipse_204" data-name="Ellipse 204" cx="16.544" cy="16.544" r="16.544" transform="translate(646.985 2814.206)" opacity="0.53" fill="url(#linear-gradient)"/>
  </g>
</svg>
