سارة حامد جلال عبدالفتاح,25,sarahhamed2496@gmail.com,1277950227,Nasr City,Ain Shams university,Computer Engineering ,Graduated,https://drive.google.com/open?id=1SiYlxeaIRm_eTmBEXJiCXokuFbMoY2kV
Mostafa Omar Mostafa Elsayed,20,moustafaomar200@gmail.com,1093107532,Cairo,Cairo university,HEM,3,https://drive.google.com/open?id=1mjclDqxjLZyVX1RL8vy8dkS9iCA5nk9F
Alaa Fathy,21,alaafathhyy@gmail.com,2.01212E+11,cairo,Cairo university,cs ,3,https://drive.google.com/open?id=1fHwZKALMzX14qxZLTlpQ_ib2X_3T0Y4P
Zakaria samy mohamed abdelhalim,22,zakariasamy10@gmail.com,2.01155E+11,"Maadi, Cairo",Al-Azhar University,CSE,5,https://drive.google.com/open?id=1q6UJ7NtDBm02VhjGh2Rgtd1CHoxjUVmU
Mohamed Ashraf Gamal Taha,21,mohammedashraf@aucegypt.edu,1007923758,"El Rehab City, New Cairo, Cairo.",The American University in Cairo,Computer Engineering,4,https://drive.google.com/open?id=1IjADSV__g2bjiamoLGwC2QslsBhXK4A5
Khaled Mohamed Abdelhamid Mahmoud,23,khaledabdelelhamid98@gmail.com,1128206779,"38 Dr. Abd el shaft Mohamed, Nasr City, Cairo",Other,IS,Graduated,https://drive.google.com/open?id=1FAcqgekAZSYKK8I_gbcsqrwQmVJKN-YL
hania ahmed kamal ahmed,22,haniaraslan@gmail.com,1117440126,alexandria,Alexandria university,CE (computer engineering),5,https://drive.google.com/open?id=1dQJS8gvglrXkZK_NDR1goUpoUPbqL6b3
Yousef Ahmed Yousef,26,yousefahmed171@gmail.com,1010737793,Cairo,Other,MIS,Graduated,https://drive.google.com/open?id=1YsjK9rnxop-DG0k-ZYvUCGuTOHOfuifz
Omar Bassuni Riad Nouh,23,omarbassuni2@gmail.com ,1121430707,Giza ,Cairo university,CS,Graduated,https://drive.google.com/open?id=16m3KzvL2prEueZ-tJx7lAqjs2diDjQZK
Rania ashraf Abdelazeem ebrahim ,26,Ranaiebrahim666@gmail.com ,2.01064E+11,الدقهلية ,Other,Communication and electronic ,Graduated,https://drive.google.com/open?id=1ztnBIgrbMIAntUC15Tb9r83ZLgg22MTD
Aya Ali,24,aya.ali466@gmail.com,1140428713,Tanta but I'm willing to move to wherever the company will be.,Other,BIS,Graduated,https://drive.google.com/open?id=1QwxgVSuZv68y9DSHzWvncxWyO7DUs9QP
Yusuf Muhammad Abdelbaqy Muhammad,25,elnumany@gmail.com,1124346180,6october city,Other,CS,Graduated,https://drive.google.com/open?id=1QXFhZoNQiLUx3FgVPOU9AxMMP9GyLzVZ
Mohamed Ismail abo el hassan abdullah,29,Mismail561@yahoo.com,1118662373,Cairo,Helwan university,Cs,Graduated,https://drive.google.com/open?id=1QWo7ZdOagF_5q8Ipd9S7DASX93ymhEmo
Mahmoud Ragab Abdellatief Zidan,27,mahmoudzidan05@gmail.com,1226848839,Alexandria but willing to relocate,Al-Azhar University,Science,Graduated,https://drive.google.com/open?id=1FlkrTgPsMb1VA_g0sY_GRr_URWW8PWDF
يوسف عبدالمنعم محمد علي,24,yusufabdelmoniem2008@gmail.com,1277299543,Alexandria ,Other,Cd,Graduated,https://drive.google.com/open?id=10uBiypyJtaiimPElWOpyJTQ7c1puH1QG
مصطفى يحيى أحمد عكاشة,22,mostafa.okasha1999@gmail.com,1066863769,فيصل الجيزة,Helwan university,cs,Graduated,https://drive.google.com/open?id=1EqYXYfzicUYVTkK-cnpK-J-1EkIIjmRl
Ragaa moustafa mohamed ibrahim,21,Ragaamoustaffa@gmail.com,1091281231,"Nasr city, Cairo",Other,CS,4,https://drive.google.com/open?id=1z0g0d-p8woSYQ6PG7pHk4aB7CgIe9VhX
نشوة حسن صلاح محمد,29,sobda1192@gmail.com,1144662934,Shipra el khama,Cairo university,cs,Graduated,https://drive.google.com/open?id=1vndMHVZ3y4N-xcVJTeXL50E0o0hXWWco
Radwa Ahmed Mohamed Kamel,21,radwa.kaml00@eng-st.cu.edu.eg,1279657214,"Cairo, wadi hof /helwan",Cairo university,Computer Engineering,4,https://drive.google.com/open?id=1X7LMI8R_qGfKar8S2BfXt-ITrPVUZXy9
Hazem Khaled Ahmed Kasim,21,hazemkasim3@gmail.com,1100849498,Nasr City,Cairo university,Computer Engineering,4,https://drive.google.com/open?id=1KmYTyULvLtyoEtKfjj0mGGmBKtb2YEZ-
Asmaa Mahmoud Mohamed Bayomi,22,asmaa329917@gmail.com,1140862754,Cairo - downtown,Helwan university,IS&CS,Graduated,https://drive.google.com/open?id=1rw7GTMbqcnie2m58tHMekB8QUnh2ncjP
Hamdy Mahmoud Fawzy Ellithy ,24,hamdy.fcai@gmail.com,2.01552E+11,tanta,Benha University,CS,Graduated,https://drive.google.com/open?id=1wn993aKQ_P6gFR-hZDvk67t-xr51idoG
Fagr hesham mohamed ali,22,Fagrhesham@gmail.com,1273388262,Alexandria,Alexandria university,computer and communication,4,https://drive.google.com/open?id=1Whl3UQhX8brAm_t_zrghpJrfhwbkYMD5
Rehab Ragab Mohamed Abotalep,30,rehab.abotalep@gmail.com ,1023779579,Tanta,Al-Azhar University,CS,Graduated,https://drive.google.com/open?id=1R3lYX0A7xl9nyCxWnZVVr87ts6LVO1bz
Nadeen nabil abdelmonem farag,22, nadeenfarag1999@gmail.com,1126333503,القاهرة - مدينة نصر,Ain Shams university,Cs,Graduated,https://drive.google.com/open?id=1jOPDAXL4aMEKFF7Lr9s6v7UtS7HrmNNx
Roaa Ali Ragab Hedaya,23,roaahedaya@gmail.com,1112331354,06-Oct,Alexandria university,CCE(Computer and commuincations),Graduated,https://drive.google.com/open?id=1msctmO0UgwajEdlSgexE75Ou9qgH9byM
Kareem El-Giushy El-Meghawry Ibraheem,18,kareem.64123@gmail.com,1144379723,Tanta,Mansoura University,Artificial Intelligence,2,https://drive.google.com/open?id=1O0T2tgPP3M5CY5hEk5oP0rCJPS4O4l7Q