﻿Hady,yasser,, +20 109 603 3799
Nada Beshir Gomycode,,, +20 115 624 4484
Rim Bannis legal clinck,,, +20 102 611 5116
Sameh el shawa,,, +20 115 777 8589
Mohamed Ibraheem Fathy,,, +20 100 225 1478
mostafa ghorab,,, +20 100 241 3787
Marwa Radwan,,, +20 106 050 7925
Magdy galal,,, +20 102 354 9141
Dr Moatasem dentist,,, +20 100 880 7699
Mohanad Shady Nsh2,,, +20 100 831 1439
Ahmed Elhosiny,,, +966 50 004 3700
dr ahmed nasr medical,,, +20 100 701 8518
yasser ecommerce client,,, +20 109 555 6842
Shika Client,,, +20 114 640 4333
Ahmed Nassr Client,,, +20 114 385 9045
Sara Medical Client,,, +20 111 232 4598
Rania turbo Client,,, +20 110 156 2949
Rashed Client Germany,,, +49 1522 2123678
Ayman Elganzory Client,,, +20 100 900 8390
Rami Farah Client E-commerce,,ramikfarah@gmail.com, +20 122 774 9984
Flora App Client,,, +966 56 780 2818
Tarek Greenery Client,,, +20 100 029 0029
Mohamed Zorpa Client,,, +20 100 420 2096
Khalid Lms Client,,, +20 102 788 6900
Ali Baba Client,,, +49 176 22265054
Ahmed Iraq Client,,ahmed.dj@tentime.com, +964 781 784 6270
Mahmoud Imran Blog Client,,, +20 106 010 7654
Khaled Zain Realstat Client,,, +20 111 729 5557
Mohamed Ibraheem,Rent Car Client incubator,, +20 101 109 7281
Mr mohamed shipping,low budget,, +20 100 456 0398
mohamed nasr,MACRO,mohamed.naserads@gmail.com, +20 102 100 9477
mohamed,elafify,, +20 111 217 0508
mr samy,Edu platform,, +20 112 405 8884
abdo,Fathelbb,, +20 103 204 7007
Peter,Boktor,,0 122 997 0884
Cap Mostafa,Farag,supplementstation2021@gmail.com,01001414234