<?xml version="1.0" encoding="utf-8"?>
<!-- Generator: Adobe Illustrator 23.0.1, SVG Export Plug-In . SVG Version: 6.00 Build 0)  -->
<svg version="1.1" id="Layer_1" xmlns="http://www.w3.org/2000/svg" xmlns:xlink="http://www.w3.org/1999/xlink" x="0px" y="0px"
	 viewBox="0 0 137 230" style="enable-background:new 0 0 137 230;" xml:space="preserve">
<style type="text/css">
	.st0{fill:#F8BD7A;}
</style>
<g>
	<path class="st0" d="M922.9,113.8l-2.3-0.3c0.2,1.2,0.3,2.5,0.5,3.8C921.6,116.1,922.3,114.9,922.9,113.8z"/>
	<path class="st0" d="M53.3,119.3L11.2,226.1L128.7,79.7l-51.8,1.2l43.7-72.5c0-0.1,0-0.1,0.1-0.2c0-0.1,0-0.2,0.1-0.3
		s0-0.1,0.1-0.1c0.1-0.2,0.1-0.4,0.2-0.6c0-0.1,0.1-0.3,0.2-0.4c-0.1-0.2,0-0.4,0.1-0.5s0.2-0.2,0.3-0.2V6c0-0.1,0-0.1,0-0.2
		s0.1-0.3,0.2-0.4V5.3c0-0.1,0.1-0.1,0.1-0.1V5.1c0-0.2,0.1-0.4,0.2-0.6L62.6,5.9l-54,114.7L53.3,119.3z"/>
</g>
</svg>
