^C:\USERS\ALEXI\ONEDRIVE\DOCUMENTS\ISITECH\C++\EXERCICES\EXERCICES\EXERCICES00\EXERCICES00\X64\DEBUG\MAIN.OBJ
C:\USERS\ALEXI\ONEDRIVE\DOCUMENTS\ISITECH\C++\EXERCICES\EXERCICES\EXERCICES00\X64\DEBUG\EXERCICES00.EXE
C:\USERS\ALEXI\ONEDRIVE\DOCUMENTS\ISITECH\C++\EXERCICES\EXERCICES\EXERCICES00\X64\DEBUG\EXERCICES00.PDB
