^C:\USERS\ALEXI\ONEDRIVE\DOCUMENTS\ISITECH\C++\EXERCICES\EXERCICES\EXERCICES00\MAIN.CPP
C:\USERS\ALEXI\ONEDRIVE\DOCUMENTS\ISITECH\C++\EXERCICES\EXERCICES\EXERCICES00\EXERCICES00\X64\DEBUG\VC143.PDB
C:\USERS\ALEXI\ONEDRIVE\DOCUMENTS\ISITECH\C++\EXERCICES\EXERCICES\EXERCICES00\EXERCICES00\X64\DEBUG\VC143.IDB
C:\USERS\ALEXI\ONEDRIVE\DOCUMENTS\ISITECH\C++\EXERCICES\EXERCICES\EXERCICES00\EXERCICES00\X64\DEBUG\MAIN.OBJ
