^C:\USERS\ALEXI\ONEDRIVE\DOCUMENTS\ISITECH\C++\EXERCICES\EXERCICES\POO\X64\DEBUG\HERO.OBJ|C:\USERS\ALEXI\ONEDRIVE\DOCUMENTS\ISITECH\C++\EXERCICES\EXERCICES\POO\X64\DEBUG\MAIN.OBJ|C:\USERS\ALEXI\ONEDRIVE\DOCUMENTS\ISITECH\C++\EXERCICES\EXERCICES\POO\X64\DEBUG\POO.OBJ|C:\USERS\ALEXI\ONEDRIVE\DOCUMENTS\ISITECH\C++\EXERCICES\EXERCICES\POO\X64\DEBUG\WEAPON.OBJ
/OUT:"C:\USERS\ALEXI\ONEDRIVE\DOCUMENTS\ISITECH\C++\EXERCICES\EXERCICES\X64\DEBUG\POO.EXE" /INCREMENTAL /ILK:"X64\DEBUG\POO.ILK" /NOLOGO KERNEL32.LIB USER32.LIB GDI32.LIB WINSPOOL.LIB COMDLG32.LIB ADVAPI32.LIB SHELL32.LIB OLE32.LIB OLEAUT32.LIB UUID.LIB ODBC32.LIB ODBCCP32.LIB /MANIFEST /MANIFESTUAC:"level='asInvoker' uiAccess='false'" /manifest:embed /DEBUG /PDB:"C:\USERS\ALEXI\ONEDRIVE\DOCUMENTS\ISITECH\C++\EXERCICES\EXERCICES\X64\DEBUG\POO.PDB" /SUBSYSTEM:CONSOLE /TLBID:1 /DYNAMICBASE /NXCOMPAT /IMPLIB:"C:\USERS\ALEXI\ONEDRIVE\DOCUMENTS\ISITECH\C++\EXERCICES\EXERCICES\X64\DEBUG\POO.LIB" /MACHINE:X64 X64\DEBUG\HERO.OBJ
X64\DEBUG\MAIN.OBJ
X64\DEBUG\POO.OBJ
X64\DEBUG\WEAPON.OBJ
