C:\Users\Quent\codelab\Isitech\Cpp\Evaluation\Evalution\Evalution\Evalution.cpp;C:\Users\Quent\codelab\Isitech\Cpp\Evaluation\Evalution\Evalution\x64\Debug\Evalution.obj
C:\Users\Quent\codelab\Isitech\Cpp\Evaluation\Evalution\Evalution\EquipeMoto.cpp;C:\Users\Quent\codelab\Isitech\Cpp\Evaluation\Evalution\Evalution\x64\Debug\EquipeMoto.obj
C:\Users\Quent\codelab\Isitech\Cpp\Evaluation\Evalution\Evalution\personne.cpp;C:\Users\Quent\codelab\Isitech\Cpp\Evaluation\Evalution\Evalution\x64\Debug\personne.obj
