%YAML 1.1
%TAG !u! tag:unity3d.com,2011:
--- !u!1 &6034014327263174174
GameObject:
  m_ObjectHideFlags: 0
  m_CorrespondingSourceObject: {fileID: 0}
  m_PrefabInstance: {fileID: 0}
  m_PrefabAsset: {fileID: 0}
  serializedVersion: 6
  m_Component:
  - component: {fileID: 6034014327263174160}
  - component: {fileID: 6034014327263174175}
  m_Layer: 0
  m_Name: Bleed_SE
  m_TagString: Untagged
  m_Icon: {fileID: 0}
  m_NavMeshLayer: 0
  m_StaticEditorFlags: 0
  m_IsActive: 1
--- !u!4 &6034014327263174160
Transform:
  m_ObjectHideFlags: 0
  m_CorrespondingSourceObject: {fileID: 0}
  m_PrefabInstance: {fileID: 0}
  m_PrefabAsset: {fileID: 0}
  m_GameObject: {fileID: 6034014327263174174}
  m_LocalRotation: {x: 0, y: 0, z: 0, w: 1}
  m_LocalPosition: {x: 0, y: 0, z: 0}
  m_LocalScale: {x: 1, y: 1, z: 1}
  m_ConstrainProportionsScale: 0
  m_Children: []
  m_Father: {fileID: 0}
  m_RootOrder: 0
  m_LocalEulerAnglesHint: {x: 0, y: 0, z: 0}
--- !u!114 &6034014327263174175
MonoBehaviour:
  m_ObjectHideFlags: 0
  m_CorrespondingSourceObject: {fileID: 0}
  m_PrefabInstance: {fileID: 0}
  m_PrefabAsset: {fileID: 0}
  m_GameObject: {fileID: 6034014327263174174}
  m_Enabled: 1
  m_EditorHideFlags: 0
  m_Script: {fileID: 11500000, guid: 7e7ccaee944494a4cb55989bf35025bf, type: 3}
  m_Name: 
  m_EditorClassIdentifier: 
  <ID>k__BackingField: 10
  <EffectName>k__BackingField: Bleed
  <Description>k__BackingField: 
  <BattleText>k__BackingField: NAME was damaged from the bleed!
  <IsStackable>k__BackingField: 1
  <HasDamage>k__BackingField: 1
  <Damage>k__BackingField: 5
  <executionOrder>k__BackingField: 0
  <HasDuration>k__BackingField: 1
  <turnDuration>k__BackingField: 3
  <Icon>k__BackingField: {fileID: 193608253, guid: f8c86b22bfeba134c9d604ea9b090b37,
    type: 3}
  <effectTags>k__BackingField: []
  applyText: NAME is bleeding!
  vfxName: BleedAura
