%YAML 1.1
%TAG !u! tag:unity3d.com,2011:
--- !u!114 &11400000
MonoBehaviour:
  m_ObjectHideFlags: 0
  m_CorrespondingSourceObject: {fileID: 0}
  m_PrefabInstance: {fileID: 0}
  m_PrefabAsset: {fileID: 0}
  m_GameObject: {fileID: 0}
  m_Enabled: 1
  m_EditorHideFlags: 0
  m_Script: {fileID: 11500000, guid: 7c24dc5d34bfc1f41b45ea28f90dd83b, type: 3}
  m_Name: BattleData
  m_EditorClassIdentifier: 
  <playerData>k__BackingField: {fileID: 11400000, guid: bbe1de9faceadf14cb36261411d67bbd,
    type: 2}
  <minutesJumped>k__BackingField: 5
  <currentEnemyData>k__BackingField: {fileID: 11400000, guid: 31b7375ccf8a2f64b96c3c2a27cbf230,
    type: 2}
  <currentEnemyLevel>k__BackingField: 1
  <evasionChcMod>k__BackingField: 0.4
  <evaStrModifier>k__BackingField: 1.5
  <evaMinMax>k__BackingField: {x: 0.05, y: 0.6}
  <crtChcAtkStrModifier>k__BackingField: 1
  <crtChcAtkSpdModifier>k__BackingField: 0.05
  <crtChcTarSpdModifier>k__BackingField: 0.03
  <crtChcMod>k__BackingField: 0.25
  <crtMinMax>k__BackingField: {x: 0.05, y: 0.5}
  <crtDmgMod>k__BackingField: 1.5
  <weakDmgMod>k__BackingField: 2
  <skipTurnSE>k__BackingField: {fileID: 7799611687151308976, guid: 7e9a0af8fb46ff94e8d93fbe2691c9b5,
    type: 3}
