%YAML 1.1
%TAG !u! tag:unity3d.com,2011:
--- !u!114 &11400000
MonoBehaviour:
  m_ObjectHideFlags: 0
  m_CorrespondingSourceObject: {fileID: 0}
  m_PrefabInstance: {fileID: 0}
  m_PrefabAsset: {fileID: 0}
  m_GameObject: {fileID: 0}
  m_Enabled: 1
  m_EditorHideFlags: 0
  m_Script: {fileID: 11500000, guid: c1e1c2150a3371348af1a09c59bca6c5, type: 3}
  m_Name: GameDataBase
  m_EditorClassIdentifier: 
  <itemDatabase>k__BackingField: {fileID: 11400000, guid: 68d1468e46c2f5046a8172faf38d6fc2,
    type: 2}
  <assetDataBase>k__BackingField: {fileID: 11400000, guid: c0e5e22c6135b2e4bb09ec163ff5b923,
    type: 2}
  <audioDataBase>k__BackingField: {fileID: 11400000, guid: 47a151f7503d87940bc309ff6ae63779,
    type: 2}
  <enemyDataBase>k__BackingField: {fileID: 11400000, guid: bf61cf66c4a7e0c4bb582bf4201eb912,
    type: 2}
  <cropDataBase>k__BackingField: {fileID: 11400000, guid: 11c580dce9cfa124d842295967d21c3e,
    type: 2}
  <fishDataBase>k__BackingField: {fileID: 11400000, guid: e43578c5e1c14c4498c2d9ed4fe2d208,
    type: 2}
  <spellDataBase>k__BackingField: {fileID: 11400000, guid: aec588368d43dfd489b260687a969a75,
    type: 2}
  <statsDataBase>k__BackingField: {fileID: 11400000, guid: e677ba14270d3f74cb74d70f7d113644,
    type: 2}
  <toolDataBase>k__BackingField: {fileID: 11400000, guid: b1bcdb6d307d27740a048f2cd4b83a61,
    type: 2}
  <allyDataBase>k__BackingField: {fileID: 11400000, guid: 577873db7b0950047a281f92b6765460,
    type: 2}
  <battleData>k__BackingField: {fileID: 11400000, guid: 7a6af5a981d0b0347b44a1c2327958b5,
    type: 2}
  <shippingData>k__BackingField: {fileID: 11400000, guid: ad66e6f51d5b9ec4188e858eeae55eac,
    type: 2}
  <statShopData>k__BackingField: {fileID: 11400000, guid: 6bf833d56bc85a04faf95fde4ba7898d,
    type: 2}
  <shrineData>k__BackingField: {fileID: 11400000, guid: a627ee42844abae4089364a40f831ab8,
    type: 2}
  <progressionData>k__BackingField: {fileID: 11400000, guid: 0ba7892bd420b584aa8bfc925a166d60,
    type: 2}
  <sessionData>k__BackingField: {fileID: 11400000, guid: 123ff760089be9340bc12abe564051d4,
    type: 2}
  <settingsData>k__BackingField: {fileID: 11400000, guid: 9b01b730743c73a42bbcd11a5b005db4,
    type: 2}
  <eventQueueData>k__BackingField: {fileID: 11400000, guid: b48f07cb87219d04095955bb3f966ec8,
    type: 2}
  <playerData>k__BackingField: {fileID: 11400000, guid: bbe1de9faceadf14cb36261411d67bbd,
    type: 2}
  <playerInventory>k__BackingField: {fileID: 11400000, guid: 2e52e9402952ab649b5a934475b711d1,
    type: 2}
  <MainMenuSceneName>k__BackingField: MainSampleMenu
  <FarmSceneName>k__BackingField: FarmScene
  <TutorialScene>k__BackingField: TutorialScene
  <BattleSceneName>k__BackingField: BattleSampleScene
  <DungeonSceneName>k__BackingField: SampleDungeonScene
  <farmTileLayer>k__BackingField:
    serializedVersion: 2
    m_Bits: 256
  <plowableAreaLayer>k__BackingField:
    serializedVersion: 2
    m_Bits: 8192
  <foliageLayer>k__BackingField:
    serializedVersion: 2
    m_Bits: 4096
