%YAML 1.1
%TAG !u! tag:unity3d.com,2011:
--- !u!114 &11400000
MonoBehaviour:
  m_ObjectHideFlags: 0
  m_CorrespondingSourceObject: {fileID: 0}
  m_PrefabInstance: {fileID: 0}
  m_PrefabAsset: {fileID: 0}
  m_GameObject: {fileID: 0}
  m_Enabled: 1
  m_EditorHideFlags: 0
  m_Script: {fileID: 11500000, guid: c35febd554e745ceb7e8b9867d3f4748, type: 3}
  m_Name: ObjectiveData
  m_EditorClassIdentifier: 
  objectiveText:
    _serializedList:
    - Key: StartIkapatiCam
      Value: Keep searching for the mysterious voice telling you what to do.
    - Key: InventoryTut
      Value: Press the TAB button on your keyboard to open your inventory
    - Key: LootTut
      Value: Claim all of the contents in the chest. Press F to interact. with the
        box
    - Key: EquipAllTut
      Value: Equip your hoe tool, watering can, and a seed. Press Tab to open your
        inventory
    - Key: StartPlowableCam
      Value: Use your hoe tool inside the fenced area
    - Key: PlantTut
      Value: Plant a seed. Press E to plant.
    - Key: WaterTut
      Value: Water the plant. Press E to use your watering can
    - Key: HarvestTut
      Value: Wait for it to grow. Press E to harvest
    - Key: ReturnToIkapati
      Value: Return and talk to Ikapati
    - Key: ShowOtherGuardians
      Value: Talk to all guardians (0/3)
    - Key: ReturnLast
      Value: Return and talk to Ikapati
    - Key: DefeatedSidapa
      Value: Go to Ikapati's Shrine
