%YAML 1.1
%TAG !u! tag:unity3d.com,2011:
--- !u!114 &11400000
MonoBehaviour:
  m_ObjectHideFlags: 0
  m_CorrespondingSourceObject: {fileID: 0}
  m_PrefabInstance: {fileID: 0}
  m_PrefabAsset: {fileID: 0}
  m_GameObject: {fileID: 0}
  m_Enabled: 1
  m_EditorHideFlags: 0
  m_Script: {fileID: 11500000, guid: 922cbbf093b447899775dc7a50955c8b, type: 3}
  m_Name: IronWateringCanData
  m_EditorClassIdentifier: 
  <ItemType>k__BackingField: 5
  <ItemID>k__BackingField: IronWateringCanData
  <ItemName>k__BackingField: Iron Watering Can
  <RarityType>k__BackingField: 2
  <BuyValue>k__BackingField: 1
  <IsSellable>k__BackingField: 0
  <SellValue>k__BackingField: 1
  <IsShippable>k__BackingField: 0
  <ShippingValue>k__BackingField: 1
  <Description>k__BackingField: 
  <IsStackable>k__BackingField: 0
  Icon: {fileID: 21300000, guid: 013f8ec63c9c66f43b094b0bc9a7732c, type: 3}
  <Prefab>k__BackingField: {fileID: 0}
  MaxUsages: 10
  CurrentUsage: 10
  level: 1
