%YAML 1.1
%TAG !u! tag:unity3d.com,2011:
--- !u!114 &11400000
MonoBehaviour:
  m_ObjectHideFlags: 0
  m_CorrespondingSourceObject: {fileID: 0}
  m_PrefabInstance: {fileID: 0}
  m_PrefabAsset: {fileID: 0}
  m_GameObject: {fileID: 0}
  m_Enabled: 1
  m_EditorHideFlags: 0
  m_Script: {fileID: 11500000, guid: 6a5e65b8a5fe8cc4ba1d81ef155a5693, type: 3}
  m_Name: IronSword
  m_EditorClassIdentifier: 
  <ItemType>k__BackingField: 7
  <ItemID>k__BackingField: IronSword
  <ItemName>k__BackingField: Iron Sword
  <RarityType>k__BackingField: 1
  <BuyValue>k__BackingField: 1
  <IsSellable>k__BackingField: 1
  <SellValue>k__BackingField: 1
  <IsShippable>k__BackingField: 0
  <ShippingValue>k__BackingField: 1
  <Description>k__BackingField: A reliable and sturdy weapon crafted from iron, offering
    a balance of strength and practicality in the face of danger.
  <IsStackable>k__BackingField: 0
  Icon: {fileID: 21300000, guid: df734c1291f8f1943bae0d59d9877771, type: 3}
  <Prefab>k__BackingField: {fileID: 0}
  <VitalityRange>k__BackingField: {x: 0, y: 0}
  <StrengthRange>k__BackingField: {x: 3, y: 4}
  <IntelligenceRange>k__BackingField: {x: 2, y: 3}
  <DefenseRange>k__BackingField: {x: 0, y: 0}
  <SpeedRange>k__BackingField: {x: 0, y: 0}
