%YAML 1.1
%TAG !u! tag:unity3d.com,2011:
--- !u!114 &11400000
MonoBehaviour:
  m_ObjectHideFlags: 0
  m_CorrespondingSourceObject: {fileID: 0}
  m_PrefabInstance: {fileID: 0}
  m_PrefabAsset: {fileID: 0}
  m_GameObject: {fileID: 0}
  m_Enabled: 1
  m_EditorHideFlags: 0
  m_Script: {fileID: 11500000, guid: eec692d5aefb867429c8e7fa0755ab62, type: 3}
  m_Name: LapuLapuData
  m_EditorClassIdentifier: 
  <ItemType>k__BackingField: 3
  <ItemID>k__BackingField: LapuLapu
  <ItemName>k__BackingField: Lapu Lapu
  <RarityType>k__BackingField: 3
  <BuyValue>k__BackingField: 1
  <IsSellable>k__BackingField: 1
  <SellValue>k__BackingField: 1
  <IsShippable>k__BackingField: 1
  <ShippingValue>k__BackingField: 20
  <Description>k__BackingField: Heals the player when consumed.
  <IsStackable>k__BackingField: 1
  Icon: {fileID: 21300000, guid: c0c8806a115a8e94e8e17303a2dec7ff, type: 3}
  <Prefab>k__BackingField: {fileID: 0}
  <ConsumeEffect>k__BackingField: {fileID: 9094216179016219784, guid: fc4051ef73fbd2d49b3916d73e86030f,
    type: 3}
  <UseEffect>k__BackingField: {fileID: 0}
  <maxPossibleDropCount>k__BackingField: 1
  <encyclopediaInfo>k__BackingField:
    description: As red as the warrior blood of the fallen Great Datu of Mactan.
    sprite: {fileID: 21300000, guid: c0c8806a115a8e94e8e17303a2dec7ff, type: 3}
  quantityNeededCount: 5
