%YAML 1.1
%TAG !u! tag:unity3d.com,2011:
--- !u!114 &11400000
MonoBehaviour:
  m_ObjectHideFlags: 0
  m_CorrespondingSourceObject: {fileID: 0}
  m_PrefabInstance: {fileID: 0}
  m_PrefabAsset: {fileID: 0}
  m_GameObject: {fileID: 0}
  m_Enabled: 1
  m_EditorHideFlags: 0
  m_Script: {fileID: 11500000, guid: eec692d5aefb867429c8e7fa0755ab62, type: 3}
  m_Name: GarlicData
  m_EditorClassIdentifier: 
  <ItemType>k__BackingField: 3
  <ItemID>k__BackingField: Garlic
  <ItemName>k__BackingField: Garlic
  <RarityType>k__BackingField: 1
  <BuyValue>k__BackingField: 1
  <IsSellable>k__BackingField: 1
  <SellValue>k__BackingField: 1
  <IsShippable>k__BackingField: 1
  <ShippingValue>k__BackingField: 20
  <Description>k__BackingField: Temporarily enhances intelligence.
  <IsStackable>k__BackingField: 1
  Icon: {fileID: 21300000, guid: 5f6041ddc7bb44d4ba8eefc5713ca983, type: 3}
  <Prefab>k__BackingField: {fileID: 0}
  <ConsumeEffect>k__BackingField: {fileID: 3449303902966935494, guid: 1f753513dff3f374880316e93c3a1c7a,
    type: 3}
  <UseEffect>k__BackingField: {fileID: 0}
  <maxPossibleDropCount>k__BackingField: 1
  <encyclopediaInfo>k__BackingField:
    description: "Locally known as \u201CBawang\u201D. A crop that can easily sweeten
      and add flavor into many different dishes. Aside from being added into dishes,
      Garlics are also used to treat and prevent different ailments. In some cases
      there are stories that Garlics were once used to fend off demons and creatures
      of the night. Famous foods that include Potatoes as one of their ingredients
      are mostly used for Sinangag, a type of fried rice favored by many Filipinos."
    sprite: {fileID: 21300000, guid: 5f6041ddc7bb44d4ba8eefc5713ca983, type: 3}
  quantityNeededCount: 5
