%YAML 1.1
%TAG !u! tag:unity3d.com,2011:
--- !u!1 &2502360745357722756
GameObject:
  m_ObjectHideFlags: 0
  m_CorrespondingSourceObject: {fileID: 0}
  m_PrefabInstance: {fileID: 0}
  m_PrefabAsset: {fileID: 0}
  serializedVersion: 6
  m_Component:
  - component: {fileID: 4091789433996610113}
  - component: {fileID: 3449303902966935494}
  m_Layer: 0
  m_Name: BuffAtk25%_SE
  m_TagString: Untagged
  m_Icon: {fileID: 0}
  m_NavMeshLayer: 0
  m_StaticEditorFlags: 0
  m_IsActive: 1
--- !u!4 &4091789433996610113
Transform:
  m_ObjectHideFlags: 0
  m_CorrespondingSourceObject: {fileID: 0}
  m_PrefabInstance: {fileID: 0}
  m_PrefabAsset: {fileID: 0}
  m_GameObject: {fileID: 2502360745357722756}
  m_LocalRotation: {x: 0, y: 0, z: 0, w: 1}
  m_LocalPosition: {x: 0, y: 0, z: 0}
  m_LocalScale: {x: 1, y: 1, z: 1}
  m_ConstrainProportionsScale: 0
  m_Children: []
  m_Father: {fileID: 0}
  m_RootOrder: 0
  m_LocalEulerAnglesHint: {x: 0, y: 0, z: 0}
--- !u!114 &3449303902966935494
MonoBehaviour:
  m_ObjectHideFlags: 0
  m_CorrespondingSourceObject: {fileID: 0}
  m_PrefabInstance: {fileID: 0}
  m_PrefabAsset: {fileID: 0}
  m_GameObject: {fileID: 2502360745357722756}
  m_Enabled: 1
  m_EditorHideFlags: 0
  m_Script: {fileID: 11500000, guid: 53299b43b632d1440862af9247509504, type: 3}
  m_Name: 
  m_EditorClassIdentifier: 
  <ID>k__BackingField: 12
  <EffectName>k__BackingField: Bonus Defense
  <Description>k__BackingField: 
  <BattleText>k__BackingField: NAME's defense temporarily increased!
  <IsStackable>k__BackingField: 1
  <HasDamage>k__BackingField: 0
  <Damage>k__BackingField: 0
  <executionOrder>k__BackingField: 0
  <HasDuration>k__BackingField: 1
  <turnDuration>k__BackingField: 3
  <Icon>k__BackingField: {fileID: 1168542498, guid: 4bf42c92c79b0874f9bfe67fe6d80253,
    type: 3}
  <effectTags>k__BackingField: []
  IsBeforeTick: 1
  <vitalityMultiplier>k__BackingField: 0
  <strengthMultiplier>k__BackingField: 0.25
  <intelligenceMultiplier>k__BackingField: 0
  <defenseMultiplier>k__BackingField: 0
  <SpeedMultiplier>k__BackingField: 0
  VfxName: BuffAura
