%YAML 1.1
%TAG !u! tag:unity3d.com,2011:
--- !u!74 &7400000
AnimationClip:
  m_ObjectHideFlags: 0
  m_CorrespondingSourceObject: {fileID: 0}
  m_PrefabInstance: {fileID: 0}
  m_PrefabAsset: {fileID: 0}
  m_Name: Main Character-cast_Clip
  serializedVersion: 6
  m_Legacy: 0
  m_Compressed: 0
  m_UseHighQualityCurve: 1
  m_RotationCurves: []
  m_CompressedRotationCurves: []
  m_EulerCurves: []
  m_PositionCurves: []
  m_ScaleCurves: []
  m_FloatCurves: []
  m_PPtrCurves:
  - curve:
    - time: 0
      value: {fileID: -2923427270235120066, guid: 7a60c0f4a1204df4691c89ece9f5d268,
        type: 3}
    - time: 0.1
      value: {fileID: 1775096060897505830, guid: 7a60c0f4a1204df4691c89ece9f5d268,
        type: 3}
    - time: 0.3
      value: {fileID: -2245446242878794523, guid: 7a60c0f4a1204df4691c89ece9f5d268,
        type: 3}
    - time: 0.6
      value: {fileID: 7172488081813241347, guid: 7a60c0f4a1204df4691c89ece9f5d268,
        type: 3}
    - time: 0.9
      value: {fileID: 5045536544094725099, guid: 7a60c0f4a1204df4691c89ece9f5d268,
        type: 3}
    - time: 1.2
      value: {fileID: 5045536544094725099, guid: 7a60c0f4a1204df4691c89ece9f5d268,
        type: 3}
    attribute: m_Sprite
    path: 
    classID: 212
    script: {fileID: 0}
  m_SampleRate: 100
  m_WrapMode: 0
  m_Bounds:
    m_Center: {x: 0, y: 0, z: 0}
    m_Extent: {x: 0, y: 0, z: 0}
  m_ClipBindingConstant:
    genericBindings:
    - serializedVersion: 2
      path: 0
      attribute: 0
      script: {fileID: 0}
      typeID: 212
      customType: 23
      isPPtrCurve: 1
    pptrCurveMapping:
    - {fileID: -2923427270235120066, guid: 7a60c0f4a1204df4691c89ece9f5d268, type: 3}
    - {fileID: 1775096060897505830, guid: 7a60c0f4a1204df4691c89ece9f5d268, type: 3}
    - {fileID: -2245446242878794523, guid: 7a60c0f4a1204df4691c89ece9f5d268, type: 3}
    - {fileID: 7172488081813241347, guid: 7a60c0f4a1204df4691c89ece9f5d268, type: 3}
    - {fileID: 5045536544094725099, guid: 7a60c0f4a1204df4691c89ece9f5d268, type: 3}
    - {fileID: 5045536544094725099, guid: 7a60c0f4a1204df4691c89ece9f5d268, type: 3}
  m_AnimationClipSettings:
    serializedVersion: 2
    m_AdditiveReferencePoseClip: {fileID: 0}
    m_AdditiveReferencePoseTime: 0
    m_StartTime: 0
    m_StopTime: 1.21
    m_OrientationOffsetY: 0
    m_Level: 0
    m_CycleOffset: 0
    m_HasAdditiveReferencePose: 0
    m_LoopTime: 0
    m_LoopBlend: 0
    m_LoopBlendOrientation: 0
    m_LoopBlendPositionY: 0
    m_LoopBlendPositionXZ: 0
    m_KeepOriginalOrientation: 0
    m_KeepOriginalPositionY: 0
    m_KeepOriginalPositionXZ: 0
    m_HeightFromFeet: 0
    m_Mirror: 0
  m_EditorCurves: []
  m_EulerEditorCurves: []
  m_HasGenericRootTransform: 0
  m_HasMotionFloatCurves: 0
  m_Events:
  - time: 1.21
    functionName: TriggerEvent
    data: AnimEnd
    objectReferenceParameter: {fileID: 0}
    floatParameter: 0
    intParameter: 0
    messageOptions: 0
