%YAML 1.1
%TAG !u! tag:unity3d.com,2011:
--- !u!1 &1483197804726629199
GameObject:
  m_ObjectHideFlags: 0
  m_CorrespondingSourceObject: {fileID: 0}
  m_PrefabInstance: {fileID: 0}
  m_PrefabAsset: {fileID: 0}
  serializedVersion: 6
  m_Component:
  - component: {fileID: 4314709711027008330}
  - component: {fileID: 7799611687151308976}
  m_Layer: 0
  m_Name: Confuse
  m_TagString: Untagged
  m_Icon: {fileID: 0}
  m_NavMeshLayer: 0
  m_StaticEditorFlags: 0
  m_IsActive: 1
--- !u!4 &4314709711027008330
Transform:
  m_ObjectHideFlags: 0
  m_CorrespondingSourceObject: {fileID: 0}
  m_PrefabInstance: {fileID: 0}
  m_PrefabAsset: {fileID: 0}
  m_GameObject: {fileID: 1483197804726629199}
  m_LocalRotation: {x: 0, y: 0, z: 0, w: 1}
  m_LocalPosition: {x: 0, y: 0, z: 0}
  m_LocalScale: {x: 1, y: 1, z: 1}
  m_ConstrainProportionsScale: 0
  m_Children: []
  m_Father: {fileID: 0}
  m_RootOrder: 0
  m_LocalEulerAnglesHint: {x: 0, y: 0, z: 0}
--- !u!114 &7799611687151308976
MonoBehaviour:
  m_ObjectHideFlags: 0
  m_CorrespondingSourceObject: {fileID: 0}
  m_PrefabInstance: {fileID: 0}
  m_PrefabAsset: {fileID: 0}
  m_GameObject: {fileID: 1483197804726629199}
  m_Enabled: 1
  m_EditorHideFlags: 0
  m_Script: {fileID: 11500000, guid: e175aeb6e66e2e7468aedde751e81821, type: 3}
  m_Name: 
  m_EditorClassIdentifier: 
  <ID>k__BackingField: 9
  <EffectName>k__BackingField: Confuse
  <Description>k__BackingField: 
  <BattleText>k__BackingField: NAME is still confused for # turn(s)!
  <IsStackable>k__BackingField: 1
  <HasDamage>k__BackingField: 0
  <Damage>k__BackingField: 0
  <executionOrder>k__BackingField: 99999
  <HasDuration>k__BackingField: 1
  <turnDuration>k__BackingField: 3
  <Icon>k__BackingField: {fileID: 1816310002, guid: 5e941850eb7177f48bfb0f80b6a2c439,
    type: 3}
  <effectTags>k__BackingField: []
  vfxName: ZAura
