%YAML 1.1
%TAG !u! tag:unity3d.com,2011:
--- !u!114 &11400000
MonoBehaviour:
  m_ObjectHideFlags: 0
  m_CorrespondingSourceObject: {fileID: 0}
  m_PrefabInstance: {fileID: 0}
  m_PrefabAsset: {fileID: 0}
  m_GameObject: {fileID: 0}
  m_Enabled: 1
  m_EditorHideFlags: 0
  m_Script: {fileID: 11500000, guid: eec692d5aefb867429c8e7fa0755ab62, type: 3}
  m_Name: CornData
  m_EditorClassIdentifier: 
  <ItemType>k__BackingField: 3
  <ItemID>k__BackingField: Corn
  <ItemName>k__BackingField: Corn
  <RarityType>k__BackingField: 1
  <BuyValue>k__BackingField: 1
  <IsSellable>k__BackingField: 1
  <SellValue>k__BackingField: 1
  <IsShippable>k__BackingField: 1
  <ShippingValue>k__BackingField: 20
  <Description>k__BackingField: Restores mana when consumed.
  <IsStackable>k__BackingField: 1
  Icon: {fileID: 21300000, guid: b3b3054d9e8f16842b9ab6860039743a, type: 3}
  <Prefab>k__BackingField: {fileID: 0}
  <ConsumeEffect>k__BackingField: {fileID: 9094216179016219784, guid: fb393f0203b2bd446bd12abab9f88bc9,
    type: 3}
  <UseEffect>k__BackingField: {fileID: 0}
  <maxPossibleDropCount>k__BackingField: 1
  <encyclopediaInfo>k__BackingField:
    description: "Locally known as \u201CMais\u201D. The second most important crop
      in the Philippines, yellow corn is mostly used as feed for livestock while
      white corn is used as an alternative to rice. Corn can also be processed into 
      cornstarch, Corn Syrup, gluten and used in different recipes. Famous foods
      that include corn as one of their ingredients are Binatog, Mais con yelo and 
      Suam na Mais to name a few."
    sprite: {fileID: 21300000, guid: b3b3054d9e8f16842b9ab6860039743a, type: 3}
  quantityNeededCount: 5
