%YAML 1.1
%TAG !u! tag:unity3d.com,2011:
--- !u!114 &11400000
MonoBehaviour:
  m_ObjectHideFlags: 0
  m_CorrespondingSourceObject: {fileID: 0}
  m_PrefabInstance: {fileID: 0}
  m_PrefabAsset: {fileID: 0}
  m_GameObject: {fileID: 0}
  m_Enabled: 1
  m_EditorHideFlags: 0
  m_Script: {fileID: 11500000, guid: 44c94790103cb03459a5851adafae5e4, type: 3}
  m_Name: ItemDatabase
  m_EditorClassIdentifier: 
  <GoldItemData>k__BackingField: {fileID: 11400000, guid: 362d2e6e08f9f094bb9873e5f969f192,
    type: 2}
  <ItemDataDictionary>k__BackingField:
    _serializedList:
    - Key: Carrot
      Value: {fileID: 11400000, guid: e88b3c2ffdb5fca4380a54db620ffbea, type: 2}
    - Key: carrotSeed
      Value: {fileID: 11400000, guid: 7aec536cc3c3b384fb6e9b7847a3fbf8, type: 2}
    - Key: Corn
      Value: {fileID: 11400000, guid: fe963237b4eed3942938ed8eb390b092, type: 2}
    - Key: cornSeed
      Value: {fileID: 11400000, guid: c08935882abf3b14caea83b8174879e3, type: 2}
    - Key: Garlic
      Value: {fileID: 11400000, guid: c97a57fdab5796f4d828ec343fea8209, type: 2}
    - Key: GarlicSeed
      Value: {fileID: 11400000, guid: 14274afb37a409041ae78845e893ad21, type: 2}
    - Key: Onion
      Value: {fileID: 11400000, guid: 22ff84e7baf5e2e4da61a6f130da3146, type: 2}
    - Key: onionSeed
      Value: {fileID: 11400000, guid: 1ccd76fe8e75f134eaca68b5c4069fb9, type: 2}
    - Key: Potato
      Value: {fileID: 11400000, guid: 788ffcb08f4d6ae40821a15240eec986, type: 2}
    - Key: potatoSeed
      Value: {fileID: 11400000, guid: 2f9170227bb86224cb25fa2da170e60f, type: 2}
    - Key: BellPepper
      Value: {fileID: 11400000, guid: 0f63c29eef6fb474e83541b65ef148e4, type: 2}
    - Key: Bell Pepper Seed
      Value: {fileID: 11400000, guid: 3ef7149958e75424fa1427956a1e4259, type: 2}
    - Key: Tomato
      Value: {fileID: 11400000, guid: 0a48213de1033c34da73f7dc8c1389b0, type: 2}
    - Key: tomatoSeed
      Value: {fileID: 11400000, guid: 66870a666710fa54aa83b64479a135c5, type: 2}
    - Key: WildChili
      Value: {fileID: 11400000, guid: f06a69f6cd747c141ba7e5753ef4d48e, type: 2}
    - Key: wildChiliSeed
      Value: {fileID: 11400000, guid: 657be2e4709e83c42bd02cd8d9fc09d6, type: 2}
    - Key: BlessedArmor
      Value: {fileID: 11400000, guid: a019f0b294e762b4285ea546e3d0077e, type: 2}
    - Key: FarmersClothes
      Value: {fileID: 11400000, guid: 004ea5c2fe93d494ba69efc34ea86818, type: 2}
    - Key: GoldArmor
      Value: {fileID: 11400000, guid: 4e987d95376e8cf4f8cd4193a18041cc, type: 2}
    - Key: IronArmor
      Value: {fileID: 11400000, guid: 232c886689e560a4994fca11eac1a42b, type: 2}
    - Key: LeatherArmor
      Value: {fileID: 11400000, guid: 0ff9d82d4e6465b42829a6f4f572f8ab, type: 2}
    - Key: RustyIronArmor
      Value: {fileID: 11400000, guid: 53dc2fe1e64f87a4e8e8961add4c37a9, type: 2}
    - Key: BlessedSword
      Value: {fileID: 11400000, guid: f78cb74c44c879a4e9ca30cf0b641386, type: 2}
    - Key: GoldSword
      Value: {fileID: 11400000, guid: 16da50d2a2750f0488f03c8963c98323, type: 2}
    - Key: IronSword
      Value: {fileID: 11400000, guid: e7a935bf30ecdce4db890b7de929e839, type: 2}
    - Key: RustedSword
      Value: {fileID: 11400000, guid: 3cf7935cb92dcc341bee9dbd24398f70, type: 2}
    - Key: StickWeapon
      Value: {fileID: 11400000, guid: a07fb1f81f2f37047a65917abef3a85b, type: 2}
    - Key: WoodenSword
      Value: {fileID: 11400000, guid: 8d6135eadf32087439ca9df46b04d714, type: 2}
    - Key: Bangus
      Value: {fileID: 11400000, guid: 4c8d67542a046b44aa8eec6b14b9ff15, type: 2}
    - Key: BlobFish
      Value: {fileID: 11400000, guid: d8de5e97c69affe4ea453fe73853ae8a, type: 2}
    - Key: Dilis
      Value: {fileID: 11400000, guid: 614a1725ec4df564fac65f1d2aca043b, type: 2}
    - Key: Galunggong
      Value: {fileID: 11400000, guid: 621e79e3be8b0794b99ad691089ecd4d, type: 2}
    - Key: LapuLapu
      Value: {fileID: 11400000, guid: 6d7d3a24f6e8d5a409d451d4aab57312, type: 2}
    - Key: MayaMaya
      Value: {fileID: 11400000, guid: 02974dc67cf94704a9e6266d7890e852, type: 2}
    - Key: Tawilis
      Value: {fileID: 11400000, guid: 5e07a87383eb7664b94c988438e0303f, type: 2}
    - Key: Tilapia
      Value: {fileID: 11400000, guid: 50a4530f93e448c47afccc2e351ffcd0, type: 2}
    - Key: DungeonExplosives
      Value: {fileID: 11400000, guid: f96f8944acc4ec84c9e96b40ab8fea09, type: 2}
    - Key: DungeonKey
      Value: {fileID: 11400000, guid: 6f316566b6358d749a2d0d5685cd1f21, type: 2}
    - Key: DungeonRope
      Value: {fileID: 11400000, guid: dff37d99e39c428409f472721d893868, type: 2}
    - Key: FishingPoleTool
      Value: {fileID: 11400000, guid: 562b278c3caa5e44ca80990c67c983db, type: 2}
    - Key: IronFishingPoleTool
      Value: {fileID: 11400000, guid: 86636eca58c4cd44aa05050eab99b4f1, type: 2}
    - Key: RefinedFishingPoleTool
      Value: {fileID: 11400000, guid: 3eb15372707c6b74dab2325f28521cec, type: 2}
    - Key: GoldItem
      Value: {fileID: 11400000, guid: 362d2e6e08f9f094bb9873e5f969f192, type: 2}
    - Key: GoldHoeTool
      Value: {fileID: 11400000, guid: 47f717fa9027e59439e9d9abdd5c49d7, type: 2}
    - Key: IronHoeTool
      Value: {fileID: 11400000, guid: c7b49957cbb86d540bad2e85df456258, type: 2}
    - Key: RustyHoeTool
      Value: {fileID: 11400000, guid: edf6a17c74fa7ed4ca859c9914a8a25c, type: 2}
    - Key: GoldWateringCanData
      Value: {fileID: 11400000, guid: ff952ebb1fadae64aaf8f60367f85aad, type: 2}
    - Key: IronWateringCanData
      Value: {fileID: 11400000, guid: 96a771746a7e3d24396a7070d83b76b3, type: 2}
    - Key: RustyWateringCanTool
      Value: {fileID: 11400000, guid: dc9d84328ef113347a89e0b1a23804a2, type: 2}
  <ItemDataByType>k__BackingField:
    _serializedList:
    - Key: 3
      Value:
      - {fileID: 11400000, guid: e88b3c2ffdb5fca4380a54db620ffbea, type: 2}
      - {fileID: 11400000, guid: fe963237b4eed3942938ed8eb390b092, type: 2}
      - {fileID: 11400000, guid: c97a57fdab5796f4d828ec343fea8209, type: 2}
      - {fileID: 11400000, guid: 22ff84e7baf5e2e4da61a6f130da3146, type: 2}
      - {fileID: 11400000, guid: 788ffcb08f4d6ae40821a15240eec986, type: 2}
      - {fileID: 11400000, guid: 0f63c29eef6fb474e83541b65ef148e4, type: 2}
      - {fileID: 11400000, guid: 0a48213de1033c34da73f7dc8c1389b0, type: 2}
      - {fileID: 11400000, guid: f06a69f6cd747c141ba7e5753ef4d48e, type: 2}
      - {fileID: 11400000, guid: 4c8d67542a046b44aa8eec6b14b9ff15, type: 2}
      - {fileID: 11400000, guid: d8de5e97c69affe4ea453fe73853ae8a, type: 2}
      - {fileID: 11400000, guid: 614a1725ec4df564fac65f1d2aca043b, type: 2}
      - {fileID: 11400000, guid: 621e79e3be8b0794b99ad691089ecd4d, type: 2}
      - {fileID: 11400000, guid: 6d7d3a24f6e8d5a409d451d4aab57312, type: 2}
      - {fileID: 11400000, guid: 02974dc67cf94704a9e6266d7890e852, type: 2}
      - {fileID: 11400000, guid: 5e07a87383eb7664b94c988438e0303f, type: 2}
      - {fileID: 11400000, guid: 50a4530f93e448c47afccc2e351ffcd0, type: 2}
    - Key: 2
      Value:
      - {fileID: 11400000, guid: 7aec536cc3c3b384fb6e9b7847a3fbf8, type: 2}
      - {fileID: 11400000, guid: c08935882abf3b14caea83b8174879e3, type: 2}
      - {fileID: 11400000, guid: 14274afb37a409041ae78845e893ad21, type: 2}
      - {fileID: 11400000, guid: 1ccd76fe8e75f134eaca68b5c4069fb9, type: 2}
      - {fileID: 11400000, guid: 2f9170227bb86224cb25fa2da170e60f, type: 2}
      - {fileID: 11400000, guid: 3ef7149958e75424fa1427956a1e4259, type: 2}
      - {fileID: 11400000, guid: 66870a666710fa54aa83b64479a135c5, type: 2}
      - {fileID: 11400000, guid: 657be2e4709e83c42bd02cd8d9fc09d6, type: 2}
    - Key: 6
      Value:
      - {fileID: 11400000, guid: a019f0b294e762b4285ea546e3d0077e, type: 2}
      - {fileID: 11400000, guid: 004ea5c2fe93d494ba69efc34ea86818, type: 2}
      - {fileID: 11400000, guid: 4e987d95376e8cf4f8cd4193a18041cc, type: 2}
      - {fileID: 11400000, guid: 232c886689e560a4994fca11eac1a42b, type: 2}
      - {fileID: 11400000, guid: 0ff9d82d4e6465b42829a6f4f572f8ab, type: 2}
      - {fileID: 11400000, guid: 53dc2fe1e64f87a4e8e8961add4c37a9, type: 2}
    - Key: 7
      Value:
      - {fileID: 11400000, guid: fec94f0233e9d95498e26ae0efe96d87, type: 2}
      - {fileID: 11400000, guid: 16da50d2a2750f0488f03c8963c98323, type: 2}
      - {fileID: 11400000, guid: e7a935bf30ecdce4db890b7de929e839, type: 2}
      - {fileID: 11400000, guid: 3cf7935cb92dcc341bee9dbd24398f70, type: 2}
      - {fileID: 11400000, guid: a07fb1f81f2f37047a65917abef3a85b, type: 2}
      - {fileID: 11400000, guid: 8d6135eadf32087439ca9df46b04d714, type: 2}
    - Key: 4
      Value:
      - {fileID: 11400000, guid: f96f8944acc4ec84c9e96b40ab8fea09, type: 2}
      - {fileID: 11400000, guid: 6f316566b6358d749a2d0d5685cd1f21, type: 2}
      - {fileID: 11400000, guid: dff37d99e39c428409f472721d893868, type: 2}
    - Key: 5
      Value:
      - {fileID: 11400000, guid: 562b278c3caa5e44ca80990c67c983db, type: 2}
      - {fileID: 11400000, guid: 86636eca58c4cd44aa05050eab99b4f1, type: 2}
      - {fileID: 11400000, guid: 3eb15372707c6b74dab2325f28521cec, type: 2}
      - {fileID: 11400000, guid: 47f717fa9027e59439e9d9abdd5c49d7, type: 2}
      - {fileID: 11400000, guid: c7b49957cbb86d540bad2e85df456258, type: 2}
      - {fileID: 11400000, guid: edf6a17c74fa7ed4ca859c9914a8a25c, type: 2}
      - {fileID: 11400000, guid: ff952ebb1fadae64aaf8f60367f85aad, type: 2}
      - {fileID: 11400000, guid: 96a771746a7e3d24396a7070d83b76b3, type: 2}
      - {fileID: 11400000, guid: dc9d84328ef113347a89e0b1a23804a2, type: 2}
    - Key: 1
      Value:
      - {fileID: 11400000, guid: 362d2e6e08f9f094bb9873e5f969f192, type: 2}
  <RarityColorDictionary>k__BackingField:
    _serializedList:
    - Key: 1
      Value: {r: 1, g: 1, b: 1, a: 1}
    - Key: 2
      Value: {r: 0.495283, g: 0.7224058, b: 1, a: 1}
    - Key: 3
      Value: {r: 1, g: 0.4481132, b: 0.48218033, a: 1}
    - Key: 4
      Value: {r: 1, g: 0.41037738, b: 0.9865996, a: 1}
  <RarityModiferValue>k__BackingField:
    _serializedList:
    - Key: 1
      Value: 1
    - Key: 2
      Value: 1.15
    - Key: 3
      Value: 1.3
    - Key: 4
      Value: 1.5
  <RarityChanceMinMaxValue>k__BackingField:
    _serializedList:
    - Key: 1
      Value: {x: 3, y: 3}
    - Key: 2
      Value: {x: 0.5, y: 4}
    - Key: 3
      Value: {x: 0.1, y: 4}
    - Key: 4
      Value: {x: 0.01, y: 3}
  <RarityChanceCurve>k__BackingField:
    _serializedList:
    - Key: 1
      Value:
        serializedVersion: 2
        m_Curve:
        - serializedVersion: 3
          time: 0
          value: 1
          inSlope: 0
          outSlope: 0
          tangentMode: 34
          weightedMode: 0
          inWeight: 0
          outWeight: 0
        - serializedVersion: 3
          time: 1
          value: 1
          inSlope: 0
          outSlope: 0
          tangentMode: 34
          weightedMode: 0
          inWeight: 0
          outWeight: 0
        m_PreInfinity: 2
        m_PostInfinity: 2
        m_RotationOrder: 4
    - Key: 2
      Value:
        serializedVersion: 2
        m_Curve:
        - serializedVersion: 3
          time: 0
          value: 0
          inSlope: 0
          outSlope: 0
          tangentMode: 0
          weightedMode: 0
          inWeight: 0
          outWeight: 0
        - serializedVersion: 3
          time: 1
          value: 1
          inSlope: 2
          outSlope: 2
          tangentMode: 0
          weightedMode: 0
          inWeight: 0
          outWeight: 0
        m_PreInfinity: 2
        m_PostInfinity: 2
        m_RotationOrder: 4
    - Key: 3
      Value:
        serializedVersion: 2
        m_Curve:
        - serializedVersion: 3
          time: 0
          value: 0.001159668
          inSlope: Infinity
          outSlope: Infinity
          tangentMode: 103
          weightedMode: 0
          inWeight: 0.33333334
          outWeight: 0.33333334
        - serializedVersion: 3
          time: 0.3
          value: 0.05
          inSlope: Infinity
          outSlope: 0
          tangentMode: 7
          weightedMode: 0
          inWeight: 0.33333334
          outWeight: 0.33333334
        - serializedVersion: 3
          time: 0.7
          value: 0.7
          inSlope: 1.625
          outSlope: 1
          tangentMode: 69
          weightedMode: 0
          inWeight: 0.33333334
          outWeight: 0.33333334
        - serializedVersion: 3
          time: 1
          value: 1
          inSlope: 1
          outSlope: 3.5088668
          tangentMode: 69
          weightedMode: 0
          inWeight: 0.014809012
          outWeight: 0
        m_PreInfinity: 2
        m_PostInfinity: 2
        m_RotationOrder: 4
    - Key: 4
      Value:
        serializedVersion: 2
        m_Curve:
        - serializedVersion: 3
          time: 0
          value: 0
          inSlope: 0
          outSlope: 0
          tangentMode: 65
          weightedMode: 0
          inWeight: 0
          outWeight: 0
        - serializedVersion: 3
          time: 0.5
          value: 0
          inSlope: -0
          outSlope: 0.088030875
          tangentMode: 5
          weightedMode: 0
          inWeight: 0.33333334
          outWeight: 0.33333334
        - serializedVersion: 3
          time: 0.80073243
          value: 0.8
          inSlope: 86.15937
          outSlope: 1.0036756
          tangentMode: 65
          weightedMode: 1
          inWeight: 0.008655715
          outWeight: 0.33333334
        - serializedVersion: 3
          time: 1
          value: 1
          inSlope: 1.0036756
          outSlope: 4.4497027
          tangentMode: 69
          weightedMode: 0
          inWeight: 0.021823883
          outWeight: 0
        m_PreInfinity: 2
        m_PostInfinity: 2
        m_RotationOrder: 4
  <RarityChance>k__BackingField:
    _serializedList:
    - Key: 1
      Value:
        itemDictionary:
          _serializedList:
          - Key: 1
            Value: 3
          - Key: 2
            Value: 0.545
          - Key: 3
            Value: 0.104522705
          - Key: 4
            Value: 0.01
    - Key: 2
      Value:
        itemDictionary:
          _serializedList:
          - Key: 1
            Value: 3
          - Key: 2
            Value: 0.68
          - Key: 3
            Value: 0.104522705
          - Key: 4
            Value: 0.01
    - Key: 3
      Value:
        itemDictionary:
          _serializedList:
          - Key: 1
            Value: 3
          - Key: 2
            Value: 0.90500003
          - Key: 3
            Value: 0.29500002
          - Key: 4
            Value: 0.01
    - Key: 4
      Value:
        itemDictionary:
          _serializedList:
          - Key: 1
            Value: 3
          - Key: 2
            Value: 1.22
          - Key: 3
            Value: 0.33266693
          - Key: 4
            Value: 0.01
    - Key: 5
      Value:
        itemDictionary:
          _serializedList:
          - Key: 1
            Value: 3
          - Key: 2
            Value: 1.625
          - Key: 3
            Value: 0.47096458
          - Key: 4
            Value: 0.01
    - Key: 6
      Value:
        itemDictionary:
          _serializedList:
          - Key: 1
            Value: 3
          - Key: 2
            Value: 2.1200001
          - Key: 3
            Value: 0.7478384
          - Key: 4
            Value: 0.067273736
    - Key: 7
      Value:
        itemDictionary:
          _serializedList:
          - Key: 1
            Value: 3
          - Key: 2
            Value: 2.705
          - Key: 3
            Value: 1.2012331
          - Key: 4
            Value: 0.22568122
    - Key: 8
      Value:
        itemDictionary:
          _serializedList:
          - Key: 1
            Value: 3
          - Key: 2
            Value: 3.38
          - Key: 3
            Value: 1.8690951
          - Key: 4
            Value: 0.50445193
    - Key: 9
      Value:
        itemDictionary:
          _serializedList:
          - Key: 1
            Value: 3
          - Key: 2
            Value: 4.1449995
          - Key: 3
            Value: 2.7893682
          - Key: 4
            Value: 0.9228149
    - Key: 10
      Value:
        itemDictionary:
          _serializedList:
          - Key: 1
            Value: 3
          - Key: 2
            Value: 5
          - Key: 3
            Value: 4
          - Key: 4
            Value: 1.5
