%YAML 1.1
%TAG !u! tag:unity3d.com,2011:
--- !u!114 &11400000
MonoBehaviour:
  m_ObjectHideFlags: 0
  m_CorrespondingSourceObject: {fileID: 0}
  m_PrefabInstance: {fileID: 0}
  m_PrefabAsset: {fileID: 0}
  m_GameObject: {fileID: 0}
  m_Enabled: 1
  m_EditorHideFlags: 0
  m_Script: {fileID: 11500000, guid: 60726e7d135f43959da2bf759a8b5581, type: 3}
  m_Name: EnemyDataBase
  m_EditorClassIdentifier: 
  <enemyDataDictionary>k__BackingField:
    _serializedList:
    - Key: Mananaggal
      Value: {fileID: 11400000, guid: 31b7375ccf8a2f64b96c3c2a27cbf230, type: 2}
    - Key: Nuno Sa Punso
      Value: {fileID: 11400000, guid: a4f70bc4263a22c4594b7e6c5f3bbfb6, type: 2}
    - Key: Tikbalang
      Value: {fileID: 11400000, guid: 8239561e51efd0c44bcd4354b1332356, type: 2}
    - Key: Tiyanak
      Value: {fileID: 11400000, guid: f903eff50493b7341ab439f784553767, type: 2}
    - Key: Kapre
      Value: {fileID: 11400000, guid: 7e231ae49f76702419acf874bacaf433, type: 2}
  <enemySpawnRate>k__BackingField:
    serializedVersion: 2
    m_Curve:
    - serializedVersion: 3
      time: 0
      value: 0.85
      inSlope: 0
      outSlope: 0
      tangentMode: 0
      weightedMode: 0
      inWeight: 0
      outWeight: 0
    - serializedVersion: 3
      time: 0.3
      value: 0.8
      inSlope: 0.08511607
      outSlope: 0.08511607
      tangentMode: 0
      weightedMode: 0
      inWeight: 0.33333334
      outWeight: 0.33333334
    - serializedVersion: 3
      time: 0.5
      value: 0.7
      inSlope: 0.09704704
      outSlope: 0.09704704
      tangentMode: 0
      weightedMode: 0
      inWeight: 0.33333334
      outWeight: 0.33333334
    - serializedVersion: 3
      time: 0.55
      value: 0
      inSlope: 0
      outSlope: 0
      tangentMode: 136
      weightedMode: 0
      inWeight: 0.33333334
      outWeight: 0.33333334
    - serializedVersion: 3
      time: 1.1
      value: 0
      inSlope: 0
      outSlope: 0
      tangentMode: 136
      weightedMode: 0
      inWeight: 0.33333334
      outWeight: 0.33333334
    - serializedVersion: 3
      time: 1.2
      value: 0.02
      inSlope: 0.34230557
      outSlope: 0.34230557
      tangentMode: 0
      weightedMode: 0
      inWeight: 0.33333334
      outWeight: 0.33333334
    - serializedVersion: 3
      time: 1.35
      value: 0.1
      inSlope: 0.7384819
      outSlope: 0.7384819
      tangentMode: 0
      weightedMode: 0
      inWeight: 0.33333334
      outWeight: 0.33333334
    - serializedVersion: 3
      time: 1.5
      value: 0.15
      inSlope: 0.22222225
      outSlope: 0.22222225
      tangentMode: 136
      weightedMode: 0
      inWeight: 0.33333334
      outWeight: 0.33333334
    - serializedVersion: 3
      time: 1.8
      value: 0.2
      inSlope: 0.4285714
      outSlope: 0.4285714
      tangentMode: 136
      weightedMode: 0
      inWeight: 0.33333334
      outWeight: 0.33333334
    - serializedVersion: 3
      time: 1.85
      value: 0.3
      inSlope: 1.5057122
      outSlope: 1.5057122
      tangentMode: 0
      weightedMode: 0
      inWeight: 0.33333334
      outWeight: 0.33333334
    - serializedVersion: 3
      time: 1.9
      value: 0.5
      inSlope: 1.5964699
      outSlope: 1.5964699
      tangentMode: 0
      weightedMode: 0
      inWeight: 0.33333334
      outWeight: 0.33333334
    - serializedVersion: 3
      time: 2.4
      value: 0.8
      inSlope: 0
      outSlope: 0
      tangentMode: 0
      weightedMode: 0
      inWeight: 0
      outWeight: 0
    m_PreInfinity: 2
    m_PostInfinity: 2
    m_RotationOrder: 4
  <enemyKillsStats>k__BackingField:
    _serializedList: []
