%YAML 1.1
%TAG !u! tag:unity3d.com,2011:
--- !u!74 &7400000
AnimationClip:
  m_ObjectHideFlags: 0
  m_CorrespondingSourceObject: {fileID: 0}
  m_PrefabInstance: {fileID: 0}
  m_PrefabAsset: {fileID: 0}
  m_Name: Tina_Idle
  serializedVersion: 6
  m_Legacy: 0
  m_Compressed: 0
  m_UseHighQualityCurve: 1
  m_RotationCurves: []
  m_CompressedRotationCurves: []
  m_EulerCurves: []
  m_PositionCurves: []
  m_ScaleCurves: []
  m_FloatCurves: []
  m_PPtrCurves:
  - curve:
    - time: 0
      value: {fileID: 28367369, guid: dcd006df8b59ccd41aee7234e5307f04, type: 3}
    - time: 0.13333334
      value: {fileID: 459408296, guid: dcd006df8b59ccd41aee7234e5307f04, type: 3}
    - time: 0.26666668
      value: {fileID: 721357067, guid: dcd006df8b59ccd41aee7234e5307f04, type: 3}
    - time: 0.33333334
      value: {fileID: 222396490, guid: dcd006df8b59ccd41aee7234e5307f04, type: 3}
    - time: 0.46666667
      value: {fileID: -18273209, guid: dcd006df8b59ccd41aee7234e5307f04, type: 3}
    - time: 0.6
      value: {fileID: -273690672, guid: dcd006df8b59ccd41aee7234e5307f04, type: 3}
    - time: 0.73333335
      value: {fileID: -1478269944, guid: dcd006df8b59ccd41aee7234e5307f04, type: 3}
    - time: 0.8
      value: {fileID: -753667130, guid: dcd006df8b59ccd41aee7234e5307f04, type: 3}
    - time: 0.93333334
      value: {fileID: -116058118, guid: dcd006df8b59ccd41aee7234e5307f04, type: 3}
    - time: 1.0666667
      value: {fileID: -755139257, guid: dcd006df8b59ccd41aee7234e5307f04, type: 3}
    - time: 1.2
      value: {fileID: 574937050, guid: dcd006df8b59ccd41aee7234e5307f04, type: 3}
    - time: 1.2666667
      value: {fileID: -571886317, guid: dcd006df8b59ccd41aee7234e5307f04, type: 3}
    - time: 1.4
      value: {fileID: -1404769588, guid: dcd006df8b59ccd41aee7234e5307f04, type: 3}
    - time: 1.5333333
      value: {fileID: 618921592, guid: dcd006df8b59ccd41aee7234e5307f04, type: 3}
    - time: 1.6666666
      value: {fileID: 1469057900, guid: dcd006df8b59ccd41aee7234e5307f04, type: 3}
    - time: 1.7333333
      value: {fileID: -2038446189, guid: dcd006df8b59ccd41aee7234e5307f04, type: 3}
    - time: 1.8666667
      value: {fileID: 1375167581, guid: dcd006df8b59ccd41aee7234e5307f04, type: 3}
    - time: 2
      value: {fileID: -287943144, guid: dcd006df8b59ccd41aee7234e5307f04, type: 3}
    attribute: m_Sprite
    path: Model
    classID: 212
    script: {fileID: 0}
  m_SampleRate: 60
  m_WrapMode: 0
  m_Bounds:
    m_Center: {x: 0, y: 0, z: 0}
    m_Extent: {x: 0, y: 0, z: 0}
  m_ClipBindingConstant:
    genericBindings:
    - serializedVersion: 2
      path: 374627805
      attribute: 0
      script: {fileID: 0}
      typeID: 212
      customType: 23
      isPPtrCurve: 1
    pptrCurveMapping:
    - {fileID: 28367369, guid: dcd006df8b59ccd41aee7234e5307f04, type: 3}
    - {fileID: 459408296, guid: dcd006df8b59ccd41aee7234e5307f04, type: 3}
    - {fileID: 721357067, guid: dcd006df8b59ccd41aee7234e5307f04, type: 3}
    - {fileID: 222396490, guid: dcd006df8b59ccd41aee7234e5307f04, type: 3}
    - {fileID: -18273209, guid: dcd006df8b59ccd41aee7234e5307f04, type: 3}
    - {fileID: -273690672, guid: dcd006df8b59ccd41aee7234e5307f04, type: 3}
    - {fileID: -1478269944, guid: dcd006df8b59ccd41aee7234e5307f04, type: 3}
    - {fileID: -753667130, guid: dcd006df8b59ccd41aee7234e5307f04, type: 3}
    - {fileID: -116058118, guid: dcd006df8b59ccd41aee7234e5307f04, type: 3}
    - {fileID: -755139257, guid: dcd006df8b59ccd41aee7234e5307f04, type: 3}
    - {fileID: 574937050, guid: dcd006df8b59ccd41aee7234e5307f04, type: 3}
    - {fileID: -571886317, guid: dcd006df8b59ccd41aee7234e5307f04, type: 3}
    - {fileID: -1404769588, guid: dcd006df8b59ccd41aee7234e5307f04, type: 3}
    - {fileID: 618921592, guid: dcd006df8b59ccd41aee7234e5307f04, type: 3}
    - {fileID: 1469057900, guid: dcd006df8b59ccd41aee7234e5307f04, type: 3}
    - {fileID: -2038446189, guid: dcd006df8b59ccd41aee7234e5307f04, type: 3}
    - {fileID: 1375167581, guid: dcd006df8b59ccd41aee7234e5307f04, type: 3}
    - {fileID: -287943144, guid: dcd006df8b59ccd41aee7234e5307f04, type: 3}
  m_AnimationClipSettings:
    serializedVersion: 2
    m_AdditiveReferencePoseClip: {fileID: 0}
    m_AdditiveReferencePoseTime: 0
    m_StartTime: 0
    m_StopTime: 2.0166667
    m_OrientationOffsetY: 0
    m_Level: 0
    m_CycleOffset: 0
    m_HasAdditiveReferencePose: 0
    m_LoopTime: 1
    m_LoopBlend: 0
    m_LoopBlendOrientation: 0
    m_LoopBlendPositionY: 0
    m_LoopBlendPositionXZ: 0
    m_KeepOriginalOrientation: 0
    m_KeepOriginalPositionY: 1
    m_KeepOriginalPositionXZ: 0
    m_HeightFromFeet: 0
    m_Mirror: 0
  m_EditorCurves: []
  m_EulerEditorCurves: []
  m_HasGenericRootTransform: 0
  m_HasMotionFloatCurves: 0
  m_Events: []
