%YAML 1.1
%TAG !u! tag:unity3d.com,2011:
--- !u!1 &53003467914115796
GameObject:
  m_ObjectHideFlags: 0
  m_CorrespondingSourceObject: {fileID: 0}
  m_PrefabInstance: {fileID: 0}
  m_PrefabAsset: {fileID: 0}
  serializedVersion: 6
  m_Component:
  - component: {fileID: 53003467914115799}
  - component: {fileID: 53003467914115798}
  m_Layer: 0
  m_Name: PopUpUIPool
  m_TagString: Untagged
  m_Icon: {fileID: 0}
  m_NavMeshLayer: 0
  m_StaticEditorFlags: 0
  m_IsActive: 1
--- !u!4 &53003467914115799
Transform:
  m_ObjectHideFlags: 0
  m_CorrespondingSourceObject: {fileID: 0}
  m_PrefabInstance: {fileID: 0}
  m_PrefabAsset: {fileID: 0}
  m_GameObject: {fileID: 53003467914115796}
  m_LocalRotation: {x: 0, y: 0, z: 0, w: 1}
  m_LocalPosition: {x: -50, y: 0, z: 0}
  m_LocalScale: {x: 1, y: 1, z: 1}
  m_ConstrainProportionsScale: 0
  m_Children: []
  m_Father: {fileID: 0}
  m_RootOrder: 0
  m_LocalEulerAnglesHint: {x: 0, y: 0, z: 0}
--- !u!114 &53003467914115798
MonoBehaviour:
  m_ObjectHideFlags: 0
  m_CorrespondingSourceObject: {fileID: 0}
  m_PrefabInstance: {fileID: 0}
  m_PrefabAsset: {fileID: 0}
  m_GameObject: {fileID: 53003467914115796}
  m_Enabled: 1
  m_EditorHideFlags: 0
  m_Script: {fileID: 11500000, guid: 0e2123780aa8ae443b30c0a9f36626fe, type: 3}
  m_Name: 
  m_EditorClassIdentifier: 
  inUseContainer: {fileID: 0}
  storageContainer: {fileID: 53003467914115799}
  prefab: {fileID: 545000313284132927, guid: b1e649e4ff4a0ca4387e42d7b1280b03, type: 3}
  isCollectionCheck: 0
  currentAmount: 0
  defaultMaxAmount: 30
  flexibleMaxAmount: 30
