%YAML 1.1
%TAG !u! tag:unity3d.com,2011:
--- !u!1 &57120175127634427
GameObject:
  m_ObjectHideFlags: 0
  m_CorrespondingSourceObject: {fileID: 0}
  m_PrefabInstance: {fileID: 0}
  m_PrefabAsset: {fileID: 0}
  serializedVersion: 6
  m_Component:
  - component: {fileID: 57120175127634425}
  - component: {fileID: 57120175127634424}
  m_Layer: 0
  m_Name: Light Shaft 1
  m_TagString: Untagged
  m_Icon: {fileID: 0}
  m_NavMeshLayer: 0
  m_StaticEditorFlags: 0
  m_IsActive: 0
--- !u!4 &57120175127634425
Transform:
  m_ObjectHideFlags: 0
  m_CorrespondingSourceObject: {fileID: 0}
  m_PrefabInstance: {fileID: 0}
  m_PrefabAsset: {fileID: 0}
  m_GameObject: {fileID: 57120175127634427}
  m_LocalRotation: {x: 0, y: 0, z: 0, w: 1}
  m_LocalPosition: {x: -0.94, y: 1.77, z: 1.5392978}
  m_LocalScale: {x: 0.5, y: 0.5, z: 0.5}
  m_ConstrainProportionsScale: 0
  m_Children: []
  m_Father: {fileID: 0}
  m_RootOrder: 0
  m_LocalEulerAnglesHint: {x: 0, y: 0, z: 0}
--- !u!114 &57120175127634424
MonoBehaviour:
  m_ObjectHideFlags: 0
  m_CorrespondingSourceObject: {fileID: 0}
  m_PrefabInstance: {fileID: 0}
  m_PrefabAsset: {fileID: 0}
  m_GameObject: {fileID: 57120175127634427}
  m_Enabled: 1
  m_EditorHideFlags: 0
  m_Script: {fileID: 11500000, guid: 073797afb82c5a1438f328866b10b3f0, type: 3}
  m_Name: 
  m_EditorClassIdentifier: 
  m_ComponentVersion: 1
  m_LightType: 2
  m_BlendStyleIndex: 0
  m_FalloffIntensity: 0.5
  m_Color: {r: 1, g: 1, b: 1, a: 1}
  m_Intensity: 5.1
  m_LightVolumeIntensity: 0.05
  m_LightVolumeIntensityEnabled: 1
  m_ApplyToSortingLayers: 0000000021a11a7d
  m_LightCookieSprite: {fileID: 21300000, guid: fb0337c89564f204e941df1f2bf3e0b0, type: 3}
  m_DeprecatedPointLightCookieSprite: {fileID: 21300000, guid: fb0337c89564f204e941df1f2bf3e0b0, type: 3}
  m_LightOrder: 0
  m_AlphaBlendOnOverlap: 0
  m_OverlapOperation: 0
  m_NormalMapDistance: 0.5
  m_NormalMapQuality: 1
  m_UseNormalMap: 0
  m_ShadowIntensityEnabled: 1
  m_ShadowIntensity: 0
  m_ShadowVolumeIntensityEnabled: 0
  m_ShadowVolumeIntensity: 0
  m_Vertices:
  - position: {x: -3.383789, y: -9.4592285, z: 0}
    color: {r: 0, g: 0, b: 0, a: 1}
    uv: {x: 0.4140625, y: 0.054347824}
  - position: {x: -3.4606934, y: -10.612793, z: 0}
    color: {r: 0, g: 0, b: 0, a: 1}
    uv: {x: 0.41210938, y: 0}
  - position: {x: -3.383789, y: -10.535889, z: 0}
    color: {r: 0, g: 0, b: 0, a: 1}
    uv: {x: 0.4140625, y: 0.0036231885}
  - position: {x: -7.229004, y: -10.612793, z: 0}
    color: {r: 0, g: 0, b: 0, a: 1}
    uv: {x: 0.31640625, y: 0}
  - position: {x: -8.536377, y: -9.30542, z: 0}
    color: {r: 0, g: 0, b: 0, a: 1}
    uv: {x: 0.28320312, y: 0.061594203}
  - position: {x: -15.380859, y: 10.151367, z: 0}
    color: {r: 0, g: 0, b: 0, a: 1}
    uv: {x: 0.109375, y: 0.9782609}
  - position: {x: -15.842285, y: 10.612793, z: 0}
    color: {r: 0, g: 0, b: 0, a: 1}
    uv: {x: 0.09765625, y: 1}
  - position: {x: -18.07251, y: 6.690674, z: 0}
    color: {r: 0, g: 0, b: 0, a: 1}
    uv: {x: 0.041015625, y: 0.8152174}
  - position: {x: -19.6875, y: 10.612793, z: 0}
    color: {r: 0, g: 0, b: 0, a: 1}
    uv: {x: 0, y: 1}
  - position: {x: -19.6875, y: 9.536133, z: 0}
    color: {r: 0, g: 0, b: 0, a: 1}
    uv: {x: 0, y: 0.9492754}
  - position: {x: 4.5373535, y: -9.228516, z: 0}
    color: {r: 0, g: 0, b: 0, a: 1}
    uv: {x: 0.6152344, y: 0.06521739}
  - position: {x: 4.7680664, y: -10.612793, z: 0}
    color: {r: 0, g: 0, b: 0, a: 1}
    uv: {x: 0.62109375, y: 0}
  - position: {x: 4.7680664, y: -10.074463, z: 0}
    color: {r: 0, g: 0, b: 0, a: 1}
    uv: {x: 0.62109375, y: 0.025362318}
  - position: {x: -0.84594727, y: -10.612793, z: 0}
    color: {r: 0, g: 0, b: 0, a: 1}
    uv: {x: 0.47851562, y: 0}
  - position: {x: -3.9990234, y: -6.0754395, z: 0}
    color: {r: 0, g: 0, b: 0, a: 1}
    uv: {x: 0.3984375, y: 0.21376811}
  - position: {x: -6.3061523, y: 8.690186, z: 0}
    color: {r: 0, g: 0, b: 0, a: 1}
    uv: {x: 0.33984375, y: 0.9094203}
  - position: {x: -7.8442383, y: 10.612793, z: 0}
    color: {r: 0, g: 0, b: 0, a: 1}
    uv: {x: 0.30078125, y: 1}
  - position: {x: -11.920166, y: 6.998291, z: 0}
    color: {r: 0, g: 0, b: 0, a: 1}
    uv: {x: 0.19726562, y: 0.8297101}
  - position: {x: -13.304443, y: 10.612793, z: 0}
    color: {r: 0, g: 0, b: 0, a: 1}
    uv: {x: 0.16210938, y: 1}
  - position: {x: -13.304443, y: 9.920654, z: 0}
    color: {r: 0, g: 0, b: 0, a: 1}
    uv: {x: 0.16210938, y: 0.9673913}
  - position: {x: 19.6875, y: -9.30542, z: 0}
    color: {r: 0, g: 0, b: 0, a: 1}
    uv: {x: 1, y: 0.061594203}
  - position: {x: 9.536133, y: -10.612793, z: 0}
    color: {r: 0, g: 0, b: 0, a: 1}
    uv: {x: 0.7421875, y: 0}
  - position: {x: 19.6875, y: -10.612793, z: 0}
    color: {r: 0, g: 0, b: 0, a: 1}
    uv: {x: 1, y: 0}
  - position: {x: 7.767334, y: 10.151367, z: 0}
    color: {r: 0, g: 0, b: 0, a: 1}
    uv: {x: 0.6972656, y: 0.9782609}
  - position: {x: 7.0751953, y: 10.612793, z: 0}
    color: {r: 0, g: 0, b: 0, a: 1}
    uv: {x: 0.6796875, y: 1}
  - position: {x: 6.9213867, y: -7.767334, z: 0}
    color: {r: 0, g: 0, b: 0, a: 1}
    uv: {x: 0.67578125, y: 0.13405797}
  - position: {x: -2.9223633, y: 10.612793, z: 0}
    color: {r: 0, g: 0, b: 0, a: 1}
    uv: {x: 0.42578125, y: 1}
  - position: {x: -2.9223633, y: 9.689941, z: 0}
    color: {r: 0, g: 0, b: 0, a: 1}
    uv: {x: 0.42578125, y: 0.95652175}
  - position: {x: 0, y: 0, z: 0}
    color: {r: 0, g: 0, b: 0, a: 0}
    uv: {x: 0, y: 0}
  - position: {x: 0, y: 0, z: 0}
    color: {r: 0, g: 0, b: 0, a: 0}
    uv: {x: 0, y: 0}
  - position: {x: 0, y: 0, z: 0}
    color: {r: 0, g: 0, b: 0, a: 0}
    uv: {x: 0, y: 0}
  - position: {x: 0, y: 0, z: 0}
    color: {r: 0, g: 0, b: 0, a: 0}
    uv: {x: 0, y: 0}
  - position: {x: 0, y: 0, z: 0}
    color: {r: 0, g: 0, b: 0, a: 0}
    uv: {x: 0, y: 0}
  - position: {x: 0, y: 0, z: 0}
    color: {r: 0, g: 0, b: 0, a: 0}
    uv: {x: 0, y: 0}
  - position: {x: 0, y: 0, z: 0}
    color: {r: 0, g: 0, b: 0, a: 0}
    uv: {x: 0, y: 0}
  - position: {x: 0, y: 0, z: 0}
    color: {r: 0, g: 0, b: 0, a: 0}
    uv: {x: 0, y: 0}
  - position: {x: 0, y: 0, z: 0}
    color: {r: 0, g: 0, b: 0, a: 0}
    uv: {x: 0, y: 0}
  - position: {x: 0, y: 0, z: 0}
    color: {r: 0, g: 0, b: 0, a: 0}
    uv: {x: 0, y: 0}
  - position: {x: 0, y: 0, z: 0}
    color: {r: 0, g: 0, b: 0, a: 0}
    uv: {x: 0, y: 0}
  - position: {x: 0, y: 0, z: 0}
    color: {r: 0, g: 0, b: 0, a: 0}
    uv: {x: 0, y: 0}
  - position: {x: 0, y: 0, z: 0}
    color: {r: 0, g: 0, b: 0, a: 0}
    uv: {x: 0, y: 0}
  - position: {x: 0, y: 0, z: 0}
    color: {r: 0, g: 0, b: 0, a: 0}
    uv: {x: 0, y: 0}
  - position: {x: 0, y: 0, z: 0}
    color: {r: 0, g: 0, b: 0, a: 0}
    uv: {x: 0, y: 0}
  - position: {x: 0, y: 0, z: 0}
    color: {r: 0, g: 0, b: 0, a: 0}
    uv: {x: 0, y: 0}
  - position: {x: 0, y: 0, z: 0}
    color: {r: 0, g: 0, b: 0, a: 0}
    uv: {x: 0, y: 0}
  - position: {x: 0, y: 0, z: 0}
    color: {r: 0, g: 0, b: 0, a: 0}
    uv: {x: 0, y: 0}
  - position: {x: 0, y: 0, z: 0}
    color: {r: 0, g: 0, b: 0, a: 0}
    uv: {x: 0, y: 0}
  - position: {x: 0, y: 0, z: 0}
    color: {r: 0, g: 0, b: 0, a: 0}
    uv: {x: 0, y: 0}
  - position: {x: 0, y: 0, z: 0}
    color: {r: 0, g: 0, b: 0, a: 0}
    uv: {x: 0, y: 0}
  - position: {x: 0, y: 0, z: 0}
    color: {r: 0, g: 0, b: 0, a: 0}
    uv: {x: 0, y: 0}
  - position: {x: 0, y: 0, z: 0}
    color: {r: 0, g: 0, b: 0, a: 0}
    uv: {x: 0, y: 0}
  - position: {x: 0, y: 0, z: 0}
    color: {r: 0, g: 0, b: 0, a: 0}
    uv: {x: 0, y: 0}
  - position: {x: 0, y: 0, z: 0}
    color: {r: 0, g: 0, b: 0, a: 0}
    uv: {x: 0, y: 0}
  - position: {x: 0, y: 0, z: 0}
    color: {r: 0, g: 0, b: 0, a: 0}
    uv: {x: 0, y: 0}
  - position: {x: 0, y: 0, z: 0}
    color: {r: 0, g: 0, b: 0, a: 0}
    uv: {x: 0, y: 0}
  - position: {x: 0, y: 0, z: 0}
    color: {r: 0, g: 0, b: 0, a: 0}
    uv: {x: 0, y: 0}
  - position: {x: 0, y: 0, z: 0}
    color: {r: 0, g: 0, b: 0, a: 0}
    uv: {x: 0, y: 0}
  - position: {x: 0, y: 0, z: 0}
    color: {r: 0, g: 0, b: 0, a: 0}
    uv: {x: 0, y: 0}
  - position: {x: 0, y: 0, z: 0}
    color: {r: 0, g: 0, b: 0, a: 0}
    uv: {x: 0, y: 0}
  - position: {x: 0, y: 0, z: 0}
    color: {r: 0, g: 0, b: 0, a: 0}
    uv: {x: 0, y: 0}
  - position: {x: 0, y: 0, z: 0}
    color: {r: 0, g: 0, b: 0, a: 0}
    uv: {x: 0, y: 0}
  - position: {x: 0, y: 0, z: 0}
    color: {r: 0, g: 0, b: 0, a: 0}
    uv: {x: 0, y: 0}
  - position: {x: 0, y: 0, z: 0}
    color: {r: 0, g: 0, b: 0, a: 0}
    uv: {x: 0, y: 0}
  - position: {x: 0, y: 0, z: 0}
    color: {r: 0, g: 0, b: 0, a: 0}
    uv: {x: 0, y: 0}
  - position: {x: 0, y: 0, z: 0}
    color: {r: 0, g: 0, b: 0, a: 0}
    uv: {x: 0, y: 0}
  - position: {x: 0, y: 0, z: 0}
    color: {r: 0, g: 0, b: 0, a: 0}
    uv: {x: 0, y: 0}
  m_Triangles: 1b001a001900180019001a001500190018001700150018001400150017001600150014001300120011001000110012000e00110010000f000e0010000a000e000f000d000e000a000b000d000a000c000b000a00090008000700060007000800040007000600050004000600000004000500030004000000010003000000020001000000
  m_LocalBounds:
    m_Center: {x: 0, y: 0, z: 0}
    m_Extent: {x: 19.6875, y: 10.612793, z: 0}
  m_PointLightInnerAngle: 360
  m_PointLightOuterAngle: 360
  m_PointLightInnerRadius: 0
  m_PointLightOuterRadius: 1
  m_ShapeLightParametricSides: 5
  m_ShapeLightParametricAngleOffset: 0
  m_ShapeLightParametricRadius: 1
  m_ShapeLightFalloffSize: 0.5
  m_ShapeLightFalloffOffset: {x: 0, y: 0}
  m_ShapePath:
  - {x: -0.5, y: -0.5, z: 0}
  - {x: 0.5, y: -0.5, z: 0}
  - {x: 0.5, y: 0.5, z: 0}
  - {x: -0.5, y: 0.5, z: 0}
