%YAML 1.1
%TAG !u! tag:unity3d.com,2011:
--- !u!1 &5336539822203648073
GameObject:
  m_ObjectHideFlags: 0
  m_CorrespondingSourceObject: {fileID: 0}
  m_PrefabInstance: {fileID: 0}
  m_PrefabAsset: {fileID: 0}
  serializedVersion: 6
  m_Component:
  - component: {fileID: 5336539822203648072}
  - component: {fileID: 5336539822203648055}
  m_Layer: 0
  m_Name: StarsUIPool
  m_TagString: Untagged
  m_Icon: {fileID: 0}
  m_NavMeshLayer: 0
  m_StaticEditorFlags: 0
  m_IsActive: 1
--- !u!4 &5336539822203648072
Transform:
  m_ObjectHideFlags: 0
  m_CorrespondingSourceObject: {fileID: 0}
  m_PrefabInstance: {fileID: 0}
  m_PrefabAsset: {fileID: 0}
  m_GameObject: {fileID: 5336539822203648073}
  m_LocalRotation: {x: 0, y: 0, z: 0, w: 1}
  m_LocalPosition: {x: -50, y: 0, z: 0}
  m_LocalScale: {x: 1, y: 1, z: 1}
  m_ConstrainProportionsScale: 0
  m_Children: []
  m_Father: {fileID: 0}
  m_RootOrder: 0
  m_LocalEulerAnglesHint: {x: 0, y: 0, z: 0}
--- !u!114 &5336539822203648055
MonoBehaviour:
  m_ObjectHideFlags: 0
  m_CorrespondingSourceObject: {fileID: 0}
  m_PrefabInstance: {fileID: 0}
  m_PrefabAsset: {fileID: 0}
  m_GameObject: {fileID: 5336539822203648073}
  m_Enabled: 1
  m_EditorHideFlags: 0
  m_Script: {fileID: 11500000, guid: 8941f6a01f09dd2489ab5321d51b5c22, type: 3}
  m_Name: 
  m_EditorClassIdentifier: 
  inUseContainer: {fileID: 0}
  storageContainer: {fileID: 5336539822203648072}
  prefab: {fileID: 8087778302747302431, guid: 333397e5c4915164a8ecc9d870fdc05b, type: 3}
  isCollectionCheck: 0
  currentAmount: 0
  defaultMaxAmount: 30
  flexibleMaxAmount: 30
