com/gl/grpcAss/Token$empty$1.class
com/gl/grpcAss/Token$empty$Builder.class
com/gl/grpcAss/Main.class
com/gl/grpcAss/tokenGrpc$tokenImplBase.class
com/gl/grpcAss/Token$emptyOrBuilder.class
com/gl/grpcAss/tokenGrpc$tokenBlockingStub.class
com/gl/grpcAss/tokenGrpc$tokenBaseDescriptorSupplier.class
com/gl/grpcAss/tokenGrpc.class
com/gl/grpcAss/Token$APIResponse.class
com/gl/grpcAss/Token$APIResponse$Builder.class
com/gl/grpcAss/Token$loginMessage$1.class
com/gl/grpcAss/Token$1.class
com/gl/grpcAss/Token$loginMessageOrBuilder.class
com/gl/grpcAss/tokenGrpc$MethodHandlers.class
com/gl/grpcAss/Token$loginMessage.class
com/gl/grpcAss/tokenGrpc$tokenStub.class
com/gl/grpcAss/tokenGrpc$tokenFileDescriptorSupplier.class
com/gl/grpcAss/tokenGrpc$tokenMethodDescriptorSupplier.class
com/gl/grpcAss/Token$APIResponseOrBuilder.class
com/gl/grpcAss/Token$empty.class
com/gl/grpcAss/Token$loginMessage$Builder.class
com/gl/grpcAss/Token$APIResponse$1.class
com/gl/grpcAss/Token.class
com/gl/grpcAss/tokenGrpc$tokenFutureStub.class
