16.99921417
14.91552544
16.17873955
17.51012230
16.14602089
17.32654190
16.10375595
17.52923965
16.62419128
17.04731560
16.06801605
16.34527016
16.63274765
15.83320332
17.38809013
16.99244690
16.82982254
16.23480606
15.36175537
16.26025772
16.73579216
16.05342293
16.24822235
17.73159218
16.12300491
15.51905537
17.07816124
15.90839577
17.25012589
15.21936989
15.50852013
17.84216881
16.32909393
16.59475899
16.75297546
16.46262550
16.88254356
16.48987198
16.83372879
16.53450394
17.19494629
16.36618614
17.48160744
16.40423203
15.54033756
15.96586895
16.51121140
16.81297493
15.90971947
16.26483345
16.24667358
15.29140854
16.56824875
16.12089920
16.08890533
15.81758118
15.97375202
16.21538162
16.65803528
15.64112473
15.30728531
16.86248398
16.20821762
15.47663498
17.25111771
16.23061752
16.61997032
16.02817917
15.85384178
16.12374687
16.10302734
15.04321480
16.59708786
15.92868233
16.23127174
16.87467957
15.40473557
15.91236782
15.74972820
16.20106506
15.21510410
16.94787598
15.62827110
16.77086639
15.27625656
15.97314739
15.58641243
16.45046616
16.28771210
16.10861778
16.17310333
16.61493301
16.62240982
16.16443825
15.88070869
16.18827438
15.91156101
16.45692062
15.32952499
16.22193909
15.47472572
15.05729485
16.00544357
16.68599319
15.61765766
15.23925686
16.20703697
15.34718132
16.74833298
15.09886360
15.69659424
16.05078506
16.22510147
16.84662628
16.11908150
17.03292465
16.91657639
16.03194809
15.84155560
15.44221687
15.78302574
16.33565903
15.40526390
16.04441452
15.69001102
15.71385956
15.44871902
16.00251389
16.36312103
15.59588242
15.97700310
15.57300568
15.20146370
16.22729683
15.85823631
15.15201950
15.98092747
16.68651962
15.21671200
15.95214653
15.33008766
15.80259705
15.16281223
15.84105110
16.38806534
16.00395203
15.64906502
16.22829628
14.04663277
14.82986259
15.53722668
14.95320511
16.49102592
16.80047989
15.82669163
16.64139938
16.09503555
16.23781586
15.70811558
15.78318596
15.31982231
15.29130173
16.11486053
16.52028084
16.39203644
15.72429180
14.79558182
15.82723427
14.96944618
15.75014877
15.63578415
14.96058083
16.33094597
15.03273582
15.28973103
15.66515732
17.46878052
15.40099335
15.86695671
15.84094238
15.89998436
14.84618855
15.77284431
15.00459862
14.47027969
15.29959297
15.98983860
16.49336243
15.80162048
15.53216362
16.33399963
15.64924049
15.78925323
15.96145821
15.64300919
15.49320412
14.81311989
16.44594383
14.73518753
15.95272827
15.71481419
15.51516724
13.65769863
15.82276535
15.53378296
16.06176376
15.26830769
16.17873764
15.48384857
16.29001808
15.36923599
15.43488503
15.77997398
16.18388367
15.34331417
15.15838623
15.70365715
15.77287102
15.48457813
14.86711311
15.79040146
15.54849625
15.95202637
15.90003586
14.53478241
14.35239410
15.25974941
16.08049583
16.58370399
15.69940853
15.34323311
15.97172260
15.13159847
14.95099068
15.86843872
16.35858536
17.38443756
13.69295502
14.52195930
15.76915741
15.21736908
15.60629654
16.93078995
15.60963249
14.98943615
15.47214127
15.73223686
15.61942387
16.67569160
14.89698124
16.72935104
15.83472443
15.51288605
15.39640522
15.20345306
15.74788857
16.25197411
15.49662876
15.05978489
15.52210617
15.83409786
14.76020241
15.85974216
15.36522293
15.25547981
15.73129940
15.90290260
14.98733330
14.64269638
15.67201138
13.26144218
15.70715904
15.43020248
15.93257999
15.06847954
15.22472572
15.80830574
15.78252792
15.76306534
15.23489571
16.47471046
15.18139172
15.12767220
15.71067715
14.84931374
14.01638412
15.30042076
15.12552834
15.58852005
15.31972122
15.00351524
15.24644661
14.24568748
14.55141449
15.24746895
15.85261917
17.00909805
15.37775898
14.84076500
15.37179375
14.67316628
15.20105171
15.40081215
15.70284557
14.34805298
15.04846287
14.50563335
15.47897530
15.20833588
14.87854576
15.48367405
14.96630001
15.93547821
14.41233826
15.54685020
15.96999645
15.21198463
14.09081650
15.04206753
15.87631416
16.00479507
16.03894043
14.44054127
15.30854797
15.82524681
14.77236080
15.70472240
14.91648960
14.74721909
15.50115776
15.24921608
15.31261826
15.47581863
15.19176483
14.62766647
14.80564308
15.41765976
14.28976440
15.01878166
14.17697906
15.68746567
14.98877144
15.39955139
15.23963928
15.20773792
14.37765598
14.20189857
14.39231491
15.23647690
15.33907223
14.94391918
14.74492359
14.08738708
14.16696262
15.17484474
15.23370743
13.57628250
15.04956627
14.22505379
14.73760414
14.33720207
15.10907173
14.48770714
14.89482689
14.37695312
15.09812737
15.26447868
14.13977242
14.81991196
15.20788193
14.46631718
14.62934494
15.64250755
13.51667213
14.37512779
14.37011337
14.26954460
14.20314217
15.18047905
14.51675701
14.23834038
15.30423260
14.65701103
14.90499878
14.67510986
14.07699203
14.80027771
14.83366203
15.06698132
14.63937569
14.59403133
13.79026508
14.12436771
14.07867241
13.72889900
13.73846054
14.72946548
13.12108040
14.62426758
14.30597687
14.46867275
13.71735954
14.46732903
14.59108162
13.57660007
13.84497643
14.79781246
14.44188404
13.64251709
14.08024025
13.91999340
14.11641121
14.55423260
13.73581028
13.35611057
13.81673241
14.52725601
14.57396698
14.63561058
14.93853760
13.52565193
13.52186584
13.23679352
14.36840439
13.21665001
13.40475941
13.53095055
14.35431385
13.46585464
13.28534412
13.51411724
13.03772545
14.19494915
13.99472523
13.92312622
14.57476044
13.95516968
13.51183987
14.13014030
14.67896557
13.83248901
14.50189114
13.18818092
14.15378952
14.20461750
13.38145638
13.66620636
13.73443604
12.68858051
14.42306709
12.90397263
12.35709763
13.73770523
13.62249374
13.30706501
12.69707108
13.13111782
14.19928455
12.39572716
14.06744194
12.72871113
13.07892609
13.24449539
12.98844528
13.31320572
13.61364937
13.09179688
11.98611069
14.30877495
12.80433655
13.79975510
13.35667133
13.32554531
14.35150433
12.29557514
13.61330700
12.62728119
13.69936371
14.12373924
13.72018814
13.26289368
12.15954494
13.27215385
12.87806892
12.42888451
12.45153141
13.71935177
12.06884766
13.00151443
11.68029022
12.56969070
12.90008163
12.93322277
13.08176422
13.30841446
12.95983124
12.95290375
13.82319069
12.39244270
13.32148933
12.61211681
12.97125244
12.85367489
13.12035465
12.22278786
12.84132767
12.98772621
12.70388699
13.19068909
13.01838112
12.92559814
12.64562130
12.73706532
13.56648922
12.00599098
12.72090435
12.66213512
12.05480957
12.82706356
12.20512581
12.52446938
12.08750916
13.06116676
12.42483139
12.98764420
12.99767876
12.61113739
12.95009708
11.43083477
12.71190453
12.91469765
12.54317474
12.85992241
12.80889130
12.34556866
12.05297089
12.53838539
13.22870541
11.83004379
12.32421303
12.84212017
11.91987991
12.56747341
11.69705486
12.68194008
12.24104309
12.45715523
13.39134502
13.07713127
11.38352776
12.36587524
13.01220798
11.97466278
12.25464821
12.18375587
11.89267731
12.31200314
12.83980274
13.35516262
11.97871304
12.63588905
12.63069725
12.11645317
13.67729664
12.41753578
12.57718277
13.08426189
12.36119556
13.23550797
12.72460747
12.99897003
12.17805481
11.71284103
12.42331028
12.06988525
12.37129593
12.40069485
12.01179314
11.82188606
13.09636211
12.44509315
13.09783363
12.52652168
12.68923187
11.95431900
13.49487114
11.73741531
12.79453659
14.04449463
12.28093719
12.72224236
12.83788967
12.71856213
12.62178898
13.20049191
12.18195152
12.05814075
12.80845928
12.30356979
13.49332047
12.62859631
13.03475952
12.78746033
12.93681908
12.50945854
12.53626823
12.95923615
11.70688820
13.21711540
13.37973976
12.91826248
12.11163712
12.11879063
11.55575371
12.83984566
13.43000126
12.39598083
12.25573158
13.41037941
13.25593472
12.01429844
12.58086967
12.06491089
13.35097313
12.12553120
12.03588772
12.19914055
11.78704929
12.71670437
12.18974876
12.36506271
12.35149002
11.92987061
11.96186543
12.03664970
12.03079796
12.47621822
11.94646263
12.94062996
12.27241898
12.70255280
12.21668720
12.90116501
12.50978470
12.67705345
12.93795013
13.35682774
12.10962296
12.12112713
11.86143684
11.85338879
12.28911972
13.08353043
12.89594936
12.46580887
13.21070004
11.54402733
12.86710548
13.44837856
14.15904713
11.54947662
13.18814087
12.04518032
12.92730808
12.18445015
12.85867023
12.97740555
13.15504837
11.97590160
12.26226616
12.77392769
11.90850735
12.25384903
12.87355518
11.59223747
12.22787285
11.97938728
12.74712563
12.20805073
13.07886887
11.72592068
13.27247238
11.94272709
12.65804386
12.33964729
13.10871506
11.97371197
12.15200233
12.53033447
12.03538418
12.88752556
12.55403900
11.64328384
13.23356056
12.60758209
12.25967216
12.03633881
12.06714439
11.47233105
12.54948235
11.89073658
11.56142426
12.08549309
11.26649952
11.56708527
12.60444260
12.25526619
12.32172966
11.92118263
12.71583271
11.69896984
12.63283348
12.04166985
12.76717567
12.83339691
12.20304298
12.99810791
12.27054310
12.55941010
12.89617729
12.95183754
12.38054180
11.77356529
12.39084053
12.40455723
11.77091694
11.32642460
11.77864647
12.50250912
12.38517570
13.45098305
12.35667992
12.63807392
12.56193924
12.92216301
12.60496140
11.58961296
12.79648972
13.49946880
12.87173462
12.77495956
11.96190453
12.36628723
11.79326248
12.09320259
12.06245804
12.35635948
11.61349010
12.05426598
12.67132568
12.01313305
12.38013744
12.58589077
12.21934128
12.41379166
12.77246666
12.33736610
11.58761215
11.55115700
13.33228970
12.05032444
11.77613449
12.25854683
12.47235107
11.78219700
12.16834736
11.85534573
11.73850060
12.09382153
12.28633022
11.25469208
12.24899578
13.87720108
12.20678997
12.95160103
11.61878586
12.69783878
12.51007652
12.87486744
11.60151100
11.53096581
13.46532345
12.38418198
11.92048645
11.86727047
11.65757942
12.44625378
12.58875561
11.97954559
12.34411049
12.55344391
11.32964325
12.38531494
11.60760212
12.01629925
12.17446327
12.69469929
11.46006966
12.81712341
12.01929855
12.35737991
12.13647842
12.46162415
12.11725235
12.09656715
12.77284908
12.29957676
12.34846878
12.88373375
11.95505142
12.48196220
12.34065723
11.66031933
11.87878704
11.90142441
11.25253868
12.74655056
11.16547585
12.31627083
12.25522709
11.86253166
11.43185520
11.55197334
12.13957977
11.58485317
12.25748444
12.48050213
11.71902084
12.05262947
11.87093449
12.06993198
11.93368435
11.59196281
11.60482407
12.94023418
12.32224560
11.89914703
12.71962166
12.35672760
12.22211552
12.05366611
12.40032005
12.12133980
11.92628098
11.52371025
11.50717640
10.84591103
12.56427956
12.37965202
12.57890511
12.11704254
12.30476761
11.71739101
11.70483685
11.87975407
12.56975365
12.36326408
12.65505791
12.55862904
12.30587006
11.84225273
12.24509716
11.66147518
11.05956078
12.31715298
11.80768681
11.60684204
12.35929108
12.05236626
11.75091457
12.12765503
11.64190674
12.67586899
11.42398643
11.60877419
11.88423061
13.03749466
12.51909351
11.23616600
12.81354618
11.29309559
12.83343124
11.77920151
11.98085785
12.59618568
11.85452461
11.84863663
11.42924404
11.82843208
12.40462494
12.37913990
12.11125088
11.67224312
11.85349178
12.46962929
11.62633228
12.00133038
11.58720875
12.15068626
11.93103600
10.95226765
11.58802986
11.67648697
11.72775459
12.07063007
11.43402481
12.16456795
11.58550644
11.78543186
11.76268196
11.92978287
11.61523819
11.50083160
11.88248444
11.06566429
11.58904839
11.77802849
11.80330181
11.52089500
12.19535923
11.56552696
11.81902790
12.20183945
12.19296741
12.46845436
12.21496773
12.27213001
12.19835854
12.91999054
11.72026634
11.62689781
11.14758873
12.89469242
11.52403355
12.46646976
11.22850418
12.07374382
11.46317291
11.81677723
11.27597809
11.94772339
12.18573952
12.15425873
12.17611313
11.59708786
11.91555405
12.34231281
11.66681099
12.12518883
11.25422192
11.56859875
11.46085358
12.53316975
12.18121433
11.67585087
12.38795471
11.85611916
11.52263832
11.14245224
11.68198490
11.19790649
12.00889111
12.74847507
11.46606636
12.60697842
11.56753540
11.05106544
11.85787392
12.42977905
12.00059795
11.56205940
12.90071678
11.92284203
12.85124016
12.17244816
12.10175323
11.99067116
12.29103279
10.97252274
11.63632679
10.73399162
12.78304482
11.31347561
11.93937492
11.13583088
12.10023880
10.94269753
11.81166744
11.01161766
11.12167358
11.96505356
11.51406384
11.15363503
11.57694435
11.61308670
11.94260693
11.90612602
11.20918465
11.50634193
12.03157234
12.62986088
12.92631626
11.86590958
12.29431248
11.97974396
11.55135822
12.51156712
12.04284191
11.84100342
12.14871693
12.10719872
11.59160042
11.70865631
11.59041214
11.81226349
11.48005199
11.07194328
12.49884796
12.03567982
11.77873421
10.87721539
12.44211960
11.91776180
11.22641754
11.58194637
11.70817661
11.25450897
11.54969025
12.11968327
11.17726707
11.38198757
11.44289398
11.87238598
12.13073349
12.90184402
11.35458088
11.94790173
11.80495071
12.86061573
12.37989616
11.38937569
12.54070663
10.96566582
11.36199951
12.15593338
11.46053982
12.41092491
12.07820129
12.60153389
11.40525818
12.38017750
12.47037125
11.14820290
11.73010731
12.07377052
11.59046555
11.42738819
12.04619503
11.36835480
11.95623493
12.14831734
12.36845493
12.81586075
12.26195049
13.15567589
11.89511490
11.78350544
12.96595764
12.50625134
12.22921276
11.44425392
11.29977894
11.83098698
10.80696106
11.22515106
11.31677628
12.33046532
11.83018875
11.67713261
10.75609589
11.57963085
12.40183258
10.74861145
11.97249413
11.15208149
11.02368164
11.40928936
12.02788544
11.54963112
11.48723030
12.53341866
10.88354111
11.81844711
12.08399391
11.43248463
10.56075478
12.70935440
11.70604610
12.15196991
12.27344036
12.19486904
11.62290192
11.94106102
11.58274555
10.75214672
11.46389008
12.40573883
11.74134064
11.73979282
12.27996540
12.20476723
11.18287849
12.73381329
12.12954330
11.52677917
11.83800125
11.54723072
11.38414192
11.17726898
12.08131504
11.88731003
12.42882252
11.99249268
12.53999805
11.74358463
11.15737724
12.96109772
11.93996429
11.32695198
11.81032753
12.81716442
11.79614258
11.45431900
11.11765480
11.55534458
12.26350403
11.36121178
12.33683395
11.66997910
11.66751099
11.57337284
12.36542225
11.95128918
10.96051979
11.93886089
13.08120251
11.38361073
11.28288555
11.56292725
11.87179565
11.49628925
11.23429394
11.51809406
12.31809235
11.38806152
10.94290543
11.59356785
11.49472427
11.75675583
11.61110020
11.59345436
11.54731941
11.41471386
11.70417404
11.68082428
12.21066856
11.60242271
11.97513390
12.23636246
11.44774151
12.40952301
11.84210491
11.56046486
11.13779068
11.93516159
12.13981247
11.89797020
12.13999748
10.82230949
12.13975334
11.63230801
11.96485138
12.18076134
11.68054485
12.19454002
12.22956848
12.35803699
11.80466843
11.77641869
11.70905876
11.90811729
11.53714180
11.39559937
11.56245613
11.30054760
12.41257477
12.70546055
12.48018932
11.71029472
12.31325245
11.83424664
12.45923615
11.16018677
11.55698204
10.88172913
11.27410603
11.41387749
12.27165031
11.80674553
11.66284561
12.80798054
12.44881439
10.94632149
12.54897404
11.20700073
11.53841400
12.05733871
11.62863541
12.58226395
12.28702164
12.71829414
10.98959732
12.49690247
12.03320122
12.15324020
10.91589928
12.55211258
11.68548775
11.68721390
11.64417744
11.32084370
11.42785645
12.10667706
12.46168995
12.49576378
11.88783455
11.64696980
11.64937210
11.25914669
11.61023426
12.56971359
12.45058250
12.71029282
11.45025635
12.15487957
11.88332939
12.27814865
11.38808632
10.70785427
11.94223881
11.72933960
13.10369492
10.79973412
12.16784859
11.15050125
11.35689545
12.10265255
11.65298176
11.62288380
11.84763718
11.56150246
12.24464607
11.58767891
11.70824242
11.86468792
11.56492519
11.33801460
11.58245182
12.09962654
12.17761517
10.90541267
12.93656254
10.69460201
10.81536961
12.56822777
11.65400600
11.25812054
12.11105347
12.11015224
11.47030354
11.95128250
11.34346485
11.60897446
11.46417236
12.26556301
11.52550411
12.18952465
12.18732738
11.59835529
12.71524143
12.27810764
11.06529903
12.15233231
12.12706566
11.89027023
11.37190247
12.95616531
10.88738155
12.86515331
11.56294537
11.51511574
11.47827148
12.59539795
11.28611946
12.08236885
12.40088749
12.22127914
10.48885250
11.39625168
12.31728172
11.84612846
10.79000759
12.25437546
10.95296764
11.77336502
11.65786552
12.20529747
10.97310352
11.62391376
11.47381973
11.72651291
11.43971634
12.03009892
12.38447952
11.15843391
11.88217926
13.06775188
11.45402527
12.34463692
12.20091724
11.88799667
11.37033844
11.75132656
11.49504566
12.41579628
11.19849300
11.74158382
12.97102547
11.19240189
11.38384151
11.77503109
12.19386864
12.55958176
11.85582066
12.03192043
12.43343544
10.97485638
10.45000458
11.92254639
11.59956360
11.38068008
11.95800018
10.97287369
11.56568146
11.88831711
11.47183895
12.14472389
11.10113430
11.23939991
11.86696243
12.28548241
12.33290672
11.63607216
11.28674316
12.07842064
11.24111366
12.75341988
12.54359245
12.28723240
11.24367332
11.59493828
12.27864647
11.76517868
10.53871727
12.49720669
11.94057560
11.19612598
12.15848732
11.29704475
11.55505466
11.89124775
12.29841328
12.02008820
12.03541851
11.69113255
11.90673447
11.39002419
11.86099911
12.28203011
11.32700157
11.57291222
11.20618057
11.87343597
12.21703339
11.93964195
11.19833660
12.11995983
11.26562309
11.62418556
11.51147938
12.62776852
11.76463318
10.84053898
11.19771194
11.95651245
11.20833874
12.01885033
11.80573368
11.34081841
11.72761536
11.96545601
10.80306911
12.21980476
11.81755924
11.71149349
12.47703838
11.10448265
11.96769524
12.04995155
11.61615086
12.39416313
11.60501862
11.53653431
11.31041145
11.04450512
11.71900940
11.39596748
11.00511265
12.69089794
12.04032898
11.02619553
11.49603176
11.64436817
11.80895329
12.06102562
12.85404587
12.60565758
12.99830246
11.28473759
12.70700455
11.05825806
12.75989723
10.09225368
11.40348434
10.22074604
12.14814091
11.74012184
11.35957146
11.56245518
11.34832668
11.89671326
12.21541214
11.01677704
11.61492634
11.60177231
11.89428139
11.56280613
11.16946793
11.52839279
11.48131466
11.73822975
12.79216671
11.55422115
11.70880985
11.69770718
12.32625771
12.45988083
12.46004295
11.83378124
12.08917904
12.14062786
12.19899750
13.00693321
11.58944130
11.17056084
11.68220425
11.56779385
12.33459187
11.49125099
12.72785854
11.34412575
11.76613235
11.63055325
11.68413925
11.07686615
11.61989403
11.22315788
11.97207546
11.64791870
11.36431885
11.35138035
11.22993183
12.71808624
11.81586266
11.26630688
11.46211720
11.39141560
11.02073765
12.60511208
11.95597935
12.15178490
11.93782234
11.59020233
12.20208931
11.28991985
11.74077797
12.74871635
11.67335415
12.35343838
11.76417351
10.99020767
12.17061520
11.12897110
11.87290668
11.65104103
11.09033298
11.69901848
11.16885185
11.38545322
12.22470665
11.84835339
11.96023369
12.66925144
12.51074791
11.25225925
11.98433876
11.92999268
11.68485928
11.44938469
12.90795135
11.22843361
11.75568199
11.39976025
10.35465717
12.12809181
12.71014977
12.61318302
11.61422062
11.17178535
11.73961926
10.98992634
12.48739815
11.75324154
11.71629715
12.43978310
11.45867920
12.12929153
11.05755234
12.24316788
10.76238918
12.32927513
12.16495609
11.23537064
12.97420120
11.54260254
11.64211369
11.83951378
11.65465450
11.85389328
12.01014709
12.22846317
12.52936935
12.10375690
11.13705635
10.98182678
11.26308250
11.92529202
12.00389290
10.91299629
11.69350147
11.59045506
11.92483139
12.30671692
12.64974213
12.06024551
11.67402840
12.06511116
11.99390793
12.07486343
12.11851025
11.59617233
11.99310780
11.50782585
11.62018585
12.78084183
11.89376163
12.39690876
11.58927536
11.62440968
11.71582413
11.48434734
10.85830879
12.75772095
10.62751484
11.42988205
11.31846237
11.58045769
12.06601143
10.86275959
12.06947994
12.41161156
11.60053444
11.48561096
11.40752316
12.13409805
10.71160507
11.31936455
11.83736801
12.81413269
11.92478561
11.87081337
10.90579987
12.21894360
11.61773300
12.32889557
11.61460686
11.93626785
12.01458168
11.45678139
12.16594696
11.65813637
11.97461319
12.10534096
11.12710190
10.84828186
10.58681870
12.07860947
12.89405441
12.61554146
11.37292099
12.23682594
12.56957054
11.39402580
12.72403526
12.31941032
11.89908409
12.20662308
11.59887123
12.81886482
12.20026588
11.86488056
12.41044235
11.90327644
11.80578804
11.25251579
12.09398842
11.44921494
11.61979008
12.72962570
11.60249901
12.05243015
11.48161411
11.44057846
11.41010284
11.70239449
11.93974113
12.61760235
11.21349144
11.99551392
12.32759380
12.00650501
11.16113281
12.39990425
10.88680935
11.82083893
11.99613571
11.80859947
12.22970581
11.78733063
12.47401905
11.13062859
11.25861740
12.06253338
11.13117599
12.61900616
11.43558216
11.78449345
12.23676205
12.52532005
12.42058277
11.91608238
11.83017540
10.78687382
12.37641239
12.37525749
12.57146931
11.89779854
11.72884750
12.27753353
11.24851131
12.42603683
12.62578773
10.47353172
12.01532936
10.69395447
11.94392586
11.61937523
11.73254776
11.22692394
11.63078308
12.17864609
11.54323959
11.43374157
11.33493805
12.11745358
10.94509125
11.99827099
12.29889297
11.52119255
12.22918320
11.41563606
11.40409946
11.26943779
11.21044636
12.25559235
12.05547237
11.01122379
11.62250328
11.21441078
10.56045532
10.65795898
10.93341637
11.41344929
12.30982971
10.67916107
11.58919430
11.65329742
11.01539803
11.60311127
11.68872070
12.53316879
11.40696812
12.28840828
11.51833820
11.73902798
11.33511829
11.94797134
12.27908897
12.13951969
12.29910564
11.93665695
12.23187828
10.71393013
12.28680992
10.87032795
11.72810173
12.21370983
11.70570278
11.33242226
11.84219646
11.38549709
11.46381092
11.45526028
11.90111351
11.30280113
12.49938774
10.92828465
11.49475288
12.55501747
11.74390030
12.29375935
12.33612442
11.75172138
11.19109249
11.88420677
11.68788433
12.45392895
10.91190338
10.80078125
12.05886078
10.96900558
11.55582047
11.26218128
11.12467289
12.34961510
11.63493824
11.62887001
11.99614716
12.91521740
11.77748489
11.39215755
11.74172020
12.70514965
11.73221588
12.11202049
12.19001389
11.79039955
10.67439079
11.73230362
11.69377327
11.57772541
12.04054737
11.96011162
12.63213062
11.74796486
11.79421997
13.01974297
11.93792629
12.02754498
11.03740978
12.34486198
12.33169556
11.32290649
11.65627766
11.38022995
11.97807693
11.64711857
11.62405586
11.46394253
11.16740894
11.63503647
11.64322281
11.06024170
11.97965908
12.09996414
11.44182301
11.46872139
11.41205311
12.37698460
11.62492847
12.46067238
11.95832825
11.48727989
11.39474106
11.78860474
12.29418373
12.25002956
13.47273827
11.61823368
12.25365925
11.19127178
12.05327892
11.36626053
11.66210938
11.91684532
12.24069405
11.37063313
12.44265938
12.68764687
13.19642448
12.11834526
10.89756393
11.65842056
11.45608521
11.52295303
11.95920277
11.64556599
12.19157028
11.44939804
12.76308727
11.24521255
11.37873840
11.82070923
11.96402168
12.09833145
12.10198689
11.24684620
12.56654739
11.82605171
12.55318642
12.80047703
11.63673878
12.11232567
11.15745258
10.80535698
11.18844795
11.51084900
12.56799507
11.53761101
11.20521450
11.81976891
11.42038536
12.67100906
11.46519470
11.73965263
11.23012543
11.19074059
11.66436005
11.89976883
11.00801754
12.67735004
11.91498375
11.42321873
11.68806934
11.54935455
12.82214642
11.61531734
12.13239479
11.75118256
12.12192726
12.01867008
11.73625374
13.14224148
11.94102478
11.49991322
11.91910934
10.96517944
11.78941345
11.96014881
11.49696159
12.26077652
12.29606628
10.96082211
12.15745735
10.70826244
11.02633286
10.73235226
12.48286819
11.77709103
11.36923409
12.19142342
11.77360916
11.65518665
10.58253288
12.47554493
11.12183380
10.68914127
12.21963882
11.30956650
12.16730118
10.81875038
10.76977825
11.70940685
11.34263611
11.22696495
12.33390999
11.25372124
11.58998108
12.00507450
11.52894402
12.19139194
11.95244980
11.69885826
11.16372585
11.58755302
11.32015896
11.49437141
11.91210461
10.90324116
12.66129494
11.95771408
11.34286785
11.44496441
11.20252419
12.13235950
11.10809040
11.58942986
11.37360001
11.57618523
12.37787819
12.12781143
12.67814255
12.32570076
12.55157852
11.27233982
11.67843628
11.23522568
11.20782852
11.99617958
11.22410393
11.80909729
11.53772259
11.50793457
11.43366241
11.26974010
11.19745064
11.92832851
12.39749908
11.79336834
11.80087948
12.60363865
11.79844666
11.48942375
11.50323677
12.15146065
10.77146149
11.75817013
12.69560242
11.44228363
11.86735725
11.07688236
11.31036568
11.08225918
11.80597973
11.63883877
11.75886345
12.68652725
12.61458778
12.03061008
12.11437416
11.38288307
11.69449615
12.01755428
12.40423870
12.46649551
11.65203190
11.63997650
11.10867310
12.08699799
11.27899075
11.50400352
12.20680428
12.16179466
10.72774220
11.99389267
11.13086319
11.05439091
11.78519344
11.26870155
12.06949425
11.66879177
11.18616581
11.88982582
11.83871937
11.78906918
11.93786430
12.33923721
11.97239017
13.72073555
10.86351967
11.96656418
12.54024792
12.72414112
12.49793530
11.41057396
11.32325745
11.52716827
11.61249638
11.73483086
11.57828045
11.41746140
11.36214256
12.77921963
12.78936577
12.60994339
12.18750954
12.61525917
11.80835056
12.19262123
12.78318596
11.40654373
11.95587063
10.88721371
11.98465443
10.76309395
11.88037586
11.93352890
11.10865498
11.29517555
11.80225563
12.36602879
11.64809608
12.36563873
11.46370316
12.06588173
12.32422924
11.48444462
11.88154507
11.77027225
11.93442154
10.66857529
11.52344036
11.23185730
11.41909885
11.12467289
12.44820213
12.35799408
11.66154099
11.91849804
12.02133465
11.71910286
11.19100952
11.69372082
12.34864807
11.04370117
12.10510159
11.70100880
11.29860306
12.44110394
12.38460350
11.53180790
11.63082600
10.97295475
11.10700321
11.49790764
11.82321548
11.37484646
11.85838032
11.10244942
11.15763187
12.48611164
11.35324192
11.96086788
11.77946663
11.72772980
11.37243271
12.62434196
11.27166271
11.43613529
11.30643940
11.62150288
11.20231247
11.72551632
11.89878082
11.05754375
12.00651169
11.15066051
11.72024155
11.08027267
11.62776470
11.53868866
10.56701279
11.57117176
12.14616013
10.80467796
11.67614555
11.88524914
12.13993835
11.42494869
11.84401131
11.40129280
11.56215096
11.79097176
11.14614010
10.80587959
11.78766251
12.52043152
12.14578915
12.04137802
11.61185455
11.64196968
10.99589348
11.87468338
12.08598423
11.99977303
11.84863663
12.23651314
11.26261902
11.93284416
11.16403008
12.02064419
12.01777840
11.71882248
11.32926941
11.71919250
11.52266693
12.07327938
11.43359756
10.96088123
11.82131577
11.67995644
11.07334995
11.52872467
11.81514645
11.22653580
11.93477249
12.34872150
12.03443909
11.52470303
12.40081787
11.05519676
11.95648384
11.83379936
11.33128834
11.60589027
11.98350048
11.77423859
11.66571426
12.36546898
11.60474873
10.52334595
12.49963188
11.54532051
10.78547287
12.71094704
12.13425636
11.73489857
11.63174629
12.23844147
11.26852226
11.79997253
11.72463703
11.91504097
11.86308289
11.49246407
11.49708843
11.64479733
11.38620758
10.94485855
11.58770657
11.25497627
11.12359810
12.23456287
11.70636749
11.53377151
11.28589249
11.51649761
11.92694855
11.61584759
12.46377563
10.97064018
11.81079292
12.95874977
11.13148499
10.91297340
12.21307182
11.41526413
11.98939228
12.05694866
12.50154018
11.21682453
11.60544014
12.15296268
11.77281380
12.44209003
12.79694748
12.41188049
12.06653976
12.50452995
11.06825256
11.54483414
10.37766075
11.78252029
11.81881809
11.49237919
11.17290688
12.32492161
11.74042606
11.49244785
11.54890919
12.20356560
12.52781677
12.21475601
11.75969410
11.66689205
11.55587196
12.40393448
11.86458492
11.75508118
11.10281563
11.06389332
11.45862007
11.49963093
11.02764797
11.48095703
12.73086739
11.42533112
12.13887119
12.39023781
10.56278324
12.11538410
11.67793083
11.54497337
11.28350449
11.99863529
11.56230545
11.32890701
11.79367638
11.51556015
11.21504974
12.57431126
12.30373096
12.47398281
12.85466957
11.61476421
11.48159599
10.87721825
12.37338161
11.00711060
11.57063293
12.28063297
11.49552917
12.26445484
12.23964214
11.44334793
11.66528988
12.03908348
12.19833183
11.55858803
12.44175720
10.99542427
12.13871098
11.62043762
11.30283737
11.08882332
12.03404236
11.37242889
12.26959419
10.80757809
11.53811455
11.87141132
12.03759670
11.22065639
12.10019016
12.52478600
11.77263832
11.69854546
11.93218231
10.53704834
12.02133465
11.87962151
11.48990631
11.45664406
11.41211033
11.79917717
11.73185349
11.95748329
12.55769920
12.33720398
12.04282188
12.30365181
12.29396629
11.02272129
12.30686092
12.11990929
12.07301140
12.02555275
11.48434925
12.99878883
11.63652706
10.96615219
11.47369385
11.94388199
12.21522999
11.10511398
11.23866463
11.65284729
11.46486473
11.55702305
11.92520237
11.94534683
11.88471127
11.82910252
11.43916321
12.38168621
11.20841312
12.50567818
11.61787796
11.55858421
10.91452408
12.22150612
11.44421673
11.19751263
11.48810959
10.51689148
11.71294022
11.48959255
11.50709057
11.37210846
11.75642395
12.16185570
11.81726360
11.24178791
11.90899181
12.07218742
11.21705627
11.70030689
11.91279602
12.52998161
12.18172264
11.53639793
11.73558807
11.60194016
11.90349293
11.82608795
12.16798878
11.13040066
12.18719292
12.43096447
11.31265640
12.11973667
12.71828175
11.79939461
12.32710648
12.38180256
11.00082016
11.92741585
11.26833153
11.89992142
11.75278091
11.80730915
11.00532150
11.84912968
11.72715378
12.03955746
12.32626724
10.93309784
11.39458370
11.25525570
11.15410614
11.40641785
11.08442879
11.25312424
11.27197170
11.60914230
12.09148979
10.87832260
11.93846703
11.15701008
11.46355247
12.62954617
11.74201298
11.09127235
12.16034985
11.13840961
11.10330009
10.64137650
11.33697987
10.88931274
11.33683968
12.33190536
11.58707237
12.55011749
10.93330956
11.14202404
12.34747791
11.65421295
11.24967194
12.27143478
11.23545265
11.47031689
12.20805264
12.13137722
11.86807442
12.56986427
11.15345383
12.39655590
11.38147545
11.83566475
11.81528473
11.59253979
11.71424866
11.16475773
11.38406754
12.23393726
11.71670914
11.36155319
12.55035686
11.89103699
11.90447426
11.92133713
11.01095390
11.38164997
11.97895718
12.50289822
11.20229816
11.72320652
11.98453331
12.48035908
12.01314354
12.06911945
11.73541260
12.12761879
12.15770149
12.26268578
11.39830971
11.58401299
11.93445778
12.40279579
11.25212669
11.79390335
11.51132965
12.18272209
11.50323772
10.95311451
12.00746536
12.43909645
12.17049599
11.09994793
11.72980785
10.94867897
11.42348003
10.87779236
10.56161690
11.45678616
11.93078804
11.55400085
12.55381775
12.13872814
11.19700241
12.00880527
11.75936890
11.48259544
11.85229111
12.50887299
11.69847775
12.10519981
12.04726410
11.76066208
11.06156826
11.51310539
12.57581139
12.25895882
12.25697994
11.75048637
12.43115902
11.23931694
11.66175842
11.91140175
12.13279343
12.36416817
11.52377224
13.26610279
12.12038231
11.61606216
11.13536072
11.55115604
12.36770821
11.08905220
12.06781673
11.89405060
10.74020386
11.77621174
11.47503757
12.75372028
11.30521774
11.56134415
12.41861725
12.04631424
11.16200638
11.10758400
11.20557213
12.08235168
11.52077675
12.11972046
11.78939629
12.24394703
11.29003334
10.85564995
12.38643265
11.76495266
11.33198833
10.38258743
12.67160416
12.02367783
12.58440590
11.07399464
11.65174866
11.55339909
12.68878365
12.26383877
11.66788864
12.20078182
12.05134583
11.87489414
11.23254776
11.24585915
11.60229301
12.61782074
11.29117203
12.00911427
11.77544498
11.05322647
11.10117912
12.33232117
11.74135208
12.03405476
11.58106899
11.47770119
11.18670464
12.04039860
11.17305660
11.93417454
11.64962673
11.86939240
11.81657410
11.14613819
10.84481049
11.24564648
12.09884834
11.38425541
11.86316872
11.87385273
11.02336407
12.01125240
11.76906872
11.70371628
11.67560196
11.46346092
11.62315941
12.09096527
11.68564606
12.23586369
12.78222275
11.17595863
12.25456333
12.41755199
11.86822605
12.16659927
12.79765606
12.22708225
11.56621933
11.89377308
11.50211811
12.56321812
12.07757854
11.47056389
11.97701931
11.86880493
12.25443459
12.23048210
11.59312439
11.69280624
11.30570221
11.85955715
11.51779842
11.24151897
11.33888149
12.25640106
11.63862610
11.59447765
11.72606468
12.08130264
11.21666718
12.09884453
10.76485348
12.19363880
10.97196770
12.00075150
11.83342648
11.60182381
12.48007679
12.03778172
12.25428009
11.58983612
11.88907242
12.43872547
11.97996426
12.43228340
11.73839188
11.38131142
11.71191311
12.26867867
11.17419529
11.93875122
12.22335052
11.94822502
11.20113182
12.58195400
12.46714401
12.36899853
11.14692497
12.11247826
11.69297218
11.38480186
12.24337769
11.78929996
11.45543098
11.06939507
11.21308899
11.71433258
11.87685299
11.80807686
12.48865032
11.73743153
11.56342125
12.36305141
12.05621147
12.15413475
11.69086075
11.66594315
11.58447647
12.07566452
11.97435570
11.06565094
11.50650692
10.83752632
11.24302197
11.80080891
12.17811584
12.51262093
11.28485966
11.41231155
12.05390167
11.45163059
10.80865383
12.81756496
10.67491150
11.40069389
11.39556694
11.52493954
11.00899887
11.55770016
12.07557774
11.66770554
11.48847485
11.64483166
11.13534355
11.95301723
11.84446907
11.98750591
11.58754444
12.25314045
12.45087337
11.52520752
11.89266396
11.47288990
11.44296932
10.25603104
11.96069908
10.96173668
11.44801617
11.13631439
11.42456055
11.48735237
12.45266342
11.64042854
12.56447601
12.75346947
12.57886505
11.82701397
11.97837830
11.84905338
10.91511440
11.63377190
11.78597450
12.11364555
11.39677620
12.75063515
11.96790981
11.83930397
12.07134056
11.42108536
11.69846153
12.65265751
11.26317978
11.59524632
11.49781895
11.86538124
11.59115601
12.29344463
11.95273399
10.07145405
11.85931587
12.23957062
11.47201538
11.54563427
12.33403397
11.61905861
11.52552223
11.00995827
11.94360924
11.46900368
11.95684814
11.09925842
12.73001480
11.58975887
11.12359238
11.14398193
11.99439907
12.16495514
11.45527458
11.23852158
12.99810791
11.31301403
11.64621449
11.44269657
11.16169739
12.50059128
12.35099602
11.28212929
12.61157227
11.77325249
11.85843468
12.05909824
11.86269760
12.04385662
11.43286705
11.68570518
11.60037613
12.50166130
11.86861134
11.67401123
11.42876530
11.55520535
11.38225460
11.70805645
11.60992622
12.27108765
11.78693390
10.89021683
11.74626732
12.32859230
12.11103058
11.64467525
11.81001568
11.19287205
11.53762722
12.28033733
11.66309929
11.53154945
11.54714203
12.06673050
11.31042480
11.84504128
11.85848713
12.26242733
11.63203335
11.18558788
10.61319923
11.47148609
11.60789680
11.83487892
11.04791832
11.16765594
10.84155846
11.70907974
12.05991745
11.90557480
11.74546719
11.23863983
12.87944984
10.75949669
11.87348843
12.23585320
12.10040188
11.78548145
11.60497475
12.23457050
11.40915489
11.61683273
11.68760777
11.83544350
11.75903606
11.81471252
11.04405117
11.42847347
11.94360924
11.74866962
11.60404396
12.33297348
11.87899685
11.67404366
11.59504414
11.48924255
12.22971249
11.33971977
11.84511185
11.83111382
12.41328049
11.55418777
11.89757729
11.42208290
11.99152565
10.57588482
12.20097637
12.26215935
11.97187519
11.99405956
11.45221043
12.31750488
12.26372719
12.81133461
11.36053658
11.47605133
11.30697632
11.54163742
10.68418884
11.74294376
12.09317684
12.06730843
11.71675396
11.98877335
12.99838257
11.72748470
11.64914131
11.76614189
11.98373127
12.58704948
11.38292789
12.69676399
11.77143478
11.47755051
10.79994011
11.77828026
12.40046310
11.31899452
11.53511238
11.20535088
12.03303719
11.32631397
11.12994003
11.87905693
12.22350311
11.23588848
11.74044895
10.97170067
12.19683933
11.56232643
11.66845703
12.12817287
11.23482227
11.86327839
12.00124264
12.07493210
11.25357246
11.49266052
11.80416107
12.35572624
12.22971535
11.52836323
12.44513988
11.87720966
12.32055092
11.88577080
11.97365284
10.88125801
12.36265755
11.20243549
11.31064987
11.71231461
12.19453430
11.61764336
12.14545059
11.31807041
11.39109039
12.12794590
11.50367546
12.26354885
10.90991211
13.09766865
12.02338028
11.97717094
11.01667881
10.81106186
10.62892056
12.37115288
12.94964600
12.13184834
11.23389244
11.38424587
11.06515598
11.86012650
11.84637642
11.61342335
12.04532814
11.54438686
11.64216805
11.81202412
11.00219631
11.27470970
11.91967297
11.39148331
11.67471600
12.00038528
11.37137985
12.10328674
11.85125351
11.92018127
11.73346519
11.86525440
12.08411407
11.19583511
11.45648956
11.25330734
12.21646214
11.63721085
12.22657681
12.04986477
11.78301620
11.17684364
11.55081463
11.35879803
12.01740456
11.90925217
11.61575222
10.77929497
10.89283180
11.08200359
11.64923763
11.48404026
11.94513130
10.67028141
11.23716927
11.88180542
11.23816395
12.39230824
12.06921387
12.41697502
11.67371464
11.65156651
11.28781223
11.21657181
12.54075050
11.58720112
11.56348038
11.31553841
11.89025879
11.01175308
10.96335125
11.47206688
11.55441284
11.68047047
11.53799248
12.12162113
11.01685715
11.08509445
11.53973103
11.31464100
11.93887901
