<svg
  viewBox="0 0 618 363"
  fill="none"
  xmlns="http://www.w3.org/2000/svg"
>
              <path
    opacity="0.2"
    d="M455.703 144.755C466.753 127.208 470.381 105.984 465.79 85.7515C461.198 65.5195 448.762 47.9367 431.218 36.8711C413.674 25.8056 392.459 22.1637 372.239 26.7467C352.02 31.3297 334.453 43.7621 323.402 61.309L455.703 144.755Z"
    stroke="white"
  />
              <path
    d="M603 351.152V351.16L607.649 353.898L610.338 362.312L613.035 353.898L617.676 351.152L613.035 348.414L610.338 340L607.649 348.414L603 351.152Z"
    fill="white"
  />
              <path
    d="M178 258.152V258.16L182.649 260.898L185.338 269.312L188.035 260.898L192.676 258.152L188.035 255.414L185.338 247L182.649 255.414L178 258.152Z"
    fill="white"
  />
              <path
    opacity="0.1"
    d="M0 327.963L-1.70314e-06 289L38.97 289L38.97 327.963L0 327.963Z"
    fill="#F7F0FF"
  />
            </svg>
