<svg width="792" height="601" viewBox="0 0 792 601" fill="none" xmlns="http://www.w3.org/2000/svg">
<path d="M1.18702 374.88C51.817 472.246 139.528 545.928 245.024 579.715C350.52 613.503 465.16 604.627 563.724 555.043C662.288 505.458 736.703 419.225 770.597 315.315C804.492 211.404 795.09 98.3287 744.46 0.961823L1.18702 374.88Z" stroke="#8041C6"/>
</svg>
