<svg viewBox="0 0 752 447" fill="none" xmlns="http://www.w3.org/2000/svg">
              <path
        d="M741.021 62.1727C717.911 32.4795 683.942 13.1772 646.587 8.51222C609.233 3.84727 571.552 14.2017 541.835 37.2976C512.117 60.3936 492.798 94.3391 488.125 131.667C483.453 168.994 493.812 206.646 516.922 236.339L741.021 62.1727Z"
        stroke="#8041C6"
    />
              <path
        opacity="0.1"
        d="M0 339.821C-8.35379e-07 353.769 2.7605 367.579 8.12394 380.465C13.4874 393.351 21.3485 405.059 31.2589 414.921C41.1692 424.783 52.9345 432.606 65.883 437.944C78.8315 443.281 92.7096 446.028 106.725 446.028C120.74 446.028 134.618 443.281 147.567 437.944C160.515 432.606 172.281 424.783 182.191 414.921C192.101 405.059 199.963 393.351 205.326 380.465C210.69 367.579 213.45 353.769 213.45 339.821C213.45 325.874 210.69 312.063 205.326 299.178C199.963 286.292 192.101 274.584 182.191 264.722C172.281 254.859 160.515 247.036 147.567 241.699C134.618 236.361 120.74 233.614 106.725 233.614C92.7096 233.614 78.8315 236.361 65.883 241.699C52.9345 247.036 41.1692 254.859 31.2589 264.722C21.3485 274.584 13.4874 286.292 8.12394 299.178C2.7605 312.063 -8.35379e-07 325.874 0 339.821Z"
        fill="#8041C6"
    />
            </svg>
