<svg
  width="809"
  height="643"
  viewBox="0 0 1209 643"
  fill="none"
  xmlns="http://www.w3.org/2000/svg"
>
                <g clip-path="url(#clip0_213_598)">
                  <path
      d="M1059.68 248.454V248.462L1064.33 251.2L1067.01 259.614L1069.71 251.2L1074.35 248.454L1069.71 245.716L1067.01 237.302L1064.33 245.716L1059.68 248.454Z"
      fill="white"
    />
                  <path
      d="M1056.38 228.821C1059.55 228.821 1059.56 233.635 1056.38 233.635C1053.21 233.635 1053.2 228.821 1056.38 228.821Z"
      fill="white"
    />
                  <path
      d="M1080.45 228.821C1083.62 228.821 1083.63 233.635 1080.45 233.635C1077.28 233.635 1077.27 228.821 1080.45 228.821Z"
      fill="white"
    />
                  <path
      d="M1096.85 248.772C1100.02 248.772 1100.03 253.586 1096.85 253.586C1093.69 253.586 1093.69 248.772 1096.85 248.772Z"
      fill="white"
    />
                  <path
      d="M1091.72 215.426V215.434L1094.97 217.351L1096.85 223.245L1098.75 217.351L1102 215.426L1098.75 213.508L1096.85 207.614L1094.97 213.508L1091.72 215.426Z"
      fill="white"
    />
                </g>
                <path
    opacity="0.1"
    d="M1102.41 436.021C1102.41 449.969 1105.17 463.78 1110.53 476.665C1115.89 489.551 1123.75 501.259 1133.67 511.121C1143.58 520.983 1155.34 528.807 1168.29 534.144C1181.24 539.481 1195.12 542.229 1209.13 542.229C1223.15 542.229 1237.02 539.481 1249.97 534.144C1262.92 528.807 1274.69 520.983 1284.6 511.121C1294.51 501.259 1302.37 489.551 1307.73 476.665C1313.1 463.78 1315.86 449.969 1315.86 436.021C1315.86 422.074 1313.1 408.263 1307.73 395.378C1302.37 382.492 1294.51 370.784 1284.6 360.922C1274.69 351.06 1262.92 343.236 1249.97 337.899C1237.02 332.562 1223.15 329.814 1209.13 329.814C1195.12 329.814 1181.24 332.562 1168.29 337.899C1155.34 343.236 1143.58 351.06 1133.67 360.922C1123.75 370.784 1115.89 382.492 1110.53 395.378C1105.17 408.263 1102.41 422.074 1102.41 436.021Z"
    fill="white"
  />
                <path
    opacity="0.2"
    d="M1106.7 145.369C1117.75 127.822 1121.38 106.598 1116.79 86.3658C1112.2 66.1337 1099.76 48.5509 1082.22 37.4854C1064.67 26.4198 1043.46 22.778 1023.24 27.361C1003.02 31.944 985.453 44.3764 974.402 61.9233L1106.7 145.369Z"
    stroke="white"
  />

                <path
    opacity="0.1"
    d="M865.535 221.897L797.999 221.897L797.999 184.615L865.535 184.615L865.535 221.897Z"
    fill="#DFF5E0"
  />
                <defs>
                  <clipPath id="clip0_213_598">
                    <rect
        width="68"
        height="72"
        fill="white"
        transform="translate(1054 207.614)"
      />
                  </clipPath>
                </defs>
              </svg>
