<svg width="249" height="209" viewBox="0 0 249 209" fill="none" xmlns="http://www.w3.org/2000/svg">
<path opacity="0.1" d="M141.066 207.88L72 207.88L72 138.802L141.066 138.802L141.066 207.88Z" stroke="#8041C6"/>
<path d="M67.5356 37.2827L-0.000106812 37.2827L-0.000110071 -0.000219163L67.5356 -0.000225067L67.5356 37.2827Z" fill="#DFF5E0"/>
<path d="M100.62 105.466L48.3905 105.466L48.3905 53.2278L100.62 53.2278L100.62 105.466Z" fill="#FFFBE6"/>
<path d="M248.878 74.071C248.878 66.181 247.325 58.3683 244.306 51.0789C241.287 43.7894 236.862 37.1661 231.284 31.5871C225.706 26.008 219.084 21.5824 211.796 18.5631C204.507 15.5437 196.696 13.9897 188.807 13.9897C180.919 13.9897 173.107 15.5437 165.819 18.5631C158.531 21.5825 151.909 26.008 146.331 31.5871C140.753 37.1662 136.328 43.7895 133.309 51.0789C130.29 58.3683 128.736 66.181 128.736 74.071C128.736 81.961 130.29 89.7737 133.309 97.0632C136.328 104.353 140.753 110.976 146.331 116.555C151.909 122.134 158.531 126.56 165.819 129.579C173.107 132.598 180.919 134.152 188.807 134.152C196.696 134.152 204.507 132.598 211.796 129.579C219.084 126.56 225.706 122.134 231.284 116.555C236.862 110.976 241.287 104.353 244.306 97.0631C247.325 89.7737 248.878 81.961 248.878 74.071Z" fill="#FFF5F5"/>
</svg>
