<svg width="221" height="229" viewBox="0 0 221 229" fill="none" xmlns="http://www.w3.org/2000/svg">
<path opacity="0.21" d="M329.044 180.561C330.935 170.012 330.116 158.822 325.738 148.958C321.643 139.72 314.956 131.794 306.558 126.176C303.833 124.344 300.914 122.824 297.876 121.617C297.772 122.526 297.519 123.39 297.146 124.239C297.012 124.552 296.864 124.85 296.715 125.163C309.804 130.482 320.317 142.373 324.323 155.931C330.875 178.117 320.63 202.493 304.086 217.513C286.976 233.053 263.403 240.071 240.694 241.188C238.222 241.308 235.72 241.352 233.218 241.322C232.072 231.369 229.48 221.565 225.087 212.536C220.426 202.94 213.785 194.418 205.848 187.311C189.795 172.917 169.349 164.365 148.904 158.33C148.263 158.137 147.638 157.973 146.997 157.779C144.674 132.226 149.559 106.658 153.967 81.5662C156.096 69.4377 158.553 57.19 158.955 44.853C159.298 34.5422 157.913 23.6504 152.09 14.8744C140.684 -2.32001 116.977 -3.42261 100.001 5.53221C83.4861 14.2486 74.7002 31.905 70.6796 49.7699C64.2465 45.2403 57.2923 41.4856 49.668 39.3549C39.4972 36.509 28.15 36.8964 18.6345 41.6793C8.82113 46.6111 2.58166 56.3854 0.675575 67.0388C-3.55355 90.67 12.7375 111.366 30.9943 124.165C51.306 138.409 75.564 145.189 99.4794 150.567C114.177 153.875 129.009 156.736 143.528 160.699C145.523 178.922 151.122 197.055 161.933 211.895C168.575 220.999 177.078 228.523 186.981 233.902C197.583 239.669 209.452 242.961 221.409 244.302C224.179 244.615 226.979 244.824 229.778 244.943C230.567 254.434 230.091 264.075 228.602 273.417C224.879 297.003 215.17 320.59 197.271 336.935C180.86 351.924 156.513 359.598 134.876 352.714C114.266 346.158 99.524 328.651 81.6396 317.371C74.0748 312.603 65.8548 309.102 57.0094 307.97C57.054 308.089 57.0987 308.223 57.1136 308.372C57.3072 309.519 56.8902 310.637 56.2499 311.575C76.5169 313.855 92.0933 329.962 107.67 341.643C116.113 347.991 125.152 353.787 135.382 356.767C145.985 359.851 157.347 359.598 167.994 356.886C190.689 351.134 208.484 334.536 219.265 314.183C230.165 293.621 235.273 269.066 233.62 245.867C233.605 245.599 233.561 245.331 233.546 245.047C252.666 245.316 272.144 241.248 289.001 232.412C309.134 221.923 324.978 203.253 329.044 180.561ZM79.7484 141.836C56.8307 135.384 33.4215 125.506 17.3836 107.209C10.0422 98.8351 4.45798 88.3605 3.78787 77.0813C3.16244 66.3981 6.84058 54.8657 15.4775 48.0862C23.8911 41.5005 35.2532 40.1297 45.4984 42.1859C54.4332 43.9887 62.5191 48.3991 69.8457 53.7631C69.3245 56.5493 68.9075 59.3207 68.5948 62.0623C67.4184 72.4475 66.0484 86.0957 75.0874 93.5606C78.84 96.6746 84.0817 98.403 88.847 96.7194C93.4633 95.0804 96.3671 90.6849 97.201 85.9765C99.2709 74.2951 89.4873 65.4743 81.5949 58.5012C79.123 56.3258 76.5765 54.1952 73.9408 52.1837C74.1939 50.9619 74.462 49.7252 74.7598 48.5034C77.4849 37.4328 82.2055 26.6453 89.934 18.1375C96.6947 10.6876 105.704 5.68121 115.681 4.14652C124.839 2.74594 134.861 4.11673 142.381 9.86807C160.593 23.7994 155.307 51.1407 152.075 70.4956C147.638 97.062 141.666 123.792 142.768 150.88C142.843 152.817 142.977 154.754 143.141 156.691C122.203 151.044 100.671 147.722 79.7484 141.836ZM73.1962 56.3109C74.6704 57.488 76.1298 58.68 77.5445 59.9018C85.0497 66.3683 96.4713 75.4274 93.225 86.7662C91.8699 91.5044 87.611 94.544 82.6819 93.3967C77.4402 92.1749 73.9855 87.6304 72.5708 82.6539C71.0072 77.1558 71.4688 71.1661 71.99 65.5489C72.2729 62.4497 72.6899 59.3803 73.1962 56.3109ZM173.34 219.39C157.749 204.371 150.006 182.96 147.429 161.832C153.877 163.694 160.251 165.795 166.505 168.283C186.251 176.151 205.237 187.832 217.091 205.95C224.075 216.619 227.917 228.747 229.421 241.233C208.901 240.28 188.351 233.858 173.34 219.39Z" fill="white"/>
</svg>
