<svg xmlns="http://www.w3.org/2000/svg" viewBox="0 0 24 24" fill="none" stroke="#fff" stroke-width="2" stroke-linecap="round" stroke-linejoin="round">
  <path d="M19,6.41l-1.41,-1.41l-6.59,6.59l-6.59,-6.59l-1.41,1.41l6.59,6.59l-6.59,6.59l1.41,1.41l6.59,-6.59l6.59,6.59l1.41,-1.41l-6.59,-6.59z"/>
</svg>
