\BOOKMARK [0][-]{chapter.1}{\376\377\0001\000\040\000H\000i\000e\000r\000a\000r\000c\000h\000i\000c\000a\000l\000\040\000I\000n\000d\000e\000x}{}% 1
\BOOKMARK [1][-]{section.1.1}{\376\377\0001\000.\0001\000\040\000C\000l\000a\000s\000s\000\040\000H\000i\000e\000r\000a\000r\000c\000h\000y}{chapter.1}% 2
\BOOKMARK [0][-]{chapter.2}{\376\377\0002\000\040\000C\000l\000a\000s\000s\000\040\000I\000n\000d\000e\000x}{}% 3
\BOOKMARK [1][-]{section.2.1}{\376\377\0002\000.\0001\000\040\000C\000l\000a\000s\000s\000\040\000L\000i\000s\000t}{chapter.2}% 4
\BOOKMARK [0][-]{chapter.3}{\376\377\0003\000\040\000F\000i\000l\000e\000\040\000I\000n\000d\000e\000x}{}% 5
\BOOKMARK [1][-]{section.3.1}{\376\377\0003\000.\0001\000\040\000F\000i\000l\000e\000\040\000L\000i\000s\000t}{chapter.3}% 6
\BOOKMARK [0][-]{chapter.4}{\376\377\0004\000\040\000C\000l\000a\000s\000s\000\040\000D\000o\000c\000u\000m\000e\000n\000t\000a\000t\000i\000o\000n}{}% 7
\BOOKMARK [1][-]{section.4.1}{\376\377\0004\000.\0001\000\040\000B\000i\000l\000l\000b\000o\000a\000r\000d\000\040\000C\000l\000a\000s\000s\000\040\000R\000e\000f\000e\000r\000e\000n\000c\000e}{chapter.4}% 8
\BOOKMARK [2][-]{subsection.4.1.1}{\376\377\0004\000.\0001\000.\0001\000\040\000D\000e\000t\000a\000i\000l\000e\000d\000\040\000D\000e\000s\000c\000r\000i\000p\000t\000i\000o\000n}{section.4.1}% 9
\BOOKMARK [2][-]{subsection.4.1.2}{\376\377\0004\000.\0001\000.\0002\000\040\000C\000o\000n\000s\000t\000r\000u\000c\000t\000o\000r\000\040\000\046\000\040\000D\000e\000s\000t\000r\000u\000c\000t\000o\000r\000\040\000D\000o\000c\000u\000m\000e\000n\000t\000a\000t\000i\000o\000n}{section.4.1}% 10
\BOOKMARK [3][-]{subsubsection.4.1.2.1}{\376\377\0004\000.\0001\000.\0002\000.\0001\000\040\000B\000i\000l\000l\000b\000o\000a\000r\000d\000\050\000\051\000\040\000[\0001\000/\0002\000]}{subsection.4.1.2}% 11
\BOOKMARK [3][-]{subsubsection.4.1.2.2}{\376\377\0004\000.\0001\000.\0002\000.\0002\000\040\000B\000i\000l\000l\000b\000o\000a\000r\000d\000\050\000\051\000\040\000[\0002\000/\0002\000]}{subsection.4.1.2}% 12
\BOOKMARK [2][-]{subsection.4.1.3}{\376\377\0004\000.\0001\000.\0003\000\040\000M\000e\000m\000b\000e\000r\000\040\000F\000u\000n\000c\000t\000i\000o\000n\000\040\000D\000o\000c\000u\000m\000e\000n\000t\000a\000t\000i\000o\000n}{section.4.1}% 13
\BOOKMARK [3][-]{subsubsection.4.1.3.1}{\376\377\0004\000.\0001\000.\0003\000.\0001\000\040\000g\000e\000t\000A\000l\000i\000g\000n\000V\000e\000r\000t\000i\000c\000a\000l\000\050\000\051}{subsection.4.1.3}% 14
\BOOKMARK [3][-]{subsubsection.4.1.3.2}{\376\377\0004\000.\0001\000.\0003\000.\0002\000\040\000g\000e\000t\000M\000a\000t\000e\000r\000i\000a\000l\000\050\000\051}{subsection.4.1.3}% 15
\BOOKMARK [3][-]{subsubsection.4.1.3.3}{\376\377\0004\000.\0001\000.\0003\000.\0003\000\040\000g\000e\000t\000T\000r\000a\000n\000s\000f\000o\000r\000m\000\050\000\051}{subsection.4.1.3}% 16
\BOOKMARK [3][-]{subsubsection.4.1.3.4}{\376\377\0004\000.\0001\000.\0003\000.\0004\000\040\000s\000e\000t\000A\000l\000i\000g\000n\000V\000e\000r\000t\000i\000c\000a\000l\000\050\000\051}{subsection.4.1.3}% 17
\BOOKMARK [3][-]{subsubsection.4.1.3.5}{\376\377\0004\000.\0001\000.\0003\000.\0005\000\040\000s\000e\000t\000M\000a\000t\000e\000r\000i\000a\000l\000\050\000\051}{subsection.4.1.3}% 18
\BOOKMARK [2][-]{subsection.4.1.4}{\376\377\0004\000.\0001\000.\0004\000\040\000M\000e\000m\000b\000e\000r\000\040\000D\000a\000t\000a\000\040\000D\000o\000c\000u\000m\000e\000n\000t\000a\000t\000i\000o\000n}{section.4.1}% 19
\BOOKMARK [3][-]{subsubsection.4.1.4.1}{\376\377\0004\000.\0001\000.\0004\000.\0001\000\040\000c\000a\000m\000e\000r\000a}{subsection.4.1.4}% 20
\BOOKMARK [3][-]{subsubsection.4.1.4.2}{\376\377\0004\000.\0001\000.\0004\000.\0002\000\040\000u\000i\000d}{subsection.4.1.4}% 21
\BOOKMARK [1][-]{section.4.2}{\376\377\0004\000.\0002\000\040\000B\000i\000l\000l\000b\000o\000a\000r\000d\000T\000r\000a\000n\000s\000f\000o\000r\000m\000\040\000C\000l\000a\000s\000s\000\040\000R\000e\000f\000e\000r\000e\000n\000c\000e}{chapter.4}% 22
\BOOKMARK [2][-]{subsection.4.2.1}{\376\377\0004\000.\0002\000.\0001\000\040\000D\000e\000t\000a\000i\000l\000e\000d\000\040\000D\000e\000s\000c\000r\000i\000p\000t\000i\000o\000n}{section.4.2}% 23
\BOOKMARK [2][-]{subsection.4.2.2}{\376\377\0004\000.\0002\000.\0002\000\040\000C\000o\000n\000s\000t\000r\000u\000c\000t\000o\000r\000\040\000\046\000\040\000D\000e\000s\000t\000r\000u\000c\000t\000o\000r\000\040\000D\000o\000c\000u\000m\000e\000n\000t\000a\000t\000i\000o\000n}{section.4.2}% 24
\BOOKMARK [3][-]{subsubsection.4.2.2.1}{\376\377\0004\000.\0002\000.\0002\000.\0001\000\040\000B\000i\000l\000l\000b\000o\000a\000r\000d\000T\000r\000a\000n\000s\000f\000o\000r\000m\000\050\000\051\000\040\000[\0001\000/\0002\000]}{subsection.4.2.2}% 25
\BOOKMARK [3][-]{subsubsection.4.2.2.2}{\376\377\0004\000.\0002\000.\0002\000.\0002\000\040\000B\000i\000l\000l\000b\000o\000a\000r\000d\000T\000r\000a\000n\000s\000f\000o\000r\000m\000\050\000\051\000\040\000[\0002\000/\0002\000]}{subsection.4.2.2}% 26
\BOOKMARK [2][-]{subsection.4.2.3}{\376\377\0004\000.\0002\000.\0003\000\040\000M\000e\000m\000b\000e\000r\000\040\000F\000u\000n\000c\000t\000i\000o\000n\000\040\000D\000o\000c\000u\000m\000e\000n\000t\000a\000t\000i\000o\000n}{section.4.2}% 27
\BOOKMARK [3][-]{subsubsection.4.2.3.1}{\376\377\0004\000.\0002\000.\0003\000.\0001\000\040\000g\000e\000t\000A\000l\000i\000g\000n\000V\000e\000r\000t\000i\000c\000a\000l\000\050\000\051}{subsection.4.2.3}% 28
\BOOKMARK [3][-]{subsubsection.4.2.3.2}{\376\377\0004\000.\0002\000.\0003\000.\0002\000\040\000s\000e\000t\000A\000l\000i\000g\000n\000V\000e\000r\000t\000i\000c\000a\000l\000\050\000\051}{subsection.4.2.3}% 29
\BOOKMARK [3][-]{subsubsection.4.2.3.3}{\376\377\0004\000.\0002\000.\0003\000.\0003\000\040\000u\000p\000d\000a\000t\000e\000\137\000g\000l\000o\000b\000a\000l\000\137\000t\000f\000\050\000\051\000\040\000[\0001\000/\0002\000]}{subsection.4.2.3}% 30
\BOOKMARK [3][-]{subsubsection.4.2.3.4}{\376\377\0004\000.\0002\000.\0003\000.\0004\000\040\000u\000p\000d\000a\000t\000e\000\137\000g\000l\000o\000b\000a\000l\000\137\000t\000f\000\050\000\051\000\040\000[\0002\000/\0002\000]}{subsection.4.2.3}% 31
\BOOKMARK [2][-]{subsection.4.2.4}{\376\377\0004\000.\0002\000.\0004\000\040\000M\000e\000m\000b\000e\000r\000\040\000D\000a\000t\000a\000\040\000D\000o\000c\000u\000m\000e\000n\000t\000a\000t\000i\000o\000n}{section.4.2}% 32
\BOOKMARK [3][-]{subsubsection.4.2.4.1}{\376\377\0004\000.\0002\000.\0004\000.\0001\000\040\000c\000a\000m\000e\000r\000a}{subsection.4.2.4}% 33
\BOOKMARK [3][-]{subsubsection.4.2.4.2}{\376\377\0004\000.\0002\000.\0004\000.\0002\000\040\000u\000i\000d}{subsection.4.2.4}% 34
\BOOKMARK [1][-]{section.4.3}{\376\377\0004\000.\0003\000\040\000B\000o\000x\000\040\000C\000l\000a\000s\000s\000\040\000R\000e\000f\000e\000r\000e\000n\000c\000e}{chapter.4}% 35
\BOOKMARK [2][-]{subsection.4.3.1}{\376\377\0004\000.\0003\000.\0001\000\040\000C\000o\000n\000s\000t\000r\000u\000c\000t\000o\000r\000\040\000\046\000\040\000D\000e\000s\000t\000r\000u\000c\000t\000o\000r\000\040\000D\000o\000c\000u\000m\000e\000n\000t\000a\000t\000i\000o\000n}{section.4.3}% 36
\BOOKMARK [3][-]{subsubsection.4.3.1.1}{\376\377\0004\000.\0003\000.\0001\000.\0001\000\040\000B\000o\000x\000\050\000\051\000\040\000[\0001\000/\0003\000]}{subsection.4.3.1}% 37
\BOOKMARK [3][-]{subsubsection.4.3.1.2}{\376\377\0004\000.\0003\000.\0001\000.\0002\000\040\000B\000o\000x\000\050\000\051\000\040\000[\0002\000/\0003\000]}{subsection.4.3.1}% 38
\BOOKMARK [3][-]{subsubsection.4.3.1.3}{\376\377\0004\000.\0003\000.\0001\000.\0003\000\040\000B\000o\000x\000\050\000\051\000\040\000[\0003\000/\0003\000]}{subsection.4.3.1}% 39
\BOOKMARK [3][-]{subsubsection.4.3.1.4}{\376\377\0004\000.\0003\000.\0001\000.\0004\000\040\000\040\000B\000o\000x\000\050\000\051}{subsection.4.3.1}% 40
\BOOKMARK [2][-]{subsection.4.3.2}{\376\377\0004\000.\0003\000.\0002\000\040\000M\000e\000m\000b\000e\000r\000\040\000F\000u\000n\000c\000t\000i\000o\000n\000\040\000D\000o\000c\000u\000m\000e\000n\000t\000a\000t\000i\000o\000n}{section.4.3}% 41
\BOOKMARK [3][-]{subsubsection.4.3.2.1}{\376\377\0004\000.\0003\000.\0002\000.\0001\000\040\000e\000x\000p\000a\000n\000d\000T\000o\000I\000n\000c\000l\000u\000d\000e\000\050\000\051\000\040\000[\0001\000/\0002\000]}{subsection.4.3.2}% 42
\BOOKMARK [3][-]{subsubsection.4.3.2.2}{\376\377\0004\000.\0003\000.\0002\000.\0002\000\040\000e\000x\000p\000a\000n\000d\000T\000o\000I\000n\000c\000l\000u\000d\000e\000\050\000\051\000\040\000[\0002\000/\0002\000]}{subsection.4.3.2}% 43
\BOOKMARK [3][-]{subsubsection.4.3.2.3}{\376\377\0004\000.\0003\000.\0002\000.\0003\000\040\000h\000i\000t\000\050\000\051}{subsection.4.3.2}% 44
\BOOKMARK [3][-]{subsubsection.4.3.2.4}{\376\377\0004\000.\0003\000.\0002\000.\0004\000\040\000m\000a\000x\000D\000i\000m\000e\000n\000s\000i\000o\000n\000\050\000\051}{subsection.4.3.2}% 45
\BOOKMARK [3][-]{subsubsection.4.3.2.5}{\376\377\0004\000.\0003\000.\0002\000.\0005\000\040\000s\000u\000r\000f\000a\000c\000e\000A\000r\000e\000a\000\050\000\051}{subsection.4.3.2}% 46
\BOOKMARK [2][-]{subsection.4.3.3}{\376\377\0004\000.\0003\000.\0003\000\040\000M\000e\000m\000b\000e\000r\000\040\000D\000a\000t\000a\000\040\000D\000o\000c\000u\000m\000e\000n\000t\000a\000t\000i\000o\000n}{section.4.3}% 47
\BOOKMARK [3][-]{subsubsection.4.3.3.1}{\376\377\0004\000.\0003\000.\0003\000.\0001\000\040\000e\000x\000t\000e\000n\000t}{subsection.4.3.3}% 48
\BOOKMARK [3][-]{subsubsection.4.3.3.2}{\376\377\0004\000.\0003\000.\0003\000.\0002\000\040\000m\000a\000x}{subsection.4.3.3}% 49
\BOOKMARK [3][-]{subsubsection.4.3.3.3}{\376\377\0004\000.\0003\000.\0003\000.\0003\000\040\000m\000i\000n}{subsection.4.3.3}% 50
\BOOKMARK [1][-]{section.4.4}{\376\377\0004\000.\0004\000\040\000B\000V\000H\000\040\000C\000l\000a\000s\000s\000\040\000R\000e\000f\000e\000r\000e\000n\000c\000e}{chapter.4}% 51
\BOOKMARK [2][-]{subsection.4.4.1}{\376\377\0004\000.\0004\000.\0001\000\040\000D\000e\000t\000a\000i\000l\000e\000d\000\040\000D\000e\000s\000c\000r\000i\000p\000t\000i\000o\000n}{section.4.4}% 52
\BOOKMARK [2][-]{subsection.4.4.2}{\376\377\0004\000.\0004\000.\0002\000\040\000C\000o\000n\000s\000t\000r\000u\000c\000t\000o\000r\000\040\000\046\000\040\000D\000e\000s\000t\000r\000u\000c\000t\000o\000r\000\040\000D\000o\000c\000u\000m\000e\000n\000t\000a\000t\000i\000o\000n}{section.4.4}% 53
\BOOKMARK [3][-]{subsubsection.4.4.2.1}{\376\377\0004\000.\0004\000.\0002\000.\0001\000\040\000B\000V\000H\000\050\000\051\000\040\000[\0001\000/\0002\000]}{subsection.4.4.2}% 54
\BOOKMARK [3][-]{subsubsection.4.4.2.2}{\376\377\0004\000.\0004\000.\0002\000.\0002\000\040\000B\000V\000H\000\050\000\051\000\040\000[\0002\000/\0002\000]}{subsection.4.4.2}% 55
\BOOKMARK [3][-]{subsubsection.4.4.2.3}{\376\377\0004\000.\0004\000.\0002\000.\0003\000\040\000\040\000B\000V\000H\000\050\000\051}{subsection.4.4.2}% 56
\BOOKMARK [2][-]{subsection.4.4.3}{\376\377\0004\000.\0004\000.\0003\000\040\000M\000e\000m\000b\000e\000r\000\040\000F\000u\000n\000c\000t\000i\000o\000n\000\040\000D\000o\000c\000u\000m\000e\000n\000t\000a\000t\000i\000o\000n}{section.4.4}% 57
\BOOKMARK [3][-]{subsubsection.4.4.3.1}{\376\377\0004\000.\0004\000.\0003\000.\0001\000\040\000g\000e\000t\000I\000n\000t\000e\000r\000s\000e\000c\000t\000i\000o\000n\000\050\000\051}{subsection.4.4.3}% 58
\BOOKMARK [1][-]{section.4.5}{\376\377\0004\000.\0005\000\040\000B\000V\000H\000B\000u\000i\000l\000d\000E\000n\000t\000r\000y\000\040\000S\000t\000r\000u\000c\000t\000\040\000R\000e\000f\000e\000r\000e\000n\000c\000e}{chapter.4}% 59
\BOOKMARK [2][-]{subsection.4.5.1}{\376\377\0004\000.\0005\000.\0001\000\040\000M\000e\000m\000b\000e\000r\000\040\000D\000a\000t\000a\000\040\000D\000o\000c\000u\000m\000e\000n\000t\000a\000t\000i\000o\000n}{section.4.5}% 60
\BOOKMARK [3][-]{subsubsection.4.5.1.1}{\376\377\0004\000.\0005\000.\0001\000.\0001\000\040\000e\000n\000d}{subsection.4.5.1}% 61
\BOOKMARK [3][-]{subsubsection.4.5.1.2}{\376\377\0004\000.\0005\000.\0001\000.\0002\000\040\000p\000a\000r\000e\000n\000t}{subsection.4.5.1}% 62
\BOOKMARK [3][-]{subsubsection.4.5.1.3}{\376\377\0004\000.\0005\000.\0001\000.\0003\000\040\000s\000t\000a\000r\000t}{subsection.4.5.1}% 63
\BOOKMARK [1][-]{section.4.6}{\376\377\0004\000.\0006\000\040\000B\000V\000H\000F\000l\000a\000t\000N\000o\000d\000e\000\040\000S\000t\000r\000u\000c\000t\000\040\000R\000e\000f\000e\000r\000e\000n\000c\000e}{chapter.4}% 64
\BOOKMARK [2][-]{subsection.4.6.1}{\376\377\0004\000.\0006\000.\0001\000\040\000D\000e\000t\000a\000i\000l\000e\000d\000\040\000D\000e\000s\000c\000r\000i\000p\000t\000i\000o\000n}{section.4.6}% 65
\BOOKMARK [2][-]{subsection.4.6.2}{\376\377\0004\000.\0006\000.\0002\000\040\000M\000e\000m\000b\000e\000r\000\040\000D\000a\000t\000a\000\040\000D\000o\000c\000u\000m\000e\000n\000t\000a\000t\000i\000o\000n}{section.4.6}% 66
\BOOKMARK [3][-]{subsubsection.4.6.2.1}{\376\377\0004\000.\0006\000.\0002\000.\0001\000\040\000b\000b\000o\000x}{subsection.4.6.2}% 67
\BOOKMARK [3][-]{subsubsection.4.6.2.2}{\376\377\0004\000.\0006\000.\0002\000.\0002\000\040\000n\000P\000r\000i\000m\000s}{subsection.4.6.2}% 68
\BOOKMARK [3][-]{subsubsection.4.6.2.3}{\376\377\0004\000.\0006\000.\0002\000.\0003\000\040\000r\000i\000g\000h\000t\000O\000f\000f\000s\000e\000t}{subsection.4.6.2}% 69
\BOOKMARK [3][-]{subsubsection.4.6.2.4}{\376\377\0004\000.\0006\000.\0002\000.\0004\000\040\000s\000t\000a\000r\000t}{subsection.4.6.2}% 70
\BOOKMARK [1][-]{section.4.7}{\376\377\0004\000.\0007\000\040\000B\000V\000H\000T\000r\000a\000v\000e\000r\000s\000a\000l\000\040\000S\000t\000r\000u\000c\000t\000\040\000R\000e\000f\000e\000r\000e\000n\000c\000e}{chapter.4}% 71
\BOOKMARK [2][-]{subsection.4.7.1}{\376\377\0004\000.\0007\000.\0001\000\040\000D\000e\000t\000a\000i\000l\000e\000d\000\040\000D\000e\000s\000c\000r\000i\000p\000t\000i\000o\000n}{section.4.7}% 72
\BOOKMARK [2][-]{subsection.4.7.2}{\376\377\0004\000.\0007\000.\0002\000\040\000C\000o\000n\000s\000t\000r\000u\000c\000t\000o\000r\000\040\000\046\000\040\000D\000e\000s\000t\000r\000u\000c\000t\000o\000r\000\040\000D\000o\000c\000u\000m\000e\000n\000t\000a\000t\000i\000o\000n}{section.4.7}% 73
\BOOKMARK [3][-]{subsubsection.4.7.2.1}{\376\377\0004\000.\0007\000.\0002\000.\0001\000\040\000B\000V\000H\000T\000r\000a\000v\000e\000r\000s\000a\000l\000\050\000\051\000\040\000[\0001\000/\0002\000]}{subsection.4.7.2}% 74
\BOOKMARK [3][-]{subsubsection.4.7.2.2}{\376\377\0004\000.\0007\000.\0002\000.\0002\000\040\000B\000V\000H\000T\000r\000a\000v\000e\000r\000s\000a\000l\000\050\000\051\000\040\000[\0002\000/\0002\000]}{subsection.4.7.2}% 75
\BOOKMARK [2][-]{subsection.4.7.3}{\376\377\0004\000.\0007\000.\0003\000\040\000M\000e\000m\000b\000e\000r\000\040\000D\000a\000t\000a\000\040\000D\000o\000c\000u\000m\000e\000n\000t\000a\000t\000i\000o\000n}{section.4.7}% 76
\BOOKMARK [3][-]{subsubsection.4.7.3.1}{\376\377\0004\000.\0007\000.\0003\000.\0001\000\040\000i}{subsection.4.7.3}% 77
\BOOKMARK [3][-]{subsubsection.4.7.3.2}{\376\377\0004\000.\0007\000.\0003\000.\0002\000\040\000m\000i\000n\000t}{subsection.4.7.3}% 78
\BOOKMARK [1][-]{section.4.8}{\376\377\0004\000.\0008\000\040\000C\000a\000m\000e\000r\000a\000\040\000C\000l\000a\000s\000s\000\040\000R\000e\000f\000e\000r\000e\000n\000c\000e}{chapter.4}% 79
\BOOKMARK [2][-]{subsection.4.8.1}{\376\377\0004\000.\0008\000.\0001\000\040\000D\000e\000t\000a\000i\000l\000e\000d\000\040\000D\000e\000s\000c\000r\000i\000p\000t\000i\000o\000n}{section.4.8}% 80
\BOOKMARK [2][-]{subsection.4.8.2}{\376\377\0004\000.\0008\000.\0002\000\040\000C\000o\000n\000s\000t\000r\000u\000c\000t\000o\000r\000\040\000\046\000\040\000D\000e\000s\000t\000r\000u\000c\000t\000o\000r\000\040\000D\000o\000c\000u\000m\000e\000n\000t\000a\000t\000i\000o\000n}{section.4.8}% 81
\BOOKMARK [3][-]{subsubsection.4.8.2.1}{\376\377\0004\000.\0008\000.\0002\000.\0001\000\040\000C\000a\000m\000e\000r\000a\000\050\000\051\000\040\000[\0001\000/\0002\000]}{subsection.4.8.2}% 82
\BOOKMARK [3][-]{subsubsection.4.8.2.2}{\376\377\0004\000.\0008\000.\0002\000.\0002\000\040\000C\000a\000m\000e\000r\000a\000\050\000\051\000\040\000[\0002\000/\0002\000]}{subsection.4.8.2}% 83
\BOOKMARK [2][-]{subsection.4.8.3}{\376\377\0004\000.\0008\000.\0003\000\040\000M\000e\000m\000b\000e\000r\000\040\000F\000u\000n\000c\000t\000i\000o\000n\000\040\000D\000o\000c\000u\000m\000e\000n\000t\000a\000t\000i\000o\000n}{section.4.8}% 84
\BOOKMARK [3][-]{subsubsection.4.8.3.1}{\376\377\0004\000.\0008\000.\0003\000.\0001\000\040\000l\000o\000o\000k\000\137\000a\000t\000\050\000\051}{subsection.4.8.3}% 85
\BOOKMARK [3][-]{subsubsection.4.8.3.2}{\376\377\0004\000.\0008\000.\0003\000.\0002\000\040\000m\000o\000v\000e\000\050\000\051}{subsection.4.8.3}% 86
\BOOKMARK [3][-]{subsubsection.4.8.3.3}{\376\377\0004\000.\0008\000.\0003\000.\0003\000\040\000m\000o\000v\000e\000\137\000a\000t\000\050\000\051}{subsection.4.8.3}% 87
\BOOKMARK [3][-]{subsubsection.4.8.3.4}{\376\377\0004\000.\0008\000.\0003\000.\0004\000\040\000s\000e\000t\000T\000r\000a\000n\000s\000f\000o\000r\000m\000\050\000\051}{subsection.4.8.3}% 88
\BOOKMARK [3][-]{subsubsection.4.8.3.5}{\376\377\0004\000.\0008\000.\0003\000.\0005\000\040\000t\000r\000a\000n\000s\000f\000o\000r\000m\000\050\000\051\000\040\000[\0001\000/\0002\000]}{subsection.4.8.3}% 89
\BOOKMARK [3][-]{subsubsection.4.8.3.6}{\376\377\0004\000.\0008\000.\0003\000.\0006\000\040\000t\000r\000a\000n\000s\000f\000o\000r\000m\000\050\000\051\000\040\000[\0002\000/\0002\000]}{subsection.4.8.3}% 90
\BOOKMARK [3][-]{subsubsection.4.8.3.7}{\376\377\0004\000.\0008\000.\0003\000.\0007\000\040\000v\000i\000e\000w\000\137\000r\000a\000y\000\050\000\051}{subsection.4.8.3}% 91
\BOOKMARK [2][-]{subsection.4.8.4}{\376\377\0004\000.\0008\000.\0004\000\040\000M\000e\000m\000b\000e\000r\000\040\000D\000a\000t\000a\000\040\000D\000o\000c\000u\000m\000e\000n\000t\000a\000t\000i\000o\000n}{section.4.8}% 92
\BOOKMARK [3][-]{subsubsection.4.8.4.1}{\376\377\0004\000.\0008\000.\0004\000.\0001\000\040\000a}{subsection.4.8.4}% 93
\BOOKMARK [3][-]{subsubsection.4.8.4.2}{\376\377\0004\000.\0008\000.\0004\000.\0002\000\040\000b}{subsection.4.8.4}% 94
\BOOKMARK [3][-]{subsubsection.4.8.4.3}{\376\377\0004\000.\0008\000.\0004\000.\0003\000\040\000d}{subsection.4.8.4}% 95
\BOOKMARK [3][-]{subsubsection.4.8.4.4}{\376\377\0004\000.\0008\000.\0004\000.\0004\000\040\000e}{subsection.4.8.4}% 96
\BOOKMARK [3][-]{subsubsection.4.8.4.5}{\376\377\0004\000.\0008\000.\0004\000.\0005\000\040\000l}{subsection.4.8.4}% 97
\BOOKMARK [3][-]{subsubsection.4.8.4.6}{\376\377\0004\000.\0008\000.\0004\000.\0006\000\040\000n\000x}{subsection.4.8.4}% 98
\BOOKMARK [3][-]{subsubsection.4.8.4.7}{\376\377\0004\000.\0008\000.\0004\000.\0007\000\040\000n\000y}{subsection.4.8.4}% 99
\BOOKMARK [3][-]{subsubsection.4.8.4.8}{\376\377\0004\000.\0008\000.\0004\000.\0008\000\040\000o\000r\000i\000e\000n\000t\000a\000t\000i\000o\000n\000\137\000f\000i\000x\000e\000d}{subsection.4.8.4}% 100
\BOOKMARK [3][-]{subsubsection.4.8.4.9}{\376\377\0004\000.\0008\000.\0004\000.\0009\000\040\000r}{subsection.4.8.4}% 101
\BOOKMARK [3][-]{subsubsection.4.8.4.10}{\376\377\0004\000.\0008\000.\0004\000.\0001\0000\000\040\000t}{subsection.4.8.4}% 102
\BOOKMARK [3][-]{subsubsection.4.8.4.11}{\376\377\0004\000.\0008\000.\0004\000.\0001\0001\000\040\000t\000f}{subsection.4.8.4}% 103
\BOOKMARK [3][-]{subsubsection.4.8.4.12}{\376\377\0004\000.\0008\000.\0004\000.\0001\0002\000\040\000u}{subsection.4.8.4}% 104
\BOOKMARK [3][-]{subsubsection.4.8.4.13}{\376\377\0004\000.\0008\000.\0004\000.\0001\0003\000\040\000v}{subsection.4.8.4}% 105
\BOOKMARK [3][-]{subsubsection.4.8.4.14}{\376\377\0004\000.\0008\000.\0004\000.\0001\0004\000\040\000v\000i\000e\000w\000p\000o\000r\000t\000\137\000h\000e\000i\000g\000h\000t}{subsection.4.8.4}% 106
\BOOKMARK [3][-]{subsubsection.4.8.4.15}{\376\377\0004\000.\0008\000.\0004\000.\0001\0005\000\040\000v\000i\000e\000w\000p\000o\000r\000t\000\137\000w\000i\000d\000t\000h}{subsection.4.8.4}% 107
\BOOKMARK [3][-]{subsubsection.4.8.4.16}{\376\377\0004\000.\0008\000.\0004\000.\0001\0006\000\040\000w}{subsection.4.8.4}% 108
\BOOKMARK [1][-]{section.4.9}{\376\377\0004\000.\0009\000\040\000h\000i\000t\000\137\000r\000e\000c\000\040\000S\000t\000r\000u\000c\000t\000\040\000R\000e\000f\000e\000r\000e\000n\000c\000e}{chapter.4}% 109
\BOOKMARK [2][-]{subsection.4.9.1}{\376\377\0004\000.\0009\000.\0001\000\040\000D\000e\000t\000a\000i\000l\000e\000d\000\040\000D\000e\000s\000c\000r\000i\000p\000t\000i\000o\000n}{section.4.9}% 110
\BOOKMARK [2][-]{subsection.4.9.2}{\376\377\0004\000.\0009\000.\0002\000\040\000M\000e\000m\000b\000e\000r\000\040\000D\000a\000t\000a\000\040\000D\000o\000c\000u\000m\000e\000n\000t\000a\000t\000i\000o\000n}{section.4.9}% 111
\BOOKMARK [3][-]{subsubsection.4.9.2.1}{\376\377\0004\000.\0009\000.\0002\000.\0001\000\040\000a\000l\000p\000h\000a}{subsection.4.9.2}% 112
\BOOKMARK [3][-]{subsubsection.4.9.2.2}{\376\377\0004\000.\0009\000.\0002\000.\0002\000\040\000b\000e\000t\000a}{subsection.4.9.2}% 113
\BOOKMARK [3][-]{subsubsection.4.9.2.3}{\376\377\0004\000.\0009\000.\0002\000.\0003\000\040\000g\000a\000m\000m\000a}{subsection.4.9.2}% 114
\BOOKMARK [3][-]{subsubsection.4.9.2.4}{\376\377\0004\000.\0009\000.\0002\000.\0004\000\040\000n\000o\000r\000m\000a\000l}{subsection.4.9.2}% 115
\BOOKMARK [3][-]{subsubsection.4.9.2.5}{\376\377\0004\000.\0009\000.\0002\000.\0005\000\040\000p\000o\000i\000n\000t}{subsection.4.9.2}% 116
\BOOKMARK [3][-]{subsubsection.4.9.2.6}{\376\377\0004\000.\0009\000.\0002\000.\0006\000\040\000s\000u\000r\000f\000a\000c\000e}{subsection.4.9.2}% 117
\BOOKMARK [3][-]{subsubsection.4.9.2.7}{\376\377\0004\000.\0009\000.\0002\000.\0007\000\040\000t}{subsection.4.9.2}% 118
\BOOKMARK [3][-]{subsubsection.4.9.2.8}{\376\377\0004\000.\0009\000.\0002\000.\0008\000\040\000t\000e\000x\000\137\000c\000o\000o\000r\000d}{subsection.4.9.2}% 119
\BOOKMARK [1][-]{section.4.10}{\376\377\0004\000.\0001\0000\000\040\000L\000i\000g\000h\000t\000\040\000C\000l\000a\000s\000s\000\040\000R\000e\000f\000e\000r\000e\000n\000c\000e}{chapter.4}% 120
\BOOKMARK [2][-]{subsection.4.10.1}{\376\377\0004\000.\0001\0000\000.\0001\000\040\000D\000e\000t\000a\000i\000l\000e\000d\000\040\000D\000e\000s\000c\000r\000i\000p\000t\000i\000o\000n}{section.4.10}% 121
\BOOKMARK [2][-]{subsection.4.10.2}{\376\377\0004\000.\0001\0000\000.\0002\000\040\000C\000o\000n\000s\000t\000r\000u\000c\000t\000o\000r\000\040\000\046\000\040\000D\000e\000s\000t\000r\000u\000c\000t\000o\000r\000\040\000D\000o\000c\000u\000m\000e\000n\000t\000a\000t\000i\000o\000n}{section.4.10}% 122
\BOOKMARK [3][-]{subsubsection.4.10.2.1}{\376\377\0004\000.\0001\0000\000.\0002\000.\0001\000\040\000L\000i\000g\000h\000t\000\050\000\051\000\040\000[\0001\000/\0002\000]}{subsection.4.10.2}% 123
\BOOKMARK [3][-]{subsubsection.4.10.2.2}{\376\377\0004\000.\0001\0000\000.\0002\000.\0002\000\040\000L\000i\000g\000h\000t\000\050\000\051\000\040\000[\0002\000/\0002\000]}{subsection.4.10.2}% 124
\BOOKMARK [2][-]{subsection.4.10.3}{\376\377\0004\000.\0001\0000\000.\0003\000\040\000M\000e\000m\000b\000e\000r\000\040\000F\000u\000n\000c\000t\000i\000o\000n\000\040\000D\000o\000c\000u\000m\000e\000n\000t\000a\000t\000i\000o\000n}{section.4.10}% 125
\BOOKMARK [3][-]{subsubsection.4.10.3.1}{\376\377\0004\000.\0001\0000\000.\0003\000.\0001\000\040\000s\000e\000t\000T\000r\000a\000n\000s\000f\000o\000r\000m\000\050\000\051}{subsection.4.10.3}% 126
\BOOKMARK [3][-]{subsubsection.4.10.3.2}{\376\377\0004\000.\0001\0000\000.\0003\000.\0002\000\040\000t\000r\000a\000n\000s\000f\000o\000r\000m\000\050\000\051}{subsection.4.10.3}% 127
\BOOKMARK [2][-]{subsection.4.10.4}{\376\377\0004\000.\0001\0000\000.\0004\000\040\000M\000e\000m\000b\000e\000r\000\040\000D\000a\000t\000a\000\040\000D\000o\000c\000u\000m\000e\000n\000t\000a\000t\000i\000o\000n}{section.4.10}% 128
\BOOKMARK [3][-]{subsubsection.4.10.4.1}{\376\377\0004\000.\0001\0000\000.\0004\000.\0001\000\040\000c\000l}{subsection.4.10.4}% 129
\BOOKMARK [3][-]{subsubsection.4.10.4.2}{\376\377\0004\000.\0001\0000\000.\0004\000.\0002\000\040\000d\000e\000c\000a\000y}{subsection.4.10.4}% 130
\BOOKMARK [3][-]{subsubsection.4.10.4.3}{\376\377\0004\000.\0001\0000\000.\0004\000.\0003\000\040\000g\000e\000o\000d\000e}{subsection.4.10.4}% 131
\BOOKMARK [3][-]{subsubsection.4.10.4.4}{\376\377\0004\000.\0001\0000\000.\0004\000.\0004\000\040\000l\000o\000c\000a\000l\000\137\000o}{subsection.4.10.4}% 132
\BOOKMARK [3][-]{subsubsection.4.10.4.5}{\376\377\0004\000.\0001\0000\000.\0004\000.\0005\000\040\000o}{subsection.4.10.4}% 133
\BOOKMARK [3][-]{subsubsection.4.10.4.6}{\376\377\0004\000.\0001\0000\000.\0004\000.\0006\000\040\000o\000n}{subsection.4.10.4}% 134
\BOOKMARK [3][-]{subsubsection.4.10.4.7}{\376\377\0004\000.\0001\0000\000.\0004\000.\0007\000\040\000t\000f}{subsection.4.10.4}% 135
\BOOKMARK [1][-]{section.4.11}{\376\377\0004\000.\0001\0001\000\040\000M\000a\000t\000\040\000C\000l\000a\000s\000s\000\040\000R\000e\000f\000e\000r\000e\000n\000c\000e}{chapter.4}% 136
\BOOKMARK [2][-]{subsection.4.11.1}{\376\377\0004\000.\0001\0001\000.\0001\000\040\000D\000e\000t\000a\000i\000l\000e\000d\000\040\000D\000e\000s\000c\000r\000i\000p\000t\000i\000o\000n}{section.4.11}% 137
\BOOKMARK [2][-]{subsection.4.11.2}{\376\377\0004\000.\0001\0001\000.\0002\000\040\000M\000e\000m\000b\000e\000r\000\040\000E\000n\000u\000m\000e\000r\000a\000t\000i\000o\000n\000\040\000D\000o\000c\000u\000m\000e\000n\000t\000a\000t\000i\000o\000n}{section.4.11}% 138
\BOOKMARK [3][-]{subsubsection.4.11.2.1}{\376\377\0004\000.\0001\0001\000.\0002\000.\0001\000\040\000I\000n\000i\000t}{subsection.4.11.2}% 139
\BOOKMARK [2][-]{subsection.4.11.3}{\376\377\0004\000.\0001\0001\000.\0003\000\040\000C\000o\000n\000s\000t\000r\000u\000c\000t\000o\000r\000\040\000\046\000\040\000D\000e\000s\000t\000r\000u\000c\000t\000o\000r\000\040\000D\000o\000c\000u\000m\000e\000n\000t\000a\000t\000i\000o\000n}{section.4.11}% 140
\BOOKMARK [3][-]{subsubsection.4.11.3.1}{\376\377\0004\000.\0001\0001\000.\0003\000.\0001\000\040\000M\000a\000t\000\050\000\051\000\040\000[\0001\000/\0004\000]}{subsection.4.11.3}% 141
\BOOKMARK [3][-]{subsubsection.4.11.3.2}{\376\377\0004\000.\0001\0001\000.\0003\000.\0002\000\040\000M\000a\000t\000\050\000\051\000\040\000[\0002\000/\0004\000]}{subsection.4.11.3}% 142
\BOOKMARK [3][-]{subsubsection.4.11.3.3}{\376\377\0004\000.\0001\0001\000.\0003\000.\0003\000\040\000M\000a\000t\000\050\000\051\000\040\000[\0003\000/\0004\000]}{subsection.4.11.3}% 143
\BOOKMARK [3][-]{subsubsection.4.11.3.4}{\376\377\0004\000.\0001\0001\000.\0003\000.\0004\000\040\000M\000a\000t\000\050\000\051\000\040\000[\0004\000/\0004\000]}{subsection.4.11.3}% 144
\BOOKMARK [2][-]{subsection.4.11.4}{\376\377\0004\000.\0001\0001\000.\0004\000\040\000M\000e\000m\000b\000e\000r\000\040\000F\000u\000n\000c\000t\000i\000o\000n\000\040\000D\000o\000c\000u\000m\000e\000n\000t\000a\000t\000i\000o\000n}{section.4.11}% 145
\BOOKMARK [3][-]{subsubsection.4.11.4.1}{\376\377\0004\000.\0001\0001\000.\0004\000.\0001\000\040\000F\000u\000l\000l\000P\000o\000s\000e\000\050\000\051}{subsection.4.11.4}% 146
\BOOKMARK [3][-]{subsubsection.4.11.4.2}{\376\377\0004\000.\0001\0001\000.\0004\000.\0002\000\040\000i\000n\000v\000e\000r\000t\000\050\000\051}{subsection.4.11.4}% 147
\BOOKMARK [3][-]{subsubsection.4.11.4.3}{\376\377\0004\000.\0001\0001\000.\0004\000.\0003\000\040\000L\000o\000o\000k\000A\000t\000\050\000\051}{subsection.4.11.4}% 148
\BOOKMARK [3][-]{subsubsection.4.11.4.4}{\376\377\0004\000.\0001\0001\000.\0004\000.\0004\000\040\000o\000p\000e\000r\000a\000t\000o\000r\000*\000\050\000\051\000\040\000[\0001\000/\0002\000]}{subsection.4.11.4}% 149
\BOOKMARK [3][-]{subsubsection.4.11.4.5}{\376\377\0004\000.\0001\0001\000.\0004\000.\0005\000\040\000o\000p\000e\000r\000a\000t\000o\000r\000*\000\050\000\051\000\040\000[\0002\000/\0002\000]}{subsection.4.11.4}% 150
\BOOKMARK [3][-]{subsubsection.4.11.4.6}{\376\377\0004\000.\0001\0001\000.\0004\000.\0006\000\040\000o\000p\000e\000r\000a\000t\000o\000r\000+\000\050\000\051}{subsection.4.11.4}% 151
\BOOKMARK [3][-]{subsubsection.4.11.4.7}{\376\377\0004\000.\0001\0001\000.\0004\000.\0007\000\040\000o\000p\000e\000r\000a\000t\000o\000r\000=\000\050\000\051}{subsection.4.11.4}% 152
\BOOKMARK [3][-]{subsubsection.4.11.4.8}{\376\377\0004\000.\0001\0001\000.\0004\000.\0008\000\040\000p\000r\000i\000n\000t\000\050\000\051}{subsection.4.11.4}% 153
\BOOKMARK [3][-]{subsubsection.4.11.4.9}{\376\377\0004\000.\0001\0001\000.\0004\000.\0009\000\040\000R\000o\000t\000X\000\050\000\051}{subsection.4.11.4}% 154
\BOOKMARK [3][-]{subsubsection.4.11.4.10}{\376\377\0004\000.\0001\0001\000.\0004\000.\0001\0000\000\040\000R\000o\000t\000Y\000\050\000\051}{subsection.4.11.4}% 155
\BOOKMARK [3][-]{subsubsection.4.11.4.11}{\376\377\0004\000.\0001\0001\000.\0004\000.\0001\0001\000\040\000R\000o\000t\000Z\000\050\000\051}{subsection.4.11.4}% 156
\BOOKMARK [3][-]{subsubsection.4.11.4.12}{\376\377\0004\000.\0001\0001\000.\0004\000.\0001\0002\000\040\000S\000c\000a\000l\000e\000\050\000\051}{subsection.4.11.4}% 157
\BOOKMARK [3][-]{subsubsection.4.11.4.13}{\376\377\0004\000.\0001\0001\000.\0004\000.\0001\0003\000\040\000T\000r\000a\000n\000s\000l\000a\000t\000e\000\050\000\051}{subsection.4.11.4}% 158
\BOOKMARK [3][-]{subsubsection.4.11.4.14}{\376\377\0004\000.\0001\0001\000.\0004\000.\0001\0004\000\040\000t\000r\000a\000n\000s\000p\000o\000s\000e\000\050\000\051}{subsection.4.11.4}% 159
\BOOKMARK [2][-]{subsection.4.11.5}{\376\377\0004\000.\0001\0001\000.\0005\000\040\000M\000e\000m\000b\000e\000r\000\040\000D\000a\000t\000a\000\040\000D\000o\000c\000u\000m\000e\000n\000t\000a\000t\000i\000o\000n}{section.4.11}% 160
\BOOKMARK [3][-]{subsubsection.4.11.5.1}{\376\377\0004\000.\0001\0001\000.\0005\000.\0001\000\040\000d\000a\000t\000a}{subsection.4.11.5}% 161
\BOOKMARK [1][-]{section.4.12}{\376\377\0004\000.\0001\0002\000\040\000M\000a\000t\000e\000r\000i\000a\000l\000\040\000C\000l\000a\000s\000s\000\040\000R\000e\000f\000e\000r\000e\000n\000c\000e}{chapter.4}% 162
\BOOKMARK [2][-]{subsection.4.12.1}{\376\377\0004\000.\0001\0002\000.\0001\000\040\000D\000e\000t\000a\000i\000l\000e\000d\000\040\000D\000e\000s\000c\000r\000i\000p\000t\000i\000o\000n}{section.4.12}% 163
\BOOKMARK [2][-]{subsection.4.12.2}{\376\377\0004\000.\0001\0002\000.\0002\000\040\000C\000o\000n\000s\000t\000r\000u\000c\000t\000o\000r\000\040\000\046\000\040\000D\000e\000s\000t\000r\000u\000c\000t\000o\000r\000\040\000D\000o\000c\000u\000m\000e\000n\000t\000a\000t\000i\000o\000n}{section.4.12}% 164
\BOOKMARK [3][-]{subsubsection.4.12.2.1}{\376\377\0004\000.\0001\0002\000.\0002\000.\0001\000\040\000M\000a\000t\000e\000r\000i\000a\000l\000\050\000\051\000\040\000[\0001\000/\0002\000]}{subsection.4.12.2}% 165
\BOOKMARK [3][-]{subsubsection.4.12.2.2}{\376\377\0004\000.\0001\0002\000.\0002\000.\0002\000\040\000M\000a\000t\000e\000r\000i\000a\000l\000\050\000\051\000\040\000[\0002\000/\0002\000]}{subsection.4.12.2}% 166
\BOOKMARK [3][-]{subsubsection.4.12.2.3}{\376\377\0004\000.\0001\0002\000.\0002\000.\0003\000\040\000\040\000M\000a\000t\000e\000r\000i\000a\000l\000\050\000\051}{subsection.4.12.2}% 167
\BOOKMARK [2][-]{subsection.4.12.3}{\376\377\0004\000.\0001\0002\000.\0003\000\040\000M\000e\000m\000b\000e\000r\000\040\000F\000u\000n\000c\000t\000i\000o\000n\000\040\000D\000o\000c\000u\000m\000e\000n\000t\000a\000t\000i\000o\000n}{section.4.12}% 168
\BOOKMARK [3][-]{subsubsection.4.12.3.1}{\376\377\0004\000.\0001\0002\000.\0003\000.\0001\000\040\000g\000e\000t\000C\000a\000\050\000\051}{subsection.4.12.3}% 169
\BOOKMARK [3][-]{subsubsection.4.12.3.2}{\376\377\0004\000.\0001\0002\000.\0003\000.\0002\000\040\000g\000e\000t\000C\000p\000\050\000\051}{subsection.4.12.3}% 170
\BOOKMARK [3][-]{subsubsection.4.12.3.3}{\376\377\0004\000.\0001\0002\000.\0003\000.\0003\000\040\000g\000e\000t\000C\000r\000\050\000\051}{subsection.4.12.3}% 171
\BOOKMARK [3][-]{subsubsection.4.12.3.4}{\376\377\0004\000.\0001\0002\000.\0003\000.\0004\000\040\000g\000e\000t\000L\000i\000g\000h\000t\000D\000e\000c\000a\000y\000\050\000\051}{subsection.4.12.3}% 172
\BOOKMARK [3][-]{subsubsection.4.12.3.5}{\376\377\0004\000.\0001\0002\000.\0003\000.\0005\000\040\000g\000e\000t\000P\000h\000o\000n\000g\000\050\000\051}{subsection.4.12.3}% 173
\BOOKMARK [3][-]{subsubsection.4.12.3.6}{\376\377\0004\000.\0001\0002\000.\0003\000.\0006\000\040\000g\000e\000t\000R\000e\000f\000r\000a\000c\000t\000i\000v\000e\000I\000n\000d\000e\000x\000\050\000\051}{subsection.4.12.3}% 174
\BOOKMARK [3][-]{subsubsection.4.12.3.7}{\376\377\0004\000.\0001\0002\000.\0003\000.\0007\000\040\000g\000e\000t\000T\000i\000l\000e\000s\000N\000u\000m\000b\000e\000r\000\050\000\051}{subsection.4.12.3}% 175
\BOOKMARK [3][-]{subsubsection.4.12.3.8}{\376\377\0004\000.\0001\0002\000.\0003\000.\0008\000\040\000i\000s\000B\000u\000m\000p\000M\000a\000p\000p\000e\000d\000\050\000\051}{subsection.4.12.3}% 176
\BOOKMARK [3][-]{subsubsection.4.12.3.9}{\376\377\0004\000.\0001\0002\000.\0003\000.\0009\000\040\000i\000s\000E\000m\000i\000s\000s\000i\000v\000e\000\050\000\051}{subsection.4.12.3}% 177
\BOOKMARK [3][-]{subsubsection.4.12.3.10}{\376\377\0004\000.\0001\0002\000.\0003\000.\0001\0000\000\040\000i\000s\000R\000e\000f\000l\000e\000c\000t\000i\000v\000e\000\050\000\051}{subsection.4.12.3}% 178
\BOOKMARK [3][-]{subsubsection.4.12.3.11}{\376\377\0004\000.\0001\0002\000.\0003\000.\0001\0001\000\040\000i\000s\000R\000e\000f\000r\000a\000c\000t\000i\000v\000e\000\050\000\051}{subsection.4.12.3}% 179
\BOOKMARK [3][-]{subsubsection.4.12.3.12}{\376\377\0004\000.\0001\0002\000.\0003\000.\0001\0002\000\040\000i\000s\000T\000e\000x\000t\000u\000r\000e\000M\000a\000p\000p\000e\000d\000\050\000\051}{subsection.4.12.3}% 180
\BOOKMARK [3][-]{subsubsection.4.12.3.13}{\376\377\0004\000.\0001\0002\000.\0003\000.\0001\0003\000\040\000l\000o\000a\000d\000P\000P\000M\000\050\000\051}{subsection.4.12.3}% 181
\BOOKMARK [3][-]{subsubsection.4.12.3.14}{\376\377\0004\000.\0001\0002\000.\0003\000.\0001\0004\000\040\000s\000e\000t\000B\000u\000m\000p\000M\000a\000p\000p\000e\000d\000\050\000\051}{subsection.4.12.3}% 182
\BOOKMARK [3][-]{subsubsection.4.12.3.15}{\376\377\0004\000.\0001\0002\000.\0003\000.\0001\0005\000\040\000s\000e\000t\000C\000a\000\050\000\051}{subsection.4.12.3}% 183
\BOOKMARK [3][-]{subsubsection.4.12.3.16}{\376\377\0004\000.\0001\0002\000.\0003\000.\0001\0006\000\040\000s\000e\000t\000C\000p\000\050\000\051}{subsection.4.12.3}% 184
\BOOKMARK [3][-]{subsubsection.4.12.3.17}{\376\377\0004\000.\0001\0002\000.\0003\000.\0001\0007\000\040\000s\000e\000t\000C\000r\000\050\000\051}{subsection.4.12.3}% 185
\BOOKMARK [3][-]{subsubsection.4.12.3.18}{\376\377\0004\000.\0001\0002\000.\0003\000.\0001\0008\000\040\000s\000e\000t\000E\000m\000i\000s\000s\000i\000v\000e\000\050\000\051}{subsection.4.12.3}% 186
\BOOKMARK [3][-]{subsubsection.4.12.3.19}{\376\377\0004\000.\0001\0002\000.\0003\000.\0001\0009\000\040\000s\000e\000t\000L\000i\000g\000h\000t\000D\000e\000c\000a\000y\000\050\000\051}{subsection.4.12.3}% 187
\BOOKMARK [3][-]{subsubsection.4.12.3.20}{\376\377\0004\000.\0001\0002\000.\0003\000.\0002\0000\000\040\000s\000e\000t\000P\000h\000o\000n\000g\000\050\000\051}{subsection.4.12.3}% 188
\BOOKMARK [3][-]{subsubsection.4.12.3.21}{\376\377\0004\000.\0001\0002\000.\0003\000.\0002\0001\000\040\000s\000e\000t\000R\000e\000f\000l\000e\000c\000t\000i\000v\000e\000\050\000\051}{subsection.4.12.3}% 189
\BOOKMARK [3][-]{subsubsection.4.12.3.22}{\376\377\0004\000.\0001\0002\000.\0003\000.\0002\0002\000\040\000s\000e\000t\000R\000e\000f\000r\000a\000c\000t\000i\000v\000e\000\050\000\051}{subsection.4.12.3}% 190
\BOOKMARK [3][-]{subsubsection.4.12.3.23}{\376\377\0004\000.\0001\0002\000.\0003\000.\0002\0003\000\040\000s\000e\000t\000R\000e\000f\000r\000a\000c\000t\000i\000v\000e\000I\000n\000d\000e\000x\000\050\000\051}{subsection.4.12.3}% 191
\BOOKMARK [3][-]{subsubsection.4.12.3.24}{\376\377\0004\000.\0001\0002\000.\0003\000.\0002\0004\000\040\000s\000e\000t\000T\000e\000x\000t\000u\000r\000e\000M\000a\000p\000p\000e\000d\000\050\000\051}{subsection.4.12.3}% 192
\BOOKMARK [3][-]{subsubsection.4.12.3.25}{\376\377\0004\000.\0001\0002\000.\0003\000.\0002\0005\000\040\000s\000e\000t\000T\000i\000l\000e\000s\000N\000u\000m\000b\000e\000r\000\050\000\051}{subsection.4.12.3}% 193
\BOOKMARK [3][-]{subsubsection.4.12.3.26}{\376\377\0004\000.\0001\0002\000.\0003\000.\0002\0006\000\040\000t\000e\000x\000\137\000p\000i\000x\000e\000l\000\050\000\051}{subsection.4.12.3}% 194
\BOOKMARK [2][-]{subsection.4.12.4}{\376\377\0004\000.\0001\0002\000.\0004\000\040\000M\000e\000m\000b\000e\000r\000\040\000D\000a\000t\000a\000\040\000D\000o\000c\000u\000m\000e\000n\000t\000a\000t\000i\000o\000n}{section.4.12}% 195
\BOOKMARK [3][-]{subsubsection.4.12.4.1}{\376\377\0004\000.\0001\0002\000.\0004\000.\0001\000\040\000b\000u\000m\000p}{subsection.4.12.4}% 196
\BOOKMARK [3][-]{subsubsection.4.12.4.2}{\376\377\0004\000.\0001\0002\000.\0004\000.\0002\000\040\000c\000a}{subsection.4.12.4}% 197
\BOOKMARK [3][-]{subsubsection.4.12.4.3}{\376\377\0004\000.\0001\0002\000.\0004\000.\0003\000\040\000c\000p}{subsection.4.12.4}% 198
\BOOKMARK [3][-]{subsubsection.4.12.4.4}{\376\377\0004\000.\0001\0002\000.\0004\000.\0004\000\040\000c\000r}{subsection.4.12.4}% 199
\BOOKMARK [3][-]{subsubsection.4.12.4.5}{\376\377\0004\000.\0001\0002\000.\0004\000.\0005\000\040\000d\000e\000c\000a\000y}{subsection.4.12.4}% 200
\BOOKMARK [3][-]{subsubsection.4.12.4.6}{\376\377\0004\000.\0001\0002\000.\0004\000.\0006\000\040\000e\000m\000i\000s\000s\000i\000v\000e}{subsection.4.12.4}% 201
\BOOKMARK [3][-]{subsubsection.4.12.4.7}{\376\377\0004\000.\0001\0002\000.\0004\000.\0007\000\040\000k}{subsection.4.12.4}% 202
\BOOKMARK [3][-]{subsubsection.4.12.4.8}{\376\377\0004\000.\0001\0002\000.\0004\000.\0008\000\040\000p}{subsection.4.12.4}% 203
\BOOKMARK [3][-]{subsubsection.4.12.4.9}{\376\377\0004\000.\0001\0002\000.\0004\000.\0009\000\040\000r\000e\000f\000l\000e\000c\000t\000i\000v\000e}{subsection.4.12.4}% 204
\BOOKMARK [3][-]{subsubsection.4.12.4.10}{\376\377\0004\000.\0001\0002\000.\0004\000.\0001\0000\000\040\000r\000e\000f\000r\000a\000c\000t\000i\000v\000e}{subsection.4.12.4}% 205
\BOOKMARK [3][-]{subsubsection.4.12.4.11}{\376\377\0004\000.\0001\0002\000.\0004\000.\0001\0001\000\040\000r\000f\000t}{subsection.4.12.4}% 206
\BOOKMARK [3][-]{subsubsection.4.12.4.12}{\376\377\0004\000.\0001\0002\000.\0004\000.\0001\0002\000\040\000t\000e\000x\000\137\000h\000e\000i\000g\000h\000t}{subsection.4.12.4}% 207
\BOOKMARK [3][-]{subsubsection.4.12.4.13}{\376\377\0004\000.\0001\0002\000.\0004\000.\0001\0003\000\040\000t\000e\000x\000\137\000i\000m\000a\000g\000e}{subsection.4.12.4}% 208
\BOOKMARK [3][-]{subsubsection.4.12.4.14}{\376\377\0004\000.\0001\0002\000.\0004\000.\0001\0004\000\040\000t\000e\000x\000\137\000m\000a\000p}{subsection.4.12.4}% 209
\BOOKMARK [3][-]{subsubsection.4.12.4.15}{\376\377\0004\000.\0001\0002\000.\0004\000.\0001\0005\000\040\000t\000e\000x\000\137\000w\000i\000d\000t\000h}{subsection.4.12.4}% 210
\BOOKMARK [3][-]{subsubsection.4.12.4.16}{\376\377\0004\000.\0001\0002\000.\0004\000.\0001\0006\000\040\000t\000i\000l\000i\000n\000g}{subsection.4.12.4}% 211
\BOOKMARK [1][-]{section.4.13}{\376\377\0004\000.\0001\0003\000\040\000M\000e\000s\000h\000\040\000C\000l\000a\000s\000s\000\040\000R\000e\000f\000e\000r\000e\000n\000c\000e}{chapter.4}% 212
\BOOKMARK [2][-]{subsection.4.13.1}{\376\377\0004\000.\0001\0003\000.\0001\000\040\000D\000e\000t\000a\000i\000l\000e\000d\000\040\000D\000e\000s\000c\000r\000i\000p\000t\000i\000o\000n}{section.4.13}% 213
\BOOKMARK [2][-]{subsection.4.13.2}{\376\377\0004\000.\0001\0003\000.\0002\000\040\000C\000o\000n\000s\000t\000r\000u\000c\000t\000o\000r\000\040\000\046\000\040\000D\000e\000s\000t\000r\000u\000c\000t\000o\000r\000\040\000D\000o\000c\000u\000m\000e\000n\000t\000a\000t\000i\000o\000n}{section.4.13}% 214
\BOOKMARK [3][-]{subsubsection.4.13.2.1}{\376\377\0004\000.\0001\0003\000.\0002\000.\0001\000\040\000M\000e\000s\000h\000\050\000\051\000\040\000[\0001\000/\0002\000]}{subsection.4.13.2}% 215
\BOOKMARK [3][-]{subsubsection.4.13.2.2}{\376\377\0004\000.\0001\0003\000.\0002\000.\0002\000\040\000M\000e\000s\000h\000\050\000\051\000\040\000[\0002\000/\0002\000]}{subsection.4.13.2}% 216
\BOOKMARK [2][-]{subsection.4.13.3}{\376\377\0004\000.\0001\0003\000.\0003\000\040\000M\000e\000m\000b\000e\000r\000\040\000F\000u\000n\000c\000t\000i\000o\000n\000\040\000D\000o\000c\000u\000m\000e\000n\000t\000a\000t\000i\000o\000n}{section.4.13}% 217
\BOOKMARK [3][-]{subsubsection.4.13.3.1}{\376\377\0004\000.\0001\0003\000.\0003\000.\0001\000\040\000a\000d\000d\000S\000u\000r\000f\000a\000c\000e\000s\000\050\000\051}{subsection.4.13.3}% 218
\BOOKMARK [3][-]{subsubsection.4.13.3.2}{\376\377\0004\000.\0001\0003\000.\0003\000.\0002\000\040\000b\000o\000u\000n\000d\000i\000n\000g\000\137\000b\000o\000x\000\050\000\051}{subsection.4.13.3}% 219
\BOOKMARK [3][-]{subsubsection.4.13.3.3}{\376\377\0004\000.\0001\0003\000.\0003\000.\0003\000\040\000g\000e\000t\000B\000B\000o\000x\000\050\000\051}{subsection.4.13.3}% 220
\BOOKMARK [3][-]{subsubsection.4.13.3.4}{\376\377\0004\000.\0001\0003\000.\0003\000.\0004\000\040\000g\000e\000t\000C\000e\000n\000t\000r\000o\000i\000d\000\050\000\051}{subsection.4.13.3}% 221
\BOOKMARK [3][-]{subsubsection.4.13.3.5}{\376\377\0004\000.\0001\0003\000.\0003\000.\0005\000\040\000h\000i\000t\000\050\000\051}{subsection.4.13.3}% 222
\BOOKMARK [3][-]{subsubsection.4.13.3.6}{\376\377\0004\000.\0001\0003\000.\0003\000.\0006\000\040\000n\000o\000r\000m\000a\000l\000s\000\137\000a\000t\000\137\000v\000e\000r\000t\000e\000x\000e\000s\000\050\000\051}{subsection.4.13.3}% 223
\BOOKMARK [3][-]{subsubsection.4.13.3.7}{\376\377\0004\000.\0001\0003\000.\0003\000.\0007\000\040\000s\000e\000t\000M\000a\000t\000e\000r\000i\000a\000l\000\050\000\051}{subsection.4.13.3}% 224
\BOOKMARK [3][-]{subsubsection.4.13.3.8}{\376\377\0004\000.\0001\0003\000.\0003\000.\0008\000\040\000s\000e\000t\000T\000r\000a\000n\000s\000f\000o\000r\000m\000\050\000\051}{subsection.4.13.3}% 225
\BOOKMARK [3][-]{subsubsection.4.13.3.9}{\376\377\0004\000.\0001\0003\000.\0003\000.\0009\000\040\000t\000r\000a\000n\000s\000f\000o\000r\000m\000\050\000\051}{subsection.4.13.3}% 226
\BOOKMARK [2][-]{subsection.4.13.4}{\376\377\0004\000.\0001\0003\000.\0004\000\040\000M\000e\000m\000b\000e\000r\000\040\000D\000a\000t\000a\000\040\000D\000o\000c\000u\000m\000e\000n\000t\000a\000t\000i\000o\000n}{section.4.13}% 227
\BOOKMARK [3][-]{subsubsection.4.13.4.1}{\376\377\0004\000.\0001\0003\000.\0004\000.\0001\000\040\000s\000u\000r\000f\000a\000c\000e\000s}{subsection.4.13.4}% 228
\BOOKMARK [3][-]{subsubsection.4.13.4.2}{\376\377\0004\000.\0001\0003\000.\0004\000.\0002\000\040\000v\000e\000r\000t\000s}{subsection.4.13.4}% 229
\BOOKMARK [1][-]{section.4.14}{\376\377\0004\000.\0001\0004\000\040\000R\000a\000y\000\040\000C\000l\000a\000s\000s\000\040\000R\000e\000f\000e\000r\000e\000n\000c\000e}{chapter.4}% 230
\BOOKMARK [2][-]{subsection.4.14.1}{\376\377\0004\000.\0001\0004\000.\0001\000\040\000D\000e\000t\000a\000i\000l\000e\000d\000\040\000D\000e\000s\000c\000r\000i\000p\000t\000i\000o\000n}{section.4.14}% 231
\BOOKMARK [2][-]{subsection.4.14.2}{\376\377\0004\000.\0001\0004\000.\0002\000\040\000C\000o\000n\000s\000t\000r\000u\000c\000t\000o\000r\000\040\000\046\000\040\000D\000e\000s\000t\000r\000u\000c\000t\000o\000r\000\040\000D\000o\000c\000u\000m\000e\000n\000t\000a\000t\000i\000o\000n}{section.4.14}% 232
\BOOKMARK [3][-]{subsubsection.4.14.2.1}{\376\377\0004\000.\0001\0004\000.\0002\000.\0001\000\040\000R\000a\000y\000\050\000\051}{subsection.4.14.2}% 233
\BOOKMARK [2][-]{subsection.4.14.3}{\376\377\0004\000.\0001\0004\000.\0003\000\040\000M\000e\000m\000b\000e\000r\000\040\000F\000u\000n\000c\000t\000i\000o\000n\000\040\000D\000o\000c\000u\000m\000e\000n\000t\000a\000t\000i\000o\000n}{section.4.14}% 234
\BOOKMARK [3][-]{subsubsection.4.14.3.1}{\376\377\0004\000.\0001\0004\000.\0003\000.\0001\000\040\000t\000i\000p\000\137\000p\000o\000i\000n\000t\000\050\000\051}{subsection.4.14.3}% 235
\BOOKMARK [2][-]{subsection.4.14.4}{\376\377\0004\000.\0001\0004\000.\0004\000\040\000M\000e\000m\000b\000e\000r\000\040\000D\000a\000t\000a\000\040\000D\000o\000c\000u\000m\000e\000n\000t\000a\000t\000i\000o\000n}{section.4.14}% 236
\BOOKMARK [3][-]{subsubsection.4.14.4.1}{\376\377\0004\000.\0001\0004\000.\0004\000.\0001\000\040\000d}{subsection.4.14.4}% 237
\BOOKMARK [3][-]{subsubsection.4.14.4.2}{\376\377\0004\000.\0001\0004\000.\0004\000.\0002\000\040\000i\000n\000v\000\137\000d}{subsection.4.14.4}% 238
\BOOKMARK [3][-]{subsubsection.4.14.4.3}{\376\377\0004\000.\0001\0004\000.\0004\000.\0003\000\040\000o}{subsection.4.14.4}% 239
\BOOKMARK [1][-]{section.4.15}{\376\377\0004\000.\0001\0005\000\040\000R\000a\000y\000T\000r\000a\000c\000e\000r\000\040\000C\000l\000a\000s\000s\000\040\000R\000e\000f\000e\000r\000e\000n\000c\000e}{chapter.4}% 240
\BOOKMARK [2][-]{subsection.4.15.1}{\376\377\0004\000.\0001\0005\000.\0001\000\040\000D\000e\000t\000a\000i\000l\000e\000d\000\040\000D\000e\000s\000c\000r\000i\000p\000t\000i\000o\000n}{section.4.15}% 241
\BOOKMARK [2][-]{subsection.4.15.2}{\376\377\0004\000.\0001\0005\000.\0002\000\040\000C\000o\000n\000s\000t\000r\000u\000c\000t\000o\000r\000\040\000\046\000\040\000D\000e\000s\000t\000r\000u\000c\000t\000o\000r\000\040\000D\000o\000c\000u\000m\000e\000n\000t\000a\000t\000i\000o\000n}{section.4.15}% 242
\BOOKMARK [3][-]{subsubsection.4.15.2.1}{\376\377\0004\000.\0001\0005\000.\0002\000.\0001\000\040\000R\000a\000y\000T\000r\000a\000c\000e\000r\000\050\000\051}{subsection.4.15.2}% 243
\BOOKMARK [2][-]{subsection.4.15.3}{\376\377\0004\000.\0001\0005\000.\0003\000\040\000M\000e\000m\000b\000e\000r\000\040\000F\000u\000n\000c\000t\000i\000o\000n\000\040\000D\000o\000c\000u\000m\000e\000n\000t\000a\000t\000i\000o\000n}{section.4.15}% 244
\BOOKMARK [3][-]{subsubsection.4.15.3.1}{\376\377\0004\000.\0001\0005\000.\0003\000.\0001\000\040\000g\000e\000t\000\137\000p\000i\000x\000e\000l\000\137\000f\000r\000o\000m\000\137\0003\000D\000\050\000\051}{subsection.4.15.3}% 245
\BOOKMARK [3][-]{subsubsection.4.15.3.2}{\376\377\0004\000.\0001\0005\000.\0003\000.\0002\000\040\000g\000e\000t\000\137\000s\000h\000a\000d\000d\000i\000n\000g\000\050\000\051}{subsection.4.15.3}% 246
\BOOKMARK [3][-]{subsubsection.4.15.3.3}{\376\377\0004\000.\0001\0005\000.\0003\000.\0003\000\040\000g\000e\000t\000\137\000v\000i\000s\000i\000b\000l\000e\000\137\000s\000u\000r\000f\000a\000c\000e\000\050\000\051}{subsection.4.15.3}% 247
\BOOKMARK [3][-]{subsubsection.4.15.3.4}{\376\377\0004\000.\0001\0005\000.\0003\000.\0004\000\040\000g\000e\000t\000C\000a\000m\000e\000r\000a\000\050\000\051}{subsection.4.15.3}% 248
\BOOKMARK [3][-]{subsubsection.4.15.3.5}{\376\377\0004\000.\0001\0005\000.\0003\000.\0005\000\040\000g\000e\000t\000S\000c\000e\000n\000e\000\050\000\051}{subsection.4.15.3}% 249
\BOOKMARK [3][-]{subsubsection.4.15.3.6}{\376\377\0004\000.\0001\0005\000.\0003\000.\0006\000\040\000r\000a\000y\000\137\000s\000h\000a\000d\000i\000n\000g\000\050\000\051}{subsection.4.15.3}% 250
\BOOKMARK [3][-]{subsubsection.4.15.3.7}{\376\377\0004\000.\0001\0005\000.\0003\000.\0007\000\040\000r\000e\000n\000d\000e\000r\000\050\000\051}{subsection.4.15.3}% 251
\BOOKMARK [3][-]{subsubsection.4.15.3.8}{\376\377\0004\000.\0001\0005\000.\0003\000.\0008\000\040\000s\000a\000v\000e\000\137\000t\000o\000\137\000f\000i\000l\000e\000\050\000\051}{subsection.4.15.3}% 252
\BOOKMARK [3][-]{subsubsection.4.15.3.9}{\376\377\0004\000.\0001\0005\000.\0003\000.\0009\000\040\000s\000e\000t\000D\000e\000p\000t\000h\000R\000a\000y\000R\000e\000c\000u\000r\000s\000i\000o\000n\000\050\000\051}{subsection.4.15.3}% 253
\BOOKMARK [3][-]{subsubsection.4.15.3.10}{\376\377\0004\000.\0001\0005\000.\0003\000.\0001\0000\000\040\000s\000e\000t\000N\000r\000A\000n\000t\000i\000A\000l\000i\000a\000s\000i\000n\000g\000S\000a\000m\000p\000l\000e\000s\000\050\000\051}{subsection.4.15.3}% 254
\BOOKMARK [3][-]{subsubsection.4.15.3.11}{\376\377\0004\000.\0001\0005\000.\0003\000.\0001\0001\000\040\000s\000e\000t\000N\000r\000S\000h\000a\000d\000o\000w\000S\000a\000m\000p\000l\000e\000s\000\050\000\051}{subsection.4.15.3}% 255
\BOOKMARK [3][-]{subsubsection.4.15.3.12}{\376\377\0004\000.\0001\0005\000.\0003\000.\0001\0002\000\040\000s\000h\000a\000d\000o\000w\000\137\000r\000a\000y\000s\000\050\000\051}{subsection.4.15.3}% 256
\BOOKMARK [2][-]{subsection.4.15.4}{\376\377\0004\000.\0001\0005\000.\0004\000\040\000M\000e\000m\000b\000e\000r\000\040\000D\000a\000t\000a\000\040\000D\000o\000c\000u\000m\000e\000n\000t\000a\000t\000i\000o\000n}{section.4.15}% 257
\BOOKMARK [3][-]{subsubsection.4.15.4.1}{\376\377\0004\000.\0001\0005\000.\0004\000.\0001\000\040\000c\000a\000m\000e\000r\000a}{subsection.4.15.4}% 258
\BOOKMARK [3][-]{subsubsection.4.15.4.2}{\376\377\0004\000.\0001\0005\000.\0004\000.\0002\000\040\000h\000o\000p\000s}{subsection.4.15.4}% 259
\BOOKMARK [3][-]{subsubsection.4.15.4.3}{\376\377\0004\000.\0001\0005\000.\0004\000.\0003\000\040\000i\000m\000a\000g\000e}{subsection.4.15.4}% 260
\BOOKMARK [3][-]{subsubsection.4.15.4.4}{\376\377\0004\000.\0001\0005\000.\0004\000.\0004\000\040\000p\000i\000x\000e\000l\000s}{subsection.4.15.4}% 261
\BOOKMARK [3][-]{subsubsection.4.15.4.5}{\376\377\0004\000.\0001\0005\000.\0004\000.\0005\000\040\000s\000a\000m\000p\000l\000e\000s}{subsection.4.15.4}% 262
\BOOKMARK [3][-]{subsubsection.4.15.4.6}{\376\377\0004\000.\0001\0005\000.\0004\000.\0006\000\040\000s\000c\000e\000n\000e}{subsection.4.15.4}% 263
\BOOKMARK [3][-]{subsubsection.4.15.4.7}{\376\377\0004\000.\0001\0005\000.\0004\000.\0007\000\040\000s\000h\000a\000d\000o\000w\000\137\000s\000a\000m\000p\000l\000e\000s}{subsection.4.15.4}% 264
\BOOKMARK [1][-]{section.4.16}{\376\377\0004\000.\0001\0006\000\040\000S\000c\000e\000n\000e\000\040\000C\000l\000a\000s\000s\000\040\000R\000e\000f\000e\000r\000e\000n\000c\000e}{chapter.4}% 265
\BOOKMARK [2][-]{subsection.4.16.1}{\376\377\0004\000.\0001\0006\000.\0001\000\040\000D\000e\000t\000a\000i\000l\000e\000d\000\040\000D\000e\000s\000c\000r\000i\000p\000t\000i\000o\000n}{section.4.16}% 266
\BOOKMARK [2][-]{subsection.4.16.2}{\376\377\0004\000.\0001\0006\000.\0002\000\040\000C\000o\000n\000s\000t\000r\000u\000c\000t\000o\000r\000\040\000\046\000\040\000D\000e\000s\000t\000r\000u\000c\000t\000o\000r\000\040\000D\000o\000c\000u\000m\000e\000n\000t\000a\000t\000i\000o\000n}{section.4.16}% 267
\BOOKMARK [3][-]{subsubsection.4.16.2.1}{\376\377\0004\000.\0001\0006\000.\0002\000.\0001\000\040\000S\000c\000e\000n\000e\000\050\000\051}{subsection.4.16.2}% 268
\BOOKMARK [2][-]{subsection.4.16.3}{\376\377\0004\000.\0001\0006\000.\0003\000\040\000M\000e\000m\000b\000e\000r\000\040\000F\000u\000n\000c\000t\000i\000o\000n\000\040\000D\000o\000c\000u\000m\000e\000n\000t\000a\000t\000i\000o\000n}{section.4.16}% 269
\BOOKMARK [3][-]{subsubsection.4.16.3.1}{\376\377\0004\000.\0001\0006\000.\0003\000.\0001\000\040\000a\000d\000d\000L\000i\000g\000h\000t\000\050\000\051}{subsection.4.16.3}% 270
\BOOKMARK [3][-]{subsubsection.4.16.3.2}{\376\377\0004\000.\0001\0006\000.\0003\000.\0002\000\040\000a\000d\000d\000S\000u\000r\000f\000a\000c\000e\000\050\000\051\000\040\000[\0001\000/\0002\000]}{subsection.4.16.3}% 271
\BOOKMARK [3][-]{subsubsection.4.16.3.3}{\376\377\0004\000.\0001\0006\000.\0003\000.\0003\000\040\000a\000d\000d\000S\000u\000r\000f\000a\000c\000e\000\050\000\051\000\040\000[\0002\000/\0002\000]}{subsection.4.16.3}% 272
\BOOKMARK [3][-]{subsubsection.4.16.3.4}{\376\377\0004\000.\0001\0006\000.\0003\000.\0004\000\040\000g\000e\000t\000L\000i\000g\000h\000t\000s\000V\000e\000c\000t\000o\000r\000\050\000\051}{subsection.4.16.3}% 273
\BOOKMARK [3][-]{subsubsection.4.16.3.5}{\376\377\0004\000.\0001\0006\000.\0003\000.\0005\000\040\000g\000e\000t\000R\000o\000o\000t\000T\000r\000a\000n\000s\000f\000o\000r\000m\000\050\000\051}{subsection.4.16.3}% 274
\BOOKMARK [3][-]{subsubsection.4.16.3.6}{\376\377\0004\000.\0001\0006\000.\0003\000.\0006\000\040\000g\000e\000t\000S\000u\000r\000f\000a\000c\000e\000s\000V\000e\000c\000t\000o\000r\000\050\000\051}{subsection.4.16.3}% 275
\BOOKMARK [3][-]{subsubsection.4.16.3.7}{\376\377\0004\000.\0001\0006\000.\0003\000.\0007\000\040\000h\000i\000t\000\050\000\051}{subsection.4.16.3}% 276
\BOOKMARK [3][-]{subsubsection.4.16.3.8}{\376\377\0004\000.\0001\0006\000.\0003\000.\0008\000\040\000m\000e\000s\000h\000F\000r\000o\000m\000I\000D\000\050\000\051}{subsection.4.16.3}% 277
\BOOKMARK [3][-]{subsubsection.4.16.3.9}{\376\377\0004\000.\0001\0006\000.\0003\000.\0009\000\040\000r\000e\000f\000l\000e\000c\000t\000i\000o\000n\000\050\000\051}{subsection.4.16.3}% 278
\BOOKMARK [3][-]{subsubsection.4.16.3.10}{\376\377\0004\000.\0001\0006\000.\0003\000.\0001\0000\000\040\000r\000e\000f\000r\000a\000c\000t\000i\000o\000n\000\050\000\051}{subsection.4.16.3}% 279
\BOOKMARK [3][-]{subsubsection.4.16.3.11}{\376\377\0004\000.\0001\0006\000.\0003\000.\0001\0001\000\040\000r\000e\000m\000o\000v\000e\000S\000u\000r\000f\000a\000c\000e\000\050\000\051}{subsection.4.16.3}% 280
\BOOKMARK [3][-]{subsubsection.4.16.3.12}{\376\377\0004\000.\0001\0006\000.\0003\000.\0001\0002\000\040\000s\000e\000t\000B\000V\000H\000\050\000\051}{subsection.4.16.3}% 281
\BOOKMARK [3][-]{subsubsection.4.16.3.13}{\376\377\0004\000.\0001\0006\000.\0003\000.\0001\0003\000\040\000s\000p\000h\000e\000r\000e\000F\000r\000o\000m\000I\000D\000\050\000\051}{subsection.4.16.3}% 282
\BOOKMARK [3][-]{subsubsection.4.16.3.14}{\376\377\0004\000.\0001\0006\000.\0003\000.\0001\0004\000\040\000s\000u\000r\000f\000a\000c\000e\000F\000r\000o\000m\000I\000D\000\050\000\051}{subsection.4.16.3}% 283
\BOOKMARK [3][-]{subsubsection.4.16.3.15}{\376\377\0004\000.\0001\0006\000.\0003\000.\0001\0005\000\040\000t\000r\000a\000n\000s\000f\000o\000r\000m\000\050\000\051}{subsection.4.16.3}% 284
\BOOKMARK [3][-]{subsubsection.4.16.3.16}{\376\377\0004\000.\0001\0006\000.\0003\000.\0001\0006\000\040\000t\000r\000i\000a\000n\000g\000l\000e\000F\000r\000o\000m\000I\000D\000\050\000\051}{subsection.4.16.3}% 285
\BOOKMARK [2][-]{subsection.4.16.4}{\376\377\0004\000.\0001\0006\000.\0004\000\040\000M\000e\000m\000b\000e\000r\000\040\000D\000a\000t\000a\000\040\000D\000o\000c\000u\000m\000e\000n\000t\000a\000t\000i\000o\000n}{section.4.16}% 286
\BOOKMARK [3][-]{subsubsection.4.16.4.1}{\376\377\0004\000.\0001\0006\000.\0004\000.\0001\000\040\000b\000v\000h}{subsection.4.16.4}% 287
\BOOKMARK [3][-]{subsubsection.4.16.4.2}{\376\377\0004\000.\0001\0006\000.\0004\000.\0002\000\040\000l\000i\000g\000h\000t\000s}{subsection.4.16.4}% 288
\BOOKMARK [3][-]{subsubsection.4.16.4.3}{\376\377\0004\000.\0001\0006\000.\0004\000.\0003\000\040\000o\000b\000j\000e\000c\000t\000s}{subsection.4.16.4}% 289
\BOOKMARK [3][-]{subsubsection.4.16.4.4}{\376\377\0004\000.\0001\0006\000.\0004\000.\0004\000\040\000r\000o\000o\000t\000\137\000t\000f}{subsection.4.16.4}% 290
\BOOKMARK [3][-]{subsubsection.4.16.4.5}{\376\377\0004\000.\0001\0006\000.\0004\000.\0005\000\040\000s\000u\000r\000f\000a\000c\000e\000s}{subsection.4.16.4}% 291
\BOOKMARK [1][-]{section.4.17}{\376\377\0004\000.\0001\0007\000\040\000S\000p\000h\000e\000r\000e\000\040\000C\000l\000a\000s\000s\000\040\000R\000e\000f\000e\000r\000e\000n\000c\000e}{chapter.4}% 292
\BOOKMARK [2][-]{subsection.4.17.1}{\376\377\0004\000.\0001\0007\000.\0001\000\040\000D\000e\000t\000a\000i\000l\000e\000d\000\040\000D\000e\000s\000c\000r\000i\000p\000t\000i\000o\000n}{section.4.17}% 293
\BOOKMARK [2][-]{subsection.4.17.2}{\376\377\0004\000.\0001\0007\000.\0002\000\040\000C\000o\000n\000s\000t\000r\000u\000c\000t\000o\000r\000\040\000\046\000\040\000D\000e\000s\000t\000r\000u\000c\000t\000o\000r\000\040\000D\000o\000c\000u\000m\000e\000n\000t\000a\000t\000i\000o\000n}{section.4.17}% 294
\BOOKMARK [3][-]{subsubsection.4.17.2.1}{\376\377\0004\000.\0001\0007\000.\0002\000.\0001\000\040\000S\000p\000h\000e\000r\000e\000\050\000\051\000\040\000[\0001\000/\0003\000]}{subsection.4.17.2}% 295
\BOOKMARK [3][-]{subsubsection.4.17.2.2}{\376\377\0004\000.\0001\0007\000.\0002\000.\0002\000\040\000S\000p\000h\000e\000r\000e\000\050\000\051\000\040\000[\0002\000/\0003\000]}{subsection.4.17.2}% 296
\BOOKMARK [3][-]{subsubsection.4.17.2.3}{\376\377\0004\000.\0001\0007\000.\0002\000.\0003\000\040\000S\000p\000h\000e\000r\000e\000\050\000\051\000\040\000[\0003\000/\0003\000]}{subsection.4.17.2}% 297
\BOOKMARK [2][-]{subsection.4.17.3}{\376\377\0004\000.\0001\0007\000.\0003\000\040\000M\000e\000m\000b\000e\000r\000\040\000F\000u\000n\000c\000t\000i\000o\000n\000\040\000D\000o\000c\000u\000m\000e\000n\000t\000a\000t\000i\000o\000n}{section.4.17}% 298
\BOOKMARK [3][-]{subsubsection.4.17.3.1}{\376\377\0004\000.\0001\0007\000.\0003\000.\0001\000\040\000a\000d\000d\000S\000u\000r\000f\000a\000c\000e\000s\000\050\000\051}{subsection.4.17.3}% 299
\BOOKMARK [3][-]{subsubsection.4.17.3.2}{\376\377\0004\000.\0001\0007\000.\0003\000.\0002\000\040\000b\000o\000u\000n\000d\000i\000n\000g\000\137\000b\000o\000x\000\050\000\051}{subsection.4.17.3}% 300
\BOOKMARK [3][-]{subsubsection.4.17.3.3}{\376\377\0004\000.\0001\0007\000.\0003\000.\0003\000\040\000g\000e\000t\000B\000B\000o\000x\000\050\000\051}{subsection.4.17.3}% 301
\BOOKMARK [3][-]{subsubsection.4.17.3.4}{\376\377\0004\000.\0001\0007\000.\0003\000.\0004\000\040\000g\000e\000t\000C\000e\000n\000t\000r\000o\000i\000d\000\050\000\051}{subsection.4.17.3}% 302
\BOOKMARK [3][-]{subsubsection.4.17.3.5}{\376\377\0004\000.\0001\0007\000.\0003\000.\0005\000\040\000g\000e\000t\000P\000o\000s\000L\000o\000c\000a\000l\000C\000o\000o\000r\000d\000s\000\050\000\051}{subsection.4.17.3}% 303
\BOOKMARK [3][-]{subsubsection.4.17.3.6}{\376\377\0004\000.\0001\0007\000.\0003\000.\0006\000\040\000g\000e\000t\000P\000o\000s\000W\000o\000r\000l\000d\000C\000o\000o\000r\000d\000s\000\050\000\051}{subsection.4.17.3}% 304
\BOOKMARK [3][-]{subsubsection.4.17.3.7}{\376\377\0004\000.\0001\0007\000.\0003\000.\0007\000\040\000g\000e\000t\000R\000a\000d\000i\000u\000s\000\050\000\051}{subsection.4.17.3}% 305
\BOOKMARK [3][-]{subsubsection.4.17.3.8}{\376\377\0004\000.\0001\0007\000.\0003\000.\0008\000\040\000h\000i\000t\000\050\000\051}{subsection.4.17.3}% 306
\BOOKMARK [3][-]{subsubsection.4.17.3.9}{\376\377\0004\000.\0001\0007\000.\0003\000.\0009\000\040\000s\000e\000t\000P\000o\000s\000L\000o\000c\000a\000l\000C\000o\000o\000r\000d\000s\000\050\000\051}{subsection.4.17.3}% 307
\BOOKMARK [3][-]{subsubsection.4.17.3.10}{\376\377\0004\000.\0001\0007\000.\0003\000.\0001\0000\000\040\000s\000e\000t\000R\000a\000d\000i\000u\000s\000\050\000\051}{subsection.4.17.3}% 308
\BOOKMARK [2][-]{subsection.4.17.4}{\376\377\0004\000.\0001\0007\000.\0004\000\040\000M\000e\000m\000b\000e\000r\000\040\000D\000a\000t\000a\000\040\000D\000o\000c\000u\000m\000e\000n\000t\000a\000t\000i\000o\000n}{section.4.17}% 309
\BOOKMARK [3][-]{subsubsection.4.17.4.1}{\376\377\0004\000.\0001\0007\000.\0004\000.\0001\000\040\000i\000n\000v\000\137\000n\000o\000r\000m\000a\000l}{subsection.4.17.4}% 310
\BOOKMARK [3][-]{subsubsection.4.17.4.2}{\376\377\0004\000.\0001\0007\000.\0004\000.\0002\000\040\000r\000a\000d\000i\000u\000s}{subsection.4.17.4}% 311
\BOOKMARK [1][-]{section.4.18}{\376\377\0004\000.\0001\0008\000\040\000S\000u\000r\000f\000a\000c\000e\000\040\000C\000l\000a\000s\000s\000\040\000R\000e\000f\000e\000r\000e\000n\000c\000e}{chapter.4}% 312
\BOOKMARK [2][-]{subsection.4.18.1}{\376\377\0004\000.\0001\0008\000.\0001\000\040\000D\000e\000t\000a\000i\000l\000e\000d\000\040\000D\000e\000s\000c\000r\000i\000p\000t\000i\000o\000n}{section.4.18}% 313
\BOOKMARK [2][-]{subsection.4.18.2}{\376\377\0004\000.\0001\0008\000.\0002\000\040\000C\000o\000n\000s\000t\000r\000u\000c\000t\000o\000r\000\040\000\046\000\040\000D\000e\000s\000t\000r\000u\000c\000t\000o\000r\000\040\000D\000o\000c\000u\000m\000e\000n\000t\000a\000t\000i\000o\000n}{section.4.18}% 314
\BOOKMARK [3][-]{subsubsection.4.18.2.1}{\376\377\0004\000.\0001\0008\000.\0002\000.\0001\000\040\000S\000u\000r\000f\000a\000c\000e\000\050\000\051\000\040\000[\0001\000/\0002\000]}{subsection.4.18.2}% 315
\BOOKMARK [3][-]{subsubsection.4.18.2.2}{\376\377\0004\000.\0001\0008\000.\0002\000.\0002\000\040\000S\000u\000r\000f\000a\000c\000e\000\050\000\051\000\040\000[\0002\000/\0002\000]}{subsection.4.18.2}% 316
\BOOKMARK [3][-]{subsubsection.4.18.2.3}{\376\377\0004\000.\0001\0008\000.\0002\000.\0003\000\040\000\040\000S\000u\000r\000f\000a\000c\000e\000\050\000\051}{subsection.4.18.2}% 317
\BOOKMARK [2][-]{subsection.4.18.3}{\376\377\0004\000.\0001\0008\000.\0003\000\040\000M\000e\000m\000b\000e\000r\000\040\000F\000u\000n\000c\000t\000i\000o\000n\000\040\000D\000o\000c\000u\000m\000e\000n\000t\000a\000t\000i\000o\000n}{section.4.18}% 318
\BOOKMARK [3][-]{subsubsection.4.18.3.1}{\376\377\0004\000.\0001\0008\000.\0003\000.\0001\000\040\000a\000d\000d\000S\000u\000r\000f\000a\000c\000e\000s\000\050\000\051}{subsection.4.18.3}% 319
\BOOKMARK [3][-]{subsubsection.4.18.3.2}{\376\377\0004\000.\0001\0008\000.\0003\000.\0002\000\040\000b\000o\000u\000n\000d\000i\000n\000g\000\137\000b\000o\000x\000\050\000\051}{subsection.4.18.3}% 320
\BOOKMARK [3][-]{subsubsection.4.18.3.3}{\376\377\0004\000.\0001\0008\000.\0003\000.\0003\000\040\000g\000e\000t\000B\000B\000o\000x\000\050\000\051}{subsection.4.18.3}% 321
\BOOKMARK [3][-]{subsubsection.4.18.3.4}{\376\377\0004\000.\0001\0008\000.\0003\000.\0004\000\040\000g\000e\000t\000C\000e\000n\000t\000r\000o\000i\000d\000\050\000\051}{subsection.4.18.3}% 322
\BOOKMARK [3][-]{subsubsection.4.18.3.5}{\376\377\0004\000.\0001\0008\000.\0003\000.\0005\000\040\000g\000e\000t\000M\000a\000t\000e\000r\000i\000a\000l\000\050\000\051}{subsection.4.18.3}% 323
\BOOKMARK [3][-]{subsubsection.4.18.3.6}{\376\377\0004\000.\0001\0008\000.\0003\000.\0006\000\040\000g\000e\000t\000T\000r\000a\000n\000s\000f\000o\000r\000m\000\050\000\051}{subsection.4.18.3}% 324
\BOOKMARK [3][-]{subsubsection.4.18.3.7}{\376\377\0004\000.\0001\0008\000.\0003\000.\0007\000\040\000g\000e\000t\000V\000e\000r\000t\000e\000x\000P\000o\000s\000L\000o\000c\000a\000l\000C\000o\000o\000r\000d\000s\000\050\000\051}{subsection.4.18.3}% 325
\BOOKMARK [3][-]{subsubsection.4.18.3.8}{\376\377\0004\000.\0001\0008\000.\0003\000.\0008\000\040\000g\000e\000t\000V\000e\000r\000t\000e\000x\000P\000o\000s\000W\000o\000r\000l\000d\000C\000o\000o\000r\000d\000s\000\050\000\051}{subsection.4.18.3}% 326
\BOOKMARK [3][-]{subsubsection.4.18.3.9}{\376\377\0004\000.\0001\0008\000.\0003\000.\0009\000\040\000h\000i\000t\000\050\000\051}{subsection.4.18.3}% 327
\BOOKMARK [3][-]{subsubsection.4.18.3.10}{\376\377\0004\000.\0001\0008\000.\0003\000.\0001\0000\000\040\000i\000s\000S\000m\000o\000o\000t\000h\000S\000h\000a\000d\000e\000d\000\050\000\051}{subsection.4.18.3}% 328
\BOOKMARK [3][-]{subsubsection.4.18.3.11}{\376\377\0004\000.\0001\0008\000.\0003\000.\0001\0001\000\040\000s\000e\000t\000I\000D\000\050\000\051}{subsection.4.18.3}% 329
\BOOKMARK [3][-]{subsubsection.4.18.3.12}{\376\377\0004\000.\0001\0008\000.\0003\000.\0001\0002\000\040\000s\000e\000t\000M\000a\000t\000e\000r\000i\000a\000l\000\050\000\051}{subsection.4.18.3}% 330
\BOOKMARK [3][-]{subsubsection.4.18.3.13}{\376\377\0004\000.\0001\0008\000.\0003\000.\0001\0003\000\040\000s\000e\000t\000S\000m\000o\000o\000t\000h\000S\000h\000a\000d\000i\000n\000g\000\050\000\051}{subsection.4.18.3}% 331
\BOOKMARK [3][-]{subsubsection.4.18.3.14}{\376\377\0004\000.\0001\0008\000.\0003\000.\0001\0004\000\040\000s\000e\000t\000T\000r\000a\000n\000s\000f\000o\000r\000m\000\050\000\051}{subsection.4.18.3}% 332
\BOOKMARK [3][-]{subsubsection.4.18.3.15}{\376\377\0004\000.\0001\0008\000.\0003\000.\0001\0005\000\040\000s\000e\000t\000V\000e\000r\000t\000e\000x\000P\000o\000s\000L\000o\000c\000a\000l\000C\000o\000o\000r\000d\000s\000\050\000\051}{subsection.4.18.3}% 333
\BOOKMARK [3][-]{subsubsection.4.18.3.16}{\376\377\0004\000.\0001\0008\000.\0003\000.\0001\0006\000\040\000t\000r\000a\000n\000s\000f\000o\000r\000m\000\050\000\051}{subsection.4.18.3}% 334
\BOOKMARK [2][-]{subsection.4.18.4}{\376\377\0004\000.\0001\0008\000.\0004\000\040\000M\000e\000m\000b\000e\000r\000\040\000D\000a\000t\000a\000\040\000D\000o\000c\000u\000m\000e\000n\000t\000a\000t\000i\000o\000n}{section.4.18}% 335
\BOOKMARK [3][-]{subsubsection.4.18.4.1}{\376\377\0004\000.\0001\0008\000.\0004\000.\0001\000\040\000b\000\137\000b\000o\000x}{subsection.4.18.4}% 336
\BOOKMARK [3][-]{subsubsection.4.18.4.2}{\376\377\0004\000.\0001\0008\000.\0004\000.\0002\000\040\000b\000\137\000b\000o\000x\000\137\000d\000e\000f}{subsection.4.18.4}% 337
\BOOKMARK [3][-]{subsubsection.4.18.4.3}{\376\377\0004\000.\0001\0008\000.\0004\000.\0003\000\040\000i\000d}{subsection.4.18.4}% 338
\BOOKMARK [3][-]{subsubsection.4.18.4.4}{\376\377\0004\000.\0001\0008\000.\0004\000.\0004\000\040\000l\000o\000c\000a\000l\000\137\000n}{subsection.4.18.4}% 339
\BOOKMARK [3][-]{subsubsection.4.18.4.5}{\376\377\0004\000.\0001\0008\000.\0004\000.\0005\000\040\000m}{subsection.4.18.4}% 340
\BOOKMARK [3][-]{subsubsection.4.18.4.6}{\376\377\0004\000.\0001\0008\000.\0004\000.\0006\000\040\000n}{subsection.4.18.4}% 341
\BOOKMARK [3][-]{subsubsection.4.18.4.7}{\376\377\0004\000.\0001\0008\000.\0004\000.\0007\000\040\000s\000m\000o\000o\000t\000h\000\137\000s\000h\000a\000d\000i\000n\000g}{subsection.4.18.4}% 342
\BOOKMARK [3][-]{subsubsection.4.18.4.8}{\376\377\0004\000.\0001\0008\000.\0004\000.\0008\000\040\000t\000f}{subsection.4.18.4}% 343
\BOOKMARK [3][-]{subsubsection.4.18.4.9}{\376\377\0004\000.\0001\0008\000.\0004\000.\0009\000\040\000v\000e\000r\000t\000e\000x\000e\000s}{subsection.4.18.4}% 344
\BOOKMARK [1][-]{section.4.19}{\376\377\0004\000.\0001\0009\000\040\000T\000r\000a\000n\000s\000f\000o\000r\000m\000\040\000C\000l\000a\000s\000s\000\040\000R\000e\000f\000e\000r\000e\000n\000c\000e}{chapter.4}% 345
\BOOKMARK [2][-]{subsection.4.19.1}{\376\377\0004\000.\0001\0009\000.\0001\000\040\000D\000e\000t\000a\000i\000l\000e\000d\000\040\000D\000e\000s\000c\000r\000i\000p\000t\000i\000o\000n}{section.4.19}% 346
\BOOKMARK [2][-]{subsection.4.19.2}{\376\377\0004\000.\0001\0009\000.\0002\000\040\000C\000o\000n\000s\000t\000r\000u\000c\000t\000o\000r\000\040\000\046\000\040\000D\000e\000s\000t\000r\000u\000c\000t\000o\000r\000\040\000D\000o\000c\000u\000m\000e\000n\000t\000a\000t\000i\000o\000n}{section.4.19}% 347
\BOOKMARK [3][-]{subsubsection.4.19.2.1}{\376\377\0004\000.\0001\0009\000.\0002\000.\0001\000\040\000T\000r\000a\000n\000s\000f\000o\000r\000m\000\050\000\051\000\040\000[\0001\000/\0004\000]}{subsection.4.19.2}% 348
\BOOKMARK [3][-]{subsubsection.4.19.2.2}{\376\377\0004\000.\0001\0009\000.\0002\000.\0002\000\040\000T\000r\000a\000n\000s\000f\000o\000r\000m\000\050\000\051\000\040\000[\0002\000/\0004\000]}{subsection.4.19.2}% 349
\BOOKMARK [3][-]{subsubsection.4.19.2.3}{\376\377\0004\000.\0001\0009\000.\0002\000.\0003\000\040\000T\000r\000a\000n\000s\000f\000o\000r\000m\000\050\000\051\000\040\000[\0003\000/\0004\000]}{subsection.4.19.2}% 350
\BOOKMARK [3][-]{subsubsection.4.19.2.4}{\376\377\0004\000.\0001\0009\000.\0002\000.\0004\000\040\000T\000r\000a\000n\000s\000f\000o\000r\000m\000\050\000\051\000\040\000[\0004\000/\0004\000]}{subsection.4.19.2}% 351
\BOOKMARK [2][-]{subsection.4.19.3}{\376\377\0004\000.\0001\0009\000.\0003\000\040\000M\000e\000m\000b\000e\000r\000\040\000F\000u\000n\000c\000t\000i\000o\000n\000\040\000D\000o\000c\000u\000m\000e\000n\000t\000a\000t\000i\000o\000n}{section.4.19}% 352
\BOOKMARK [3][-]{subsubsection.4.19.3.1}{\376\377\0004\000.\0001\0009\000.\0003\000.\0001\000\040\000a\000d\000d\000C\000h\000i\000l\000d\000\050\000\051}{subsection.4.19.3}% 353
\BOOKMARK [3][-]{subsubsection.4.19.3.2}{\376\377\0004\000.\0001\0009\000.\0003\000.\0002\000\040\000g\000e\000t\000C\000h\000i\000l\000d\000\050\000\051}{subsection.4.19.3}% 354
\BOOKMARK [3][-]{subsubsection.4.19.3.3}{\376\377\0004\000.\0001\0009\000.\0003\000.\0003\000\040\000g\000e\000t\000G\000l\000o\000b\000a\000l\000M\000a\000t\000\050\000\051}{subsection.4.19.3}% 355
\BOOKMARK [3][-]{subsubsection.4.19.3.4}{\376\377\0004\000.\0001\0009\000.\0003\000.\0004\000\040\000g\000e\000t\000G\000l\000o\000b\000a\000l\000M\000a\000t\000I\000n\000v\000\050\000\051}{subsection.4.19.3}% 356
\BOOKMARK [3][-]{subsubsection.4.19.3.5}{\376\377\0004\000.\0001\0009\000.\0003\000.\0005\000\040\000g\000e\000t\000M\000a\000t\000\050\000\051}{subsection.4.19.3}% 357
\BOOKMARK [3][-]{subsubsection.4.19.3.6}{\376\377\0004\000.\0001\0009\000.\0003\000.\0006\000\040\000s\000e\000t\000M\000a\000t\000\050\000\051}{subsection.4.19.3}% 358
\BOOKMARK [3][-]{subsubsection.4.19.3.7}{\376\377\0004\000.\0001\0009\000.\0003\000.\0007\000\040\000u\000p\000d\000a\000t\000e\000\137\000g\000l\000o\000b\000a\000l\000\137\000t\000f\000\050\000\051\000\040\000[\0001\000/\0002\000]}{subsection.4.19.3}% 359
\BOOKMARK [3][-]{subsubsection.4.19.3.8}{\376\377\0004\000.\0001\0009\000.\0003\000.\0008\000\040\000u\000p\000d\000a\000t\000e\000\137\000g\000l\000o\000b\000a\000l\000\137\000t\000f\000\050\000\051\000\040\000[\0002\000/\0002\000]}{subsection.4.19.3}% 360
\BOOKMARK [3][-]{subsubsection.4.19.3.9}{\376\377\0004\000.\0001\0009\000.\0003\000.\0009\000\040\000u\000p\000d\000a\000t\000e\000\137\000l\000o\000c\000a\000l\000\137\000t\000f\000\050\000\051}{subsection.4.19.3}% 361
\BOOKMARK [2][-]{subsection.4.19.4}{\376\377\0004\000.\0001\0009\000.\0004\000\040\000M\000e\000m\000b\000e\000r\000\040\000D\000a\000t\000a\000\040\000D\000o\000c\000u\000m\000e\000n\000t\000a\000t\000i\000o\000n}{section.4.19}% 362
\BOOKMARK [3][-]{subsubsection.4.19.4.1}{\376\377\0004\000.\0001\0009\000.\0004\000.\0001\000\040\000c\000h\000i\000l\000d\000s}{subsection.4.19.4}% 363
\BOOKMARK [3][-]{subsubsection.4.19.4.2}{\376\377\0004\000.\0001\0009\000.\0004\000.\0002\000\040\000g\000l\000o\000b\000a\000l\000\137\000t\000f}{subsection.4.19.4}% 364
\BOOKMARK [3][-]{subsubsection.4.19.4.3}{\376\377\0004\000.\0001\0009\000.\0004\000.\0003\000\040\000g\000l\000o\000b\000a\000l\000\137\000t\000f\000\137\000i\000n\000v}{subsection.4.19.4}% 365
\BOOKMARK [3][-]{subsubsection.4.19.4.4}{\376\377\0004\000.\0001\0009\000.\0004\000.\0004\000\040\000i\000d}{subsection.4.19.4}% 366
\BOOKMARK [3][-]{subsubsection.4.19.4.5}{\376\377\0004\000.\0001\0009\000.\0004\000.\0005\000\040\000l\000o\000c\000a\000l\000\137\000t\000f}{subsection.4.19.4}% 367
\BOOKMARK [1][-]{section.4.20}{\376\377\0004\000.\0002\0000\000\040\000T\000r\000i\000a\000n\000g\000l\000e\000\040\000C\000l\000a\000s\000s\000\040\000R\000e\000f\000e\000r\000e\000n\000c\000e}{chapter.4}% 368
\BOOKMARK [2][-]{subsection.4.20.1}{\376\377\0004\000.\0002\0000\000.\0001\000\040\000D\000e\000t\000a\000i\000l\000e\000d\000\040\000D\000e\000s\000c\000r\000i\000p\000t\000i\000o\000n}{section.4.20}% 369
\BOOKMARK [2][-]{subsection.4.20.2}{\376\377\0004\000.\0002\0000\000.\0002\000\040\000C\000o\000n\000s\000t\000r\000u\000c\000t\000o\000r\000\040\000\046\000\040\000D\000e\000s\000t\000r\000u\000c\000t\000o\000r\000\040\000D\000o\000c\000u\000m\000e\000n\000t\000a\000t\000i\000o\000n}{section.4.20}% 370
\BOOKMARK [3][-]{subsubsection.4.20.2.1}{\376\377\0004\000.\0002\0000\000.\0002\000.\0001\000\040\000T\000r\000i\000a\000n\000g\000l\000e\000\050\000\051\000\040\000[\0001\000/\0004\000]}{subsection.4.20.2}% 371
\BOOKMARK [3][-]{subsubsection.4.20.2.2}{\376\377\0004\000.\0002\0000\000.\0002\000.\0002\000\040\000T\000r\000i\000a\000n\000g\000l\000e\000\050\000\051\000\040\000[\0002\000/\0004\000]}{subsection.4.20.2}% 372
\BOOKMARK [3][-]{subsubsection.4.20.2.3}{\376\377\0004\000.\0002\0000\000.\0002\000.\0003\000\040\000T\000r\000i\000a\000n\000g\000l\000e\000\050\000\051\000\040\000[\0003\000/\0004\000]}{subsection.4.20.2}% 373
\BOOKMARK [3][-]{subsubsection.4.20.2.4}{\376\377\0004\000.\0002\0000\000.\0002\000.\0004\000\040\000T\000r\000i\000a\000n\000g\000l\000e\000\050\000\051\000\040\000[\0004\000/\0004\000]}{subsection.4.20.2}% 374
\BOOKMARK [2][-]{subsection.4.20.3}{\376\377\0004\000.\0002\0000\000.\0003\000\040\000M\000e\000m\000b\000e\000r\000\040\000F\000u\000n\000c\000t\000i\000o\000n\000\040\000D\000o\000c\000u\000m\000e\000n\000t\000a\000t\000i\000o\000n}{section.4.20}% 375
\BOOKMARK [3][-]{subsubsection.4.20.3.1}{\376\377\0004\000.\0002\0000\000.\0003\000.\0001\000\040\000a\000d\000d\000S\000u\000r\000f\000a\000c\000e\000s\000\050\000\051}{subsection.4.20.3}% 376
\BOOKMARK [3][-]{subsubsection.4.20.3.2}{\376\377\0004\000.\0002\0000\000.\0003\000.\0002\000\040\000b\000o\000u\000n\000d\000i\000n\000g\000\137\000b\000o\000x\000\050\000\051}{subsection.4.20.3}% 377
\BOOKMARK [3][-]{subsubsection.4.20.3.3}{\376\377\0004\000.\0002\0000\000.\0003\000.\0003\000\040\000g\000e\000t\000B\000B\000o\000x\000\050\000\051}{subsection.4.20.3}% 378
\BOOKMARK [3][-]{subsubsection.4.20.3.4}{\376\377\0004\000.\0002\0000\000.\0003\000.\0004\000\040\000g\000e\000t\000C\000e\000n\000t\000r\000o\000i\000d\000\050\000\051}{subsection.4.20.3}% 379
\BOOKMARK [3][-]{subsubsection.4.20.3.5}{\376\377\0004\000.\0002\0000\000.\0003\000.\0005\000\040\000h\000i\000t\000\050\000\051}{subsection.4.20.3}% 380
\BOOKMARK [2][-]{subsection.4.20.4}{\376\377\0004\000.\0002\0000\000.\0004\000\040\000M\000e\000m\000b\000e\000r\000\040\000D\000a\000t\000a\000\040\000D\000o\000c\000u\000m\000e\000n\000t\000a\000t\000i\000o\000n}{section.4.20}% 381
\BOOKMARK [3][-]{subsubsection.4.20.4.1}{\376\377\0004\000.\0002\0000\000.\0004\000.\0001\000\040\000c\000w}{subsection.4.20.4}% 382
\BOOKMARK [3][-]{subsubsection.4.20.4.2}{\376\377\0004\000.\0002\0000\000.\0004\000.\0002\000\040\000v\000a}{subsection.4.20.4}% 383
\BOOKMARK [3][-]{subsubsection.4.20.4.3}{\376\377\0004\000.\0002\0000\000.\0004\000.\0003\000\040\000v\000b}{subsection.4.20.4}% 384
\BOOKMARK [3][-]{subsubsection.4.20.4.4}{\376\377\0004\000.\0002\0000\000.\0004\000.\0004\000\040\000v\000c}{subsection.4.20.4}% 385
\BOOKMARK [1][-]{section.4.21}{\376\377\0004\000.\0002\0001\000\040\000V\000e\000c\000\040\000C\000l\000a\000s\000s\000\040\000R\000e\000f\000e\000r\000e\000n\000c\000e}{chapter.4}% 386
\BOOKMARK [2][-]{subsection.4.21.1}{\376\377\0004\000.\0002\0001\000.\0001\000\040\000D\000e\000t\000a\000i\000l\000e\000d\000\040\000D\000e\000s\000c\000r\000i\000p\000t\000i\000o\000n}{section.4.21}% 387
\BOOKMARK [2][-]{subsection.4.21.2}{\376\377\0004\000.\0002\0001\000.\0002\000\040\000C\000o\000n\000s\000t\000r\000u\000c\000t\000o\000r\000\040\000\046\000\040\000D\000e\000s\000t\000r\000u\000c\000t\000o\000r\000\040\000D\000o\000c\000u\000m\000e\000n\000t\000a\000t\000i\000o\000n}{section.4.21}% 388
\BOOKMARK [3][-]{subsubsection.4.21.2.1}{\376\377\0004\000.\0002\0001\000.\0002\000.\0001\000\040\000V\000e\000c\000\050\000\051}{subsection.4.21.2}% 389
\BOOKMARK [2][-]{subsection.4.21.3}{\376\377\0004\000.\0002\0001\000.\0003\000\040\000M\000e\000m\000b\000e\000r\000\040\000F\000u\000n\000c\000t\000i\000o\000n\000\040\000D\000o\000c\000u\000m\000e\000n\000t\000a\000t\000i\000o\000n}{section.4.21}% 390
\BOOKMARK [3][-]{subsubsection.4.21.3.1}{\376\377\0004\000.\0002\0001\000.\0003\000.\0001\000\040\000d\000i\000v\000\050\000\051}{subsection.4.21.3}% 391
\BOOKMARK [3][-]{subsubsection.4.21.3.2}{\376\377\0004\000.\0002\0001\000.\0003\000.\0002\000\040\000d\000o\000t\000\050\000\051}{subsection.4.21.3}% 392
\BOOKMARK [3][-]{subsubsection.4.21.3.3}{\376\377\0004\000.\0002\0001\000.\0003\000.\0003\000\040\000m\000u\000l\000t\000\050\000\051}{subsection.4.21.3}% 393
\BOOKMARK [3][-]{subsubsection.4.21.3.4}{\376\377\0004\000.\0002\0001\000.\0003\000.\0004\000\040\000n\000o\000r\000m\000\050\000\051}{subsection.4.21.3}% 394
\BOOKMARK [3][-]{subsubsection.4.21.3.5}{\376\377\0004\000.\0002\0001\000.\0003\000.\0005\000\040\000n\000o\000r\000m\000a\000l\000i\000z\000e\000\050\000\051}{subsection.4.21.3}% 395
\BOOKMARK [3][-]{subsubsection.4.21.3.6}{\376\377\0004\000.\0002\0001\000.\0003\000.\0006\000\040\000o\000p\000e\000r\000a\000t\000o\000r\000\045\000\050\000\051}{subsection.4.21.3}% 396
\BOOKMARK [3][-]{subsubsection.4.21.3.7}{\376\377\0004\000.\0002\0001\000.\0003\000.\0007\000\040\000o\000p\000e\000r\000a\000t\000o\000r\000*\000\050\000\051}{subsection.4.21.3}% 397
\BOOKMARK [3][-]{subsubsection.4.21.3.8}{\376\377\0004\000.\0002\0001\000.\0003\000.\0008\000\040\000o\000p\000e\000r\000a\000t\000o\000r\000+\000\050\000\051}{subsection.4.21.3}% 398
\BOOKMARK [3][-]{subsubsection.4.21.3.9}{\376\377\0004\000.\0002\0001\000.\0003\000.\0009\000\040\000o\000p\000e\000r\000a\000t\000o\000r\000-\000\050\000\051}{subsection.4.21.3}% 399
\BOOKMARK [3][-]{subsubsection.4.21.3.10}{\376\377\0004\000.\0002\0001\000.\0003\000.\0001\0000\000\040\000o\000p\000e\000r\000a\000t\000o\000r\000/\000\050\000\051}{subsection.4.21.3}% 400
\BOOKMARK [3][-]{subsubsection.4.21.3.11}{\376\377\0004\000.\0002\0001\000.\0003\000.\0001\0001\000\040\000o\000p\000e\000r\000a\000t\000o\000r\000[\000]\000\050\000\051}{subsection.4.21.3}% 401
\BOOKMARK [3][-]{subsubsection.4.21.3.12}{\376\377\0004\000.\0002\0001\000.\0003\000.\0001\0002\000\040\000p\000r\000i\000n\000t\000\050\000\051}{subsection.4.21.3}% 402
\BOOKMARK [2][-]{subsection.4.21.4}{\376\377\0004\000.\0002\0001\000.\0004\000\040\000M\000e\000m\000b\000e\000r\000\040\000D\000a\000t\000a\000\040\000D\000o\000c\000u\000m\000e\000n\000t\000a\000t\000i\000o\000n}{section.4.21}% 403
\BOOKMARK [3][-]{subsubsection.4.21.4.1}{\376\377\0004\000.\0002\0001\000.\0004\000.\0001\000\040\000x}{subsection.4.21.4}% 404
\BOOKMARK [3][-]{subsubsection.4.21.4.2}{\376\377\0004\000.\0002\0001\000.\0004\000.\0002\000\040\000y}{subsection.4.21.4}% 405
\BOOKMARK [3][-]{subsubsection.4.21.4.3}{\376\377\0004\000.\0002\0001\000.\0004\000.\0003\000\040\000z}{subsection.4.21.4}% 406
\BOOKMARK [1][-]{section.4.22}{\376\377\0004\000.\0002\0002\000\040\000V\000e\000r\000t\000e\000x\000\040\000C\000l\000a\000s\000s\000\040\000R\000e\000f\000e\000r\000e\000n\000c\000e}{chapter.4}% 407
\BOOKMARK [2][-]{subsection.4.22.1}{\376\377\0004\000.\0002\0002\000.\0001\000\040\000D\000e\000t\000a\000i\000l\000e\000d\000\040\000D\000e\000s\000c\000r\000i\000p\000t\000i\000o\000n}{section.4.22}% 408
\BOOKMARK [2][-]{subsection.4.22.2}{\376\377\0004\000.\0002\0002\000.\0002\000\040\000C\000o\000n\000s\000t\000r\000u\000c\000t\000o\000r\000\040\000\046\000\040\000D\000e\000s\000t\000r\000u\000c\000t\000o\000r\000\040\000D\000o\000c\000u\000m\000e\000n\000t\000a\000t\000i\000o\000n}{section.4.22}% 409
\BOOKMARK [3][-]{subsubsection.4.22.2.1}{\376\377\0004\000.\0002\0002\000.\0002\000.\0001\000\040\000V\000e\000r\000t\000e\000x\000\050\000\051\000\040\000[\0001\000/\0003\000]}{subsection.4.22.2}% 410
\BOOKMARK [3][-]{subsubsection.4.22.2.2}{\376\377\0004\000.\0002\0002\000.\0002\000.\0002\000\040\000V\000e\000r\000t\000e\000x\000\050\000\051\000\040\000[\0002\000/\0003\000]}{subsection.4.22.2}% 411
\BOOKMARK [3][-]{subsubsection.4.22.2.3}{\376\377\0004\000.\0002\0002\000.\0002\000.\0003\000\040\000V\000e\000r\000t\000e\000x\000\050\000\051\000\040\000[\0003\000/\0003\000]}{subsection.4.22.2}% 412
\BOOKMARK [2][-]{subsection.4.22.3}{\376\377\0004\000.\0002\0002\000.\0003\000\040\000M\000e\000m\000b\000e\000r\000\040\000F\000u\000n\000c\000t\000i\000o\000n\000\040\000D\000o\000c\000u\000m\000e\000n\000t\000a\000t\000i\000o\000n}{section.4.22}% 413
\BOOKMARK [3][-]{subsubsection.4.22.3.1}{\376\377\0004\000.\0002\0002\000.\0003\000.\0001\000\040\000t\000r\000a\000n\000s\000f\000o\000r\000m\000\050\000\051}{subsection.4.22.3}% 414
\BOOKMARK [2][-]{subsection.4.22.4}{\376\377\0004\000.\0002\0002\000.\0004\000\040\000M\000e\000m\000b\000e\000r\000\040\000D\000a\000t\000a\000\040\000D\000o\000c\000u\000m\000e\000n\000t\000a\000t\000i\000o\000n}{section.4.22}% 415
\BOOKMARK [3][-]{subsubsection.4.22.4.1}{\376\377\0004\000.\0002\0002\000.\0004\000.\0001\000\040\000l\000o\000c\000a\000l\000\137\000n}{subsection.4.22.4}% 416
\BOOKMARK [3][-]{subsubsection.4.22.4.2}{\376\377\0004\000.\0002\0002\000.\0004\000.\0002\000\040\000l\000o\000c\000a\000l\000\137\000o}{subsection.4.22.4}% 417
\BOOKMARK [3][-]{subsubsection.4.22.4.3}{\376\377\0004\000.\0002\0002\000.\0004\000.\0003\000\040\000n}{subsection.4.22.4}% 418
\BOOKMARK [3][-]{subsubsection.4.22.4.4}{\376\377\0004\000.\0002\0002\000.\0004\000.\0004\000\040\000o}{subsection.4.22.4}% 419
\BOOKMARK [3][-]{subsubsection.4.22.4.5}{\376\377\0004\000.\0002\0002\000.\0004\000.\0005\000\040\000t\000e\000x\000\137\000c\000o\000o\000r\000d}{subsection.4.22.4}% 420
\BOOKMARK [0][-]{chapter.5}{\376\377\0005\000\040\000F\000i\000l\000e\000\040\000D\000o\000c\000u\000m\000e\000n\000t\000a\000t\000i\000o\000n}{}% 421
\BOOKMARK [1][-]{section.5.1}{\376\377\0005\000.\0001\000\040\000s\000r\000c\000/\000B\000i\000l\000l\000b\000o\000a\000r\000d\000.\000c\000p\000p\000\040\000F\000i\000l\000e\000\040\000R\000e\000f\000e\000r\000e\000n\000c\000e}{chapter.5}% 422
\BOOKMARK [1][-]{section.5.2}{\376\377\0005\000.\0002\000\040\000s\000r\000c\000/\000B\000i\000l\000l\000b\000o\000a\000r\000d\000.\000h\000p\000p\000\040\000F\000i\000l\000e\000\040\000R\000e\000f\000e\000r\000e\000n\000c\000e}{chapter.5}% 423
\BOOKMARK [1][-]{section.5.3}{\376\377\0005\000.\0003\000\040\000s\000r\000c\000/\000B\000i\000l\000l\000b\000o\000a\000r\000d\000T\000r\000a\000n\000s\000f\000o\000r\000m\000.\000c\000p\000p\000\040\000F\000i\000l\000e\000\040\000R\000e\000f\000e\000r\000e\000n\000c\000e}{chapter.5}% 424
\BOOKMARK [1][-]{section.5.4}{\376\377\0005\000.\0004\000\040\000s\000r\000c\000/\000B\000i\000l\000l\000b\000o\000a\000r\000d\000T\000r\000a\000n\000s\000f\000o\000r\000m\000.\000h\000p\000p\000\040\000F\000i\000l\000e\000\040\000R\000e\000f\000e\000r\000e\000n\000c\000e}{chapter.5}% 425
\BOOKMARK [1][-]{section.5.5}{\376\377\0005\000.\0005\000\040\000s\000r\000c\000/\000B\000o\000x\000.\000c\000p\000p\000\040\000F\000i\000l\000e\000\040\000R\000e\000f\000e\000r\000e\000n\000c\000e}{chapter.5}% 426
\BOOKMARK [1][-]{section.5.6}{\376\377\0005\000.\0006\000\040\000s\000r\000c\000/\000B\000o\000x\000.\000h\000p\000p\000\040\000F\000i\000l\000e\000\040\000R\000e\000f\000e\000r\000e\000n\000c\000e}{chapter.5}% 427
\BOOKMARK [1][-]{section.5.7}{\376\377\0005\000.\0007\000\040\000s\000r\000c\000/\000B\000V\000H\000.\000c\000p\000p\000\040\000F\000i\000l\000e\000\040\000R\000e\000f\000e\000r\000e\000n\000c\000e}{chapter.5}% 428
\BOOKMARK [1][-]{section.5.8}{\376\377\0005\000.\0008\000\040\000s\000r\000c\000/\000B\000V\000H\000.\000h\000\040\000F\000i\000l\000e\000\040\000R\000e\000f\000e\000r\000e\000n\000c\000e}{chapter.5}% 429
\BOOKMARK [1][-]{section.5.9}{\376\377\0005\000.\0009\000\040\000s\000r\000c\000/\000C\000a\000m\000e\000r\000a\000.\000c\000p\000p\000\040\000F\000i\000l\000e\000\040\000R\000e\000f\000e\000r\000e\000n\000c\000e}{chapter.5}% 430
\BOOKMARK [1][-]{section.5.10}{\376\377\0005\000.\0001\0000\000\040\000s\000r\000c\000/\000C\000a\000m\000e\000r\000a\000.\000h\000p\000p\000\040\000F\000i\000l\000e\000\040\000R\000e\000f\000e\000r\000e\000n\000c\000e}{chapter.5}% 431
\BOOKMARK [1][-]{section.5.11}{\376\377\0005\000.\0001\0001\000\040\000s\000r\000c\000/\000L\000i\000g\000h\000t\000.\000c\000p\000p\000\040\000F\000i\000l\000e\000\040\000R\000e\000f\000e\000r\000e\000n\000c\000e}{chapter.5}% 432
\BOOKMARK [1][-]{section.5.12}{\376\377\0005\000.\0001\0002\000\040\000s\000r\000c\000/\000L\000i\000g\000h\000t\000.\000h\000p\000p\000\040\000F\000i\000l\000e\000\040\000R\000e\000f\000e\000r\000e\000n\000c\000e}{chapter.5}% 433
\BOOKMARK [1][-]{section.5.13}{\376\377\0005\000.\0001\0003\000\040\000s\000r\000c\000/\000M\000a\000t\000.\000c\000p\000p\000\040\000F\000i\000l\000e\000\040\000R\000e\000f\000e\000r\000e\000n\000c\000e}{chapter.5}% 434
\BOOKMARK [2][-]{subsection.5.13.1}{\376\377\0005\000.\0001\0003\000.\0001\000\040\000F\000u\000n\000c\000t\000i\000o\000n\000\040\000D\000o\000c\000u\000m\000e\000n\000t\000a\000t\000i\000o\000n}{section.5.13}% 435
\BOOKMARK [3][-]{subsubsection.5.13.1.1}{\376\377\0005\000.\0001\0003\000.\0001\000.\0001\000\040\000O\000n\000l\000y\000R\000o\000t\000\050\000\051}{subsection.5.13.1}% 436
\BOOKMARK [3][-]{subsubsection.5.13.1.2}{\376\377\0005\000.\0001\0003\000.\0001\000.\0002\000\040\000o\000p\000e\000r\000a\000t\000o\000r\000*\000\050\000\051\000\040\000[\0001\000/\0002\000]}{subsection.5.13.1}% 437
\BOOKMARK [3][-]{subsubsection.5.13.1.3}{\376\377\0005\000.\0001\0003\000.\0001\000.\0003\000\040\000o\000p\000e\000r\000a\000t\000o\000r\000*\000\050\000\051\000\040\000[\0002\000/\0002\000]}{subsection.5.13.1}% 438
\BOOKMARK [1][-]{section.5.14}{\376\377\0005\000.\0001\0004\000\040\000s\000r\000c\000/\000M\000a\000t\000.\000h\000p\000p\000\040\000F\000i\000l\000e\000\040\000R\000e\000f\000e\000r\000e\000n\000c\000e}{chapter.5}% 439
\BOOKMARK [2][-]{subsection.5.14.1}{\376\377\0005\000.\0001\0004\000.\0001\000\040\000F\000u\000n\000c\000t\000i\000o\000n\000\040\000D\000o\000c\000u\000m\000e\000n\000t\000a\000t\000i\000o\000n}{section.5.14}% 440
\BOOKMARK [3][-]{subsubsection.5.14.1.1}{\376\377\0005\000.\0001\0004\000.\0001\000.\0001\000\040\000O\000n\000l\000y\000R\000o\000t\000\050\000\051}{subsection.5.14.1}% 441
\BOOKMARK [3][-]{subsubsection.5.14.1.2}{\376\377\0005\000.\0001\0004\000.\0001\000.\0002\000\040\000o\000p\000e\000r\000a\000t\000o\000r\000*\000\050\000\051\000\040\000[\0001\000/\0002\000]}{subsection.5.14.1}% 442
\BOOKMARK [3][-]{subsubsection.5.14.1.3}{\376\377\0005\000.\0001\0004\000.\0001\000.\0003\000\040\000o\000p\000e\000r\000a\000t\000o\000r\000*\000\050\000\051\000\040\000[\0002\000/\0002\000]}{subsection.5.14.1}% 443
\BOOKMARK [1][-]{section.5.15}{\376\377\0005\000.\0001\0005\000\040\000s\000r\000c\000/\000M\000a\000t\000e\000r\000i\000a\000l\000.\000c\000p\000p\000\040\000F\000i\000l\000e\000\040\000R\000e\000f\000e\000r\000e\000n\000c\000e}{chapter.5}% 444
\BOOKMARK [1][-]{section.5.16}{\376\377\0005\000.\0001\0006\000\040\000s\000r\000c\000/\000M\000a\000t\000e\000r\000i\000a\000l\000.\000h\000p\000p\000\040\000F\000i\000l\000e\000\040\000R\000e\000f\000e\000r\000e\000n\000c\000e}{chapter.5}% 445
\BOOKMARK [1][-]{section.5.17}{\376\377\0005\000.\0001\0007\000\040\000s\000r\000c\000/\000M\000e\000s\000h\000.\000c\000p\000p\000\040\000F\000i\000l\000e\000\040\000R\000e\000f\000e\000r\000e\000n\000c\000e}{chapter.5}% 446
\BOOKMARK [1][-]{section.5.18}{\376\377\0005\000.\0001\0008\000\040\000s\000r\000c\000/\000M\000e\000s\000h\000.\000h\000p\000p\000\040\000F\000i\000l\000e\000\040\000R\000e\000f\000e\000r\000e\000n\000c\000e}{chapter.5}% 447
\BOOKMARK [1][-]{section.5.19}{\376\377\0005\000.\0001\0009\000\040\000s\000r\000c\000/\000R\000a\000y\000.\000h\000p\000p\000\040\000F\000i\000l\000e\000\040\000R\000e\000f\000e\000r\000e\000n\000c\000e}{chapter.5}% 448
\BOOKMARK [1][-]{section.5.20}{\376\377\0005\000.\0002\0000\000\040\000s\000r\000c\000/\000R\000a\000y\000T\000r\000a\000c\000e\000r\000.\000c\000p\000p\000\040\000F\000i\000l\000e\000\040\000R\000e\000f\000e\000r\000e\000n\000c\000e}{chapter.5}% 449
\BOOKMARK [1][-]{section.5.21}{\376\377\0005\000.\0002\0001\000\040\000s\000r\000c\000/\000R\000a\000y\000T\000r\000a\000c\000e\000r\000.\000h\000p\000p\000\040\000F\000i\000l\000e\000\040\000R\000e\000f\000e\000r\000e\000n\000c\000e}{chapter.5}% 450
\BOOKMARK [2][-]{subsection.5.21.1}{\376\377\0005\000.\0002\0001\000.\0001\000\040\000F\000u\000n\000c\000t\000i\000o\000n\000\040\000D\000o\000c\000u\000m\000e\000n\000t\000a\000t\000i\000o\000n}{section.5.21}% 451
\BOOKMARK [3][-]{subsubsection.5.21.1.1}{\376\377\0005\000.\0002\0001\000.\0001\000.\0001\000\040\000c\000l\000a\000m\000p\000\050\000\051}{subsection.5.21.1}% 452
\BOOKMARK [3][-]{subsubsection.5.21.1.2}{\376\377\0005\000.\0002\0001\000.\0001\000.\0002\000\040\000t\000o\000I\000n\000t\000\050\000\051}{subsection.5.21.1}% 453
\BOOKMARK [1][-]{section.5.22}{\376\377\0005\000.\0002\0002\000\040\000s\000r\000c\000/\000S\000c\000e\000n\000e\000.\000c\000p\000p\000\040\000F\000i\000l\000e\000\040\000R\000e\000f\000e\000r\000e\000n\000c\000e}{chapter.5}% 454
\BOOKMARK [1][-]{section.5.23}{\376\377\0005\000.\0002\0003\000\040\000s\000r\000c\000/\000S\000c\000e\000n\000e\000.\000h\000p\000p\000\040\000F\000i\000l\000e\000\040\000R\000e\000f\000e\000r\000e\000n\000c\000e}{chapter.5}% 455
\BOOKMARK [1][-]{section.5.24}{\376\377\0005\000.\0002\0004\000\040\000s\000r\000c\000/\000S\000p\000h\000e\000r\000e\000.\000c\000p\000p\000\040\000F\000i\000l\000e\000\040\000R\000e\000f\000e\000r\000e\000n\000c\000e}{chapter.5}% 456
\BOOKMARK [1][-]{section.5.25}{\376\377\0005\000.\0002\0005\000\040\000s\000r\000c\000/\000S\000p\000h\000e\000r\000e\000.\000h\000p\000p\000\040\000F\000i\000l\000e\000\040\000R\000e\000f\000e\000r\000e\000n\000c\000e}{chapter.5}% 457
\BOOKMARK [1][-]{section.5.26}{\376\377\0005\000.\0002\0006\000\040\000s\000r\000c\000/\000S\000u\000r\000f\000a\000c\000e\000.\000c\000p\000p\000\040\000F\000i\000l\000e\000\040\000R\000e\000f\000e\000r\000e\000n\000c\000e}{chapter.5}% 458
\BOOKMARK [1][-]{section.5.27}{\376\377\0005\000.\0002\0007\000\040\000s\000r\000c\000/\000S\000u\000r\000f\000a\000c\000e\000.\000h\000p\000p\000\040\000F\000i\000l\000e\000\040\000R\000e\000f\000e\000r\000e\000n\000c\000e}{chapter.5}% 459
\BOOKMARK [1][-]{section.5.28}{\376\377\0005\000.\0002\0008\000\040\000s\000r\000c\000/\000T\000r\000a\000n\000s\000f\000o\000r\000m\000.\000c\000p\000p\000\040\000F\000i\000l\000e\000\040\000R\000e\000f\000e\000r\000e\000n\000c\000e}{chapter.5}% 460
\BOOKMARK [1][-]{section.5.29}{\376\377\0005\000.\0002\0009\000\040\000s\000r\000c\000/\000T\000r\000a\000n\000s\000f\000o\000r\000m\000.\000h\000p\000p\000\040\000F\000i\000l\000e\000\040\000R\000e\000f\000e\000r\000e\000n\000c\000e}{chapter.5}% 461
\BOOKMARK [1][-]{section.5.30}{\376\377\0005\000.\0003\0000\000\040\000s\000r\000c\000/\000T\000r\000i\000a\000n\000g\000l\000e\000.\000c\000p\000p\000\040\000F\000i\000l\000e\000\040\000R\000e\000f\000e\000r\000e\000n\000c\000e}{chapter.5}% 462
\BOOKMARK [1][-]{section.5.31}{\376\377\0005\000.\0003\0001\000\040\000s\000r\000c\000/\000T\000r\000i\000a\000n\000g\000l\000e\000.\000h\000p\000p\000\040\000F\000i\000l\000e\000\040\000R\000e\000f\000e\000r\000e\000n\000c\000e}{chapter.5}% 463
\BOOKMARK [1][-]{section.5.32}{\376\377\0005\000.\0003\0002\000\040\000s\000r\000c\000/\000u\000t\000i\000l\000s\000.\000c\000p\000p\000\040\000F\000i\000l\000e\000\040\000R\000e\000f\000e\000r\000e\000n\000c\000e}{chapter.5}% 464
\BOOKMARK [2][-]{subsection.5.32.1}{\376\377\0005\000.\0003\0002\000.\0001\000\040\000F\000u\000n\000c\000t\000i\000o\000n\000\040\000D\000o\000c\000u\000m\000e\000n\000t\000a\000t\000i\000o\000n}{section.5.32}% 465
\BOOKMARK [3][-]{subsubsection.5.32.1.1}{\376\377\0005\000.\0003\0002\000.\0001\000.\0001\000\040\000\137\000\137\000c\000r\000e\000a\000t\000e\000T\000e\000x\000t\000u\000r\000e\000d\000C\000u\000b\000e\000\050\000\051}{subsection.5.32.1}% 466
\BOOKMARK [3][-]{subsubsection.5.32.1.2}{\376\377\0005\000.\0003\0002\000.\0001\000.\0002\000\040\000\137\000\137\000c\000r\000e\000a\000t\000e\000T\000r\000i\000a\000n\000g\000l\000e\000\050\000\051}{subsection.5.32.1}% 467
\BOOKMARK [3][-]{subsubsection.5.32.1.3}{\376\377\0005\000.\0003\0002\000.\0001\000.\0003\000\040\000C\000o\000r\000n\000e\000l\000l\000B\000o\000x\000\050\000\051}{subsection.5.32.1}% 468
\BOOKMARK [3][-]{subsubsection.5.32.1.4}{\376\377\0005\000.\0003\0002\000.\0001\000.\0004\000\040\000C\000o\000r\000n\000e\000l\000l\000B\000o\000x\000T\000e\000x\000t\000u\000r\000e\000d\000\050\000\051}{subsection.5.32.1}% 469
\BOOKMARK [3][-]{subsubsection.5.32.1.5}{\376\377\0005\000.\0003\0002\000.\0001\000.\0005\000\040\000d\000r\000a\000w\000B\000o\000x\000\050\000\051}{subsection.5.32.1}% 470
\BOOKMARK [3][-]{subsubsection.5.32.1.6}{\376\377\0005\000.\0003\0002\000.\0001\000.\0006\000\040\000L\000i\000g\000h\000t\000B\000u\000l\000b\000\050\000\051}{subsection.5.32.1}% 471
\BOOKMARK [3][-]{subsubsection.5.32.1.7}{\376\377\0005\000.\0003\0002\000.\0001\000.\0007\000\040\000m\000a\000i\000n\000\137\000l\000o\000o\000p\000\050\000\051}{subsection.5.32.1}% 472
\BOOKMARK [3][-]{subsubsection.5.32.1.8}{\376\377\0005\000.\0003\0002\000.\0001\000.\0008\000\040\000p\000r\000i\000n\000t\000\137\000m\000a\000t\000r\000i\000x\000\050\000\051}{subsection.5.32.1}% 473
\BOOKMARK [1][-]{section.5.33}{\376\377\0005\000.\0003\0003\000\040\000s\000r\000c\000/\000u\000t\000i\000l\000s\000.\000h\000p\000p\000\040\000F\000i\000l\000e\000\040\000R\000e\000f\000e\000r\000e\000n\000c\000e}{chapter.5}% 474
\BOOKMARK [2][-]{subsection.5.33.1}{\376\377\0005\000.\0003\0003\000.\0001\000\040\000F\000u\000n\000c\000t\000i\000o\000n\000\040\000D\000o\000c\000u\000m\000e\000n\000t\000a\000t\000i\000o\000n}{section.5.33}% 475
\BOOKMARK [3][-]{subsubsection.5.33.1.1}{\376\377\0005\000.\0003\0003\000.\0001\000.\0001\000\040\000C\000o\000r\000n\000e\000l\000l\000B\000o\000x\000\050\000\051}{subsection.5.33.1}% 476
\BOOKMARK [3][-]{subsubsection.5.33.1.2}{\376\377\0005\000.\0003\0003\000.\0001\000.\0002\000\040\000C\000o\000r\000n\000e\000l\000l\000B\000o\000x\000T\000e\000x\000t\000u\000r\000e\000d\000\050\000\051}{subsection.5.33.1}% 477
\BOOKMARK [3][-]{subsubsection.5.33.1.3}{\376\377\0005\000.\0003\0003\000.\0001\000.\0003\000\040\000d\000r\000a\000w\000B\000o\000x\000\050\000\051}{subsection.5.33.1}% 478
\BOOKMARK [3][-]{subsubsection.5.33.1.4}{\376\377\0005\000.\0003\0003\000.\0001\000.\0004\000\040\000L\000i\000g\000h\000t\000B\000u\000l\000b\000\050\000\051}{subsection.5.33.1}% 479
\BOOKMARK [3][-]{subsubsection.5.33.1.5}{\376\377\0005\000.\0003\0003\000.\0001\000.\0005\000\040\000m\000a\000i\000n\000\137\000l\000o\000o\000p\000\050\000\051}{subsection.5.33.1}% 480
\BOOKMARK [3][-]{subsubsection.5.33.1.6}{\376\377\0005\000.\0003\0003\000.\0001\000.\0006\000\040\000p\000r\000i\000n\000t\000\137\000m\000a\000t\000r\000i\000x\000\050\000\051}{subsection.5.33.1}% 481
\BOOKMARK [1][-]{section.5.34}{\376\377\0005\000.\0003\0004\000\040\000s\000r\000c\000/\000V\000e\000c\000.\000h\000p\000p\000\040\000F\000i\000l\000e\000\040\000R\000e\000f\000e\000r\000e\000n\000c\000e}{chapter.5}% 482
\BOOKMARK [1][-]{section.5.35}{\376\377\0005\000.\0003\0005\000\040\000s\000r\000c\000/\000V\000e\000r\000t\000e\000x\000.\000c\000p\000p\000\040\000F\000i\000l\000e\000\040\000R\000e\000f\000e\000r\000e\000n\000c\000e}{chapter.5}% 483
\BOOKMARK [1][-]{section.5.36}{\376\377\0005\000.\0003\0006\000\040\000s\000r\000c\000/\000V\000e\000r\000t\000e\000x\000.\000h\000p\000p\000\040\000F\000i\000l\000e\000\040\000R\000e\000f\000e\000r\000e\000n\000c\000e}{chapter.5}% 484
\BOOKMARK [0][-]{section*.80}{\376\377\000I\000n\000d\000e\000x}{}% 485
