####
#
# OBJ File Generated by Meshlab
#
####
# Object Rock.obj
#
# Vertices: 102
# Faces: 194
#
####
mtllib ./Rock.obj.mtl

v 6.083834 0.000000 6.083834
v -6.083834 0.000000 6.083834
v 6.083834 0.000000 -6.083834
v -6.083834 0.000000 -6.083834
v 0.896930 -0.116701 -1.078061
v 0.736314 -0.076033 1.066762
v -1.052088 -0.064600 0.954513
v -0.692441 -0.114299 -0.835835
v 1.303753 1.083753 -1.023542
v 0.444005 1.032712 1.513821
v -1.019775 1.174950 1.105961
v -0.681862 1.180458 -1.481573
v 1.045407 -0.157597 -0.147996
v 0.067265 -0.072713 -0.783522
v 1.200361 0.538245 -1.221685
v -0.154563 -0.114500 1.228987
v 1.155268 0.478039 1.381585
v -1.094633 -0.254018 -0.118459
v -1.648060 0.452009 0.853586
v -1.185727 0.481559 -1.133555
v 0.975431 1.246559 0.047895
v 0.105258 1.126820 -1.585067
v -0.344848 1.152380 1.730000
v -1.177093 1.303243 0.009798
v -0.015789 -0.312706 -0.060242
v 0.046107 1.351565 -0.253730
v 1.175182 0.692469 0.169032
v 0.260077 0.452640 1.365451
v -1.648881 0.429819 -0.064031
v -0.199824 0.336820 -1.536424
v 1.008866 -0.126459 0.470257
v -0.321458 -0.060305 -0.702046
v 1.385825 0.807576 -1.181814
v -0.537873 -0.057997 1.154378
v 0.936321 0.677546 1.426494
v -0.862364 -0.219203 -0.537108
v -1.281588 0.883991 1.218077
v -0.974527 0.926074 -1.431442
v 0.808457 1.346412 0.902078
v -0.174992 1.147173 -1.801163
v -0.610285 1.147948 1.327881
v -1.356023 1.245036 -0.716849
v 1.042022 -0.190494 -0.637866
v 0.468949 -0.142859 -1.026806
v 1.081272 0.175115 -1.287556
v 0.243586 -0.141476 1.191072
v 1.014587 0.183491 1.312948
v -1.155731 -0.217847 0.459469
v -1.571341 0.110279 0.770709
v -1.063276 0.074521 -1.015607
v 1.231954 1.216866 -0.594471
v 0.770454 1.122192 -1.299703
v -0.065279 1.102928 1.796044
v -1.176430 1.281231 0.646380
v -0.476225 -0.274043 -0.037390
v 0.480423 -0.312115 -0.111060
v 0.172793 -0.188473 -0.532460
v -0.106274 -0.274351 0.595963
v -0.198010 1.360380 0.630818
v 0.062998 1.276304 -0.994314
v 0.611501 1.352344 -0.290780
v -0.603343 1.343584 -0.011276
v 1.267461 0.630730 1.008356
v 1.267107 0.600208 -0.689727
v 1.268899 0.241091 -0.063884
v 1.050912 1.068503 0.197512
v -1.043570 0.402928 1.289593
v 0.667029 0.439932 1.448684
v -0.135120 0.156677 1.505020
v -0.066870 0.652060 1.602193
v -1.759897 0.319614 -0.724614
v -1.646483 0.462612 0.459024
v -1.548443 -0.153801 -0.255587
v -1.483055 1.068517 0.045330
v -0.775458 0.497559 -1.402503
v 0.556317 0.449266 -1.496503
v 0.153226 0.839249 -1.832230
v -0.180515 0.060946 -1.233899
v -0.630920 -0.226328 0.592326
v -0.677921 1.329703 0.698183
v 1.115930 1.067893 0.980967
v -0.944509 0.743625 1.392342
v -1.719440 0.916506 -0.699776
v -0.751048 0.149059 -1.123006
v -0.359688 -0.219676 -0.596748
v 0.548058 -0.284113 -0.657622
v 0.383454 -0.298149 0.533170
v 0.342781 1.370886 0.863692
v 0.801564 1.333314 -0.716665
v -0.544178 1.290048 -0.889409
v 1.347667 0.189763 0.746821
v 1.323792 0.127379 -0.856060
v 1.423543 0.897206 -0.707035
v -0.706694 0.190636 1.346937
v 0.494274 0.153436 1.399456
v 0.524189 0.691410 1.410453
v -1.346437 -0.078697 -0.808084
v -1.550380 0.033513 0.487642
v -1.434319 1.017100 0.746778
v -0.263198 0.916780 -1.716774
v 0.802037 0.850318 -1.528586
v 0.512712 0.114694 -1.198383
# 102 vertices, 0 vertices normals


usemtl material_0
vt 0.000000 0.000000
f 2/1 1/1 3/1
f 2/1 3/1 4/1

usemtl material_1
vt 0.137636 0.563411
vt 0.058285 0.569867
vt 0.082613 0.506661
f 79/2 34/3 7/4
vt 0.152906 0.498683
f 79/2 7/4 48/5
vt 0.155028 0.344089
vt 0.206316 0.378186
vt 0.155630 0.402329
f 80/6 54/7 11/8
vt 0.099783 0.387655
f 80/6 11/8 41/9
vt 0.896175 0.282885
vt 0.854473 0.349296
vt 0.794976 0.248970
f 81/10 39/11 10/12
vt 0.870663 0.174892
f 81/10 10/12 35/13
vt 0.949240 0.587705
vt 0.944083 0.694636
vt 0.905653 0.682602
f 82/14 41/15 11/16
vt 0.916733 0.604517
f 82/14 11/16 37/17
vt 0.336809 0.082005
vt 0.369246 0.000842
vt 0.489191 0.000000
f 83/18 42/19 12/20
vt 0.460672 0.063535
f 83/18 12/20 38/21
vt 0.485748 0.254952
vt 0.512673 0.310590
vt 0.481603 0.323059
f 84/22 32/23 8/24
vt 0.447322 0.276247
f 84/22 8/24 50/25
vt 0.276846 0.583529
vt 0.215363 0.578539
vt 0.223692 0.502410
f 85/26 55/27 18/28
vt 0.270084 0.523882
f 85/26 18/28 36/29
vt 0.288525 0.695621
vt 0.226456 0.694739
vt 0.220811 0.635843
f 86/30 56/31 25/32
vt 0.266533 0.646047
f 86/30 25/32 57/33
vt 0.149628 0.688747
vt 0.060049 0.668982
vt 0.053708 0.620010
f 87/34 46/35 16/36
vt 0.140662 0.629249
f 87/34 16/36 58/37
vt 0.046020 0.277128
vt 0.115533 0.299946
vt 0.042023 0.402498
f 88/38 59/39 23/40
vt 0.011393 0.383384
f 88/38 23/40 53/41
vt 0.133867 0.094672
vt 0.226136 0.127633
vt 0.165692 0.199396
f 89/42 60/43 26/44
vt 0.116225 0.149680
f 89/42 26/44 61/45
vt 0.273683 0.187557
vt 0.335575 0.267841
vt 0.258354 0.321530
f 90/46 42/47 24/48
vt 0.206193 0.274302
f 90/46 24/48 62/49
vt 0.422948 0.654063
vt 0.520455 0.684734
vt 0.477461 0.726331
f 91/50 63/51 17/52
vt 0.404599 0.713241
f 91/50 17/52 47/53
vt 0.422729 0.459207
vt 0.529375 0.479105
vt 0.539575 0.580737
f 92/54 64/55 27/56
vt 0.439840 0.553878
f 92/54 27/56 65/57
vt 0.744126 0.814485
vt 0.672331 0.787452
vt 0.683844 0.711964
f 93/58 51/59 21/60
vt 0.731678 0.707183
f 93/58 21/60 66/61
vt 0.016271 0.536299
vt 0.006598 0.482318
vt 0.054401 0.402498
f 94/62 67/63 19/64
vt 0.090851 0.431859
f 94/62 19/64 49/65
vt 0.857058 0.070133
vt 0.855242 0.125920
vt 0.818683 0.137473
f 95/66 68/67 28/68
vt 0.786060 0.070157
f 95/66 28/68 69/69
vt 0.829103 0.182611
vt 0.720806 0.251159
vt 0.693981 0.268226
f 96/70 53/71 23/72
vt 0.758736 0.168010
f 96/70 23/72 70/73
vt 0.408067 0.318081
vt 0.348488 0.225548
vt 0.431026 0.176751
f 97/74 71/75 20/76
f 97/74 20/76 50/25
vt 0.834672 0.401576
vt 0.821728 0.494375
vt 0.758928 0.488146
f 98/77 72/78 29/79
vt 0.747834 0.361119
f 98/77 29/79 73/80
vt 0.853441 0.628842
vt 0.844101 0.700647
vt 0.766741 0.707183
f 99/81 54/82 24/83
vt 0.766456 0.640000
f 99/81 24/83 74/84
vt 0.554998 0.057463
vt 0.491069 0.166304
f 100/85 75/86 20/76
f 100/85 20/76 38/21
vt 0.661203 0.071636
vt 0.642437 0.169965
vt 0.565426 0.199969
f 101/87 76/88 30/89
vt 0.608937 0.072162
f 101/87 30/89 77/90
vt 0.628288 0.255903
vt 0.619708 0.321108
vt 0.560004 0.310321
f 102/91 44/92 14/93
vt 0.556413 0.271543
f 102/91 14/93 78/94
f 55/27 79/2 48/5
f 55/27 48/5 18/28
f 25/32 58/37 79/2
f 25/32 79/2 55/27
f 58/37 16/36 34/3
f 58/37 34/3 79/2
f 59/39 80/6 41/9
f 59/39 41/9 23/40
f 26/44 62/49 80/6
f 26/44 80/6 59/39
f 62/49 24/48 54/7
f 62/49 54/7 80/6
vt 0.934356 0.187628
f 63/95 81/10 35/13
vt 0.907061 0.133559
f 63/95 35/13 17/96
vt 0.622627 0.581780
vt 0.617335 0.678426
f 27/56 66/97 81/98
f 27/56 81/98 63/51
vt 0.662917 0.562066
vt 0.672331 0.661064
f 66/97 21/99 39/100
f 66/97 39/100 81/98
vt 0.939564 0.506329
f 67/101 82/14 37/17
vt 0.869574 0.490922
f 67/101 37/17 19/102
vt 0.791582 0.866218
vt 0.744126 0.821215
vt 0.752056 0.707183
f 28/103 70/104 82/105
vt 0.791426 0.711743
f 28/103 82/105 67/106
vt 1.000000 0.606532
vt 0.999879 0.706758
f 70/107 23/108 41/15
f 70/107 41/15 82/14
f 71/75 83/18 38/21
f 71/75 38/21 20/76
vt 0.672331 0.596657
f 29/79 74/84 83/109
vt 0.677773 0.459778
f 29/79 83/109 71/110
vt 0.674914 0.687648
f 74/84 24/83 42/111
f 74/84 42/111 83/109
f 75/86 84/22 50/25
f 75/86 50/25 20/76
f 30/89 78/94 84/22
f 30/89 84/22 75/86
vt 0.387737 0.801509
vt 0.336809 0.833560
vt 0.336920 0.785916
f 78/112 14/113 32/114
vt 0.384519 0.726331
f 78/112 32/114 84/115
vt 0.506205 0.350977
vt 0.448079 0.354288
f 32/23 85/116 36/117
f 32/23 36/117 8/24
vt 0.559475 0.342029
f 14/93 57/118 85/116
f 14/93 85/116 32/23
f 57/33 25/32 55/27
f 57/33 55/27 85/26
vt 0.609960 0.361119
f 44/92 86/119 57/118
f 44/92 57/118 14/93
vt 0.324683 0.722893
vt 0.278588 0.749240
f 5/120 43/121 86/30
vt 0.320949 0.673747
f 5/120 86/30 44/122
vt 0.218381 0.752553
f 43/121 13/123 56/31
f 43/121 56/31 86/30
f 56/31 87/34 58/37
f 56/31 58/37 25/32
vt 0.143231 0.752483
f 13/123 31/124 87/34
f 13/123 87/34 56/31
vt 0.069266 0.722735
f 31/124 6/125 46/35
f 31/124 46/35 87/34
vt 0.808347 0.361119
f 39/11 88/126 53/71
f 39/11 53/71 10/12
vt 0.056221 0.145884
f 21/127 61/45 88/38
vt 0.000000 0.241327
f 21/127 88/38 39/128
f 61/45 26/44 59/39
f 61/45 59/39 88/38
vt 0.085645 0.065345
f 51/129 89/42 61/45
f 51/129 61/45 21/127
vt 0.116277 0.014773
vt 0.187902 0.035191
f 9/130 52/131 89/42
f 9/130 89/42 51/129
vt 0.273048 0.064123
f 52/131 22/132 60/43
f 52/131 60/43 89/42
f 60/43 90/46 62/49
f 60/43 62/49 26/44
vt 0.316518 0.068429
f 22/132 40/133 90/46
f 22/132 90/46 60/43
vt 0.336809 0.140426
f 40/133 12/134 42/47
f 40/133 42/47 90/46
vt 0.340137 0.610197
f 31/135 91/50 47/53
vt 0.336809 0.674909
f 31/135 47/53 6/136
vt 0.339988 0.536299
f 13/137 65/57 91/50
f 13/137 91/50 31/135
f 65/57 27/56 63/51
f 65/57 63/51 91/50
vt 0.336833 0.476818
f 43/138 92/54 65/57
f 43/138 65/57 13/137
vt 0.353162 0.419686
vt 0.429528 0.400325
f 5/139 45/140 92/54
f 5/139 92/54 43/138
vt 0.517650 0.412671
f 45/140 15/141 64/55
f 45/140 64/55 92/54
vt 0.604166 0.482239
f 64/55 93/142 66/97
f 64/55 66/97 27/56
vt 0.586459 0.423461
f 15/141 33/143 93/142
f 15/141 93/142 64/55
vt 0.646477 0.441109
vt 0.670954 0.491413
f 33/143 9/144 51/145
f 33/143 51/145 93/142
f 34/3 94/62 49/65
f 34/3 49/65 7/4
vt 0.000000 0.608449
f 16/36 69/146 94/62
f 16/36 94/62 34/3
vt 0.694133 0.143704
f 69/69 28/68 67/147
vt 0.736508 0.092307
f 69/69 67/147 94/148
vt 0.012308 0.682984
f 46/35 95/149 69/146
f 46/35 69/146 16/36
vt 0.019832 0.742597
f 6/125 47/150 95/149
f 6/125 95/149 46/35
vt 0.913859 0.076969
f 47/151 17/96 68/67
f 47/151 68/67 95/66
f 68/67 96/70 70/73
f 68/67 70/73 28/68
f 17/96 35/13 96/70
f 17/96 96/70 68/67
f 35/13 10/12 53/71
f 35/13 53/71 96/70
f 36/117 97/74 50/25
f 36/117 50/25 8/24
vt 0.232244 0.440506
vt 0.291247 0.454530
f 18/28 73/152 97/153
f 18/28 97/153 36/29
f 73/80 29/79 71/110
vt 0.685316 0.388716
f 73/80 71/110 97/154
vt 0.130148 0.436240
f 48/5 98/155 73/152
f 48/5 73/152 18/28
f 7/4 49/65 98/155
f 7/4 98/155 48/5
vt 0.867108 0.417288
f 49/156 19/102 72/78
f 49/156 72/78 98/77
f 72/78 99/81 74/84
f 72/78 74/84 29/79
f 19/102 37/17 99/81
f 19/102 99/81 72/78
f 37/17 11/16 54/82
f 37/17 54/82 99/81
vt 0.563922 0.000091
f 40/157 100/85 38/21
f 40/157 38/21 12/20
vt 0.582099 0.007382
f 22/158 77/90 100/85
f 22/158 100/85 40/157
f 77/90 30/89 75/86
f 77/90 75/86 100/85
vt 0.207942 0.000000
vt 0.293309 0.025246
f 52/131 101/159 77/160
f 52/131 77/160 22/132
vt 0.579472 0.365264
f 9/144 33/143 101/161
vt 0.639569 0.392860
f 9/144 101/161 52/162
vt 0.477201 0.361119
f 33/143 15/141 76/163
f 33/143 76/163 101/161
f 76/88 102/91 78/94
f 76/88 78/94 30/89
vt 0.693981 0.150197
vt 0.693822 0.237100
f 15/164 45/165 102/91
f 15/164 102/91 76/88
vt 0.668575 0.311882
f 45/165 5/166 44/92
f 45/165 44/92 102/91
# 194 faces, 166 coords texture

# End of File