####
#
# OBJ File Generated by Meshlab
#
####
# Object sofa2.obj
#
# Vertices: 1010
# Faces: 2016
#
####
v 0.286762 -0.256844 -1.173157
v 0.282734 -0.256844 1.315457
v -0.792646 -0.256844 1.313716
v -0.788618 -0.256844 -1.174897
v 0.286762 0.256844 -1.173157
v 0.282734 0.256844 1.315457
v -0.792646 0.256844 1.313716
v -0.788618 0.256844 -1.174897
v 0.286560 0.256844 -1.048726
v 0.286560 -0.256844 -1.048726
v -0.788820 0.256844 -1.050467
v -0.788820 -0.256844 -1.050467
v -0.486437 -0.256844 -1.049977
v -0.486437 0.256844 -1.049977
v -0.490073 -0.256844 1.195996
v -0.490073 0.256844 1.195996
v -0.490264 0.256844 1.314205
v -0.490264 -0.256844 1.314205
v -0.486236 0.256844 -1.174408
v -0.486236 -0.256844 -1.174408
v -0.792455 0.256844 1.195507
v 0.282925 -0.256844 1.197248
v -0.792455 -0.256844 1.195507
v 0.282925 0.256844 1.197248
v -0.486437 0.344797 -1.049977
v -0.788820 0.344797 -1.050467
v -0.792455 0.344797 1.195507
v -0.490073 0.344797 1.195996
v -0.792455 0.778534 1.195507
v -0.490073 0.778534 1.195996
v -0.486437 0.778534 -1.049977
v -0.788820 0.778534 -1.050467
v 0.286762 0.377049 -1.173157
v 0.282734 0.377049 1.315457
v -0.792646 0.377049 1.313716
v -0.788618 0.377049 -1.174897
v 0.286560 0.377049 -1.048726
v -0.788820 0.377049 -1.050467
v -0.486437 0.377049 -1.049977
v -0.490073 0.377049 1.195996
v -0.490264 0.377049 1.314205
v -0.486236 0.377049 -1.174408
v -0.792455 0.377049 1.195507
v 0.282925 0.377049 1.197248
v 0.282798 0.085615 1.276054
v 0.282861 -0.085615 1.236651
v -0.691852 0.085615 1.313879
v -0.591058 -0.085615 1.314042
v -0.788685 0.085615 -1.133420
v -0.788753 -0.085615 -1.091944
v 0.029096 0.085615 -1.173574
v -0.228570 -0.085615 -1.173991
v -0.590994 -0.256844 1.274639
v -0.691725 -0.256844 1.235073
v -0.792582 0.296912 1.274313
v -0.792519 0.336981 1.234910
v 0.286627 0.085615 -1.090203
v 0.286695 -0.085615 -1.131680
v -0.790032 0.085615 -0.301809
v -0.791243 -0.085615 0.446849
v -0.587164 -0.256844 -1.091617
v -0.687891 -0.256844 -1.133257
v 0.025068 0.296912 1.315040
v -0.232598 0.336981 1.314622
v -0.231195 0.256844 0.447756
v 0.027683 0.256844 -0.300485
v -0.587030 0.085615 -1.174571
v -0.687824 -0.085615 -1.174734
v -0.232598 0.085615 1.314622
v 0.025068 -0.085615 1.315040
v -0.589655 -0.256844 0.447175
v -0.689237 -0.256844 -0.301646
v 0.026471 -0.256844 0.448173
v -0.229983 -0.256844 -0.300902
v -0.792519 0.085615 1.234910
v -0.792582 -0.085615 1.274313
v 0.028962 -0.256844 -1.090620
v -0.228637 -0.256844 -1.132514
v 0.284137 0.085615 0.448590
v 0.285348 -0.085615 -0.300068
v 0.028894 0.296912 -1.049143
v -0.228771 0.336981 -1.049560
v -0.587231 0.296912 -1.050140
v -0.688026 0.336981 -1.050304
v 0.025132 -0.256844 1.275637
v -0.232471 -0.256844 1.235816
v -0.791243 0.489376 0.446849
v -0.790032 0.633955 -0.301809
v -0.590867 0.286162 1.195833
v -0.691661 0.315479 1.195670
v -0.791243 0.286162 0.446849
v -0.790032 0.315479 -0.301809
v -0.590867 0.489376 1.195833
v -0.691661 0.633955 1.195670
v -0.487649 0.286162 -0.301319
v -0.488861 0.315479 0.447338
v -0.487649 0.489376 -0.301319
v -0.488861 0.633955 0.447338
v -0.690449 0.778534 0.447012
v -0.588443 0.778534 -0.301483
v -0.688026 0.286162 -1.050304
v -0.587231 0.315479 -1.050140
v -0.688026 0.489376 -1.050304
v -0.587231 0.633955 -1.050140
v -0.232534 0.377049 1.275219
v 0.025195 0.377049 1.236234
v -0.228704 0.377049 -1.091037
v 0.029029 0.377049 -1.132097
v -0.687958 0.377049 -1.091780
v -0.587097 0.377049 -1.133094
v -0.691788 0.377049 1.274476
v -0.590931 0.377049 1.235236
v -0.691661 0.296912 1.195670
v -0.590867 0.336981 1.195833
v -0.591058 0.296912 1.314042
v -0.691852 0.336981 1.313879
v -0.228570 0.296912 -1.173991
v 0.029096 0.336981 -1.173574
v 0.282861 0.296912 1.236651
v 0.282798 0.336981 1.276054
v -0.687824 0.296912 -1.174734
v -0.587030 0.336981 -1.174571
v 0.286695 0.296912 -1.131680
v 0.286627 0.336981 -1.090203
v -0.788753 0.296912 -1.091944
v -0.788685 0.336981 -1.133420
v -0.232407 0.296912 1.196413
v 0.025259 0.336981 1.196831
v 0.282734 0.000000 1.315457
v 0.282830 -0.256844 1.256352
v -0.792646 0.000000 1.313716
v -0.641455 -0.256844 1.313961
v -0.788618 0.000000 -1.174897
v -0.788719 -0.256844 -1.112682
v 0.286762 0.000000 -1.173157
v -0.099737 -0.256844 -1.173782
v -0.792551 -0.256844 1.254611
v -0.792646 0.316947 1.313716
v -0.792551 0.377049 1.254611
v 0.286560 0.000000 -1.048726
v 0.286661 -0.256844 -1.110941
v -0.788820 0.000000 -1.050467
v -0.790637 -0.256844 0.072520
v -0.637628 -0.256844 -1.050222
v 0.282734 0.316947 1.315457
v -0.103765 0.377049 1.314831
v -0.103574 0.256844 1.196622
v 0.284743 0.256844 0.074261
v -0.486236 0.000000 -1.174408
v -0.637427 -0.256844 -1.174652
v -0.490264 0.000000 1.314205
v -0.103765 -0.256844 1.314831
v -0.641264 -0.256844 1.195752
v -0.103574 -0.256844 1.196622
v -0.488255 -0.256844 0.073010
v -0.792455 0.000000 1.195507
v -0.099938 -0.256844 -1.049351
v -0.486336 -0.256844 -1.112192
v 0.282925 0.000000 1.197248
v 0.284743 -0.256844 0.074261
v 0.286560 0.316947 -1.048726
v -0.099938 0.377049 -1.049351
v -0.486437 0.316947 -1.049977
v -0.637628 0.377049 -1.050222
v -0.490169 -0.256844 1.255100
v -0.792455 0.561665 1.195507
v -0.790637 0.778534 0.072520
v -0.490073 0.300820 1.195996
v -0.641264 0.344797 1.195752
v -0.792455 0.300820 1.195507
v -0.790637 0.344797 0.072520
v -0.490073 0.561665 1.195996
v -0.641264 0.778534 1.195752
v -0.486437 0.300820 -1.049977
v -0.488255 0.344797 0.073010
v -0.486437 0.561665 -1.049977
v -0.488255 0.778534 0.073010
v -0.788820 0.300820 -1.050467
v -0.637628 0.344797 -1.050222
v -0.788820 0.561665 -1.050467
v -0.637628 0.778534 -1.050222
v 0.282830 0.377049 1.256352
v 0.286661 0.377049 -1.110941
v -0.486336 0.377049 -1.112192
v -0.641455 0.377049 1.313961
v -0.490169 0.377049 1.255100
v -0.792455 0.316947 1.195507
v -0.641264 0.377049 1.195752
v -0.490264 0.316947 1.314205
v -0.486236 0.316947 -1.174408
v -0.099737 0.377049 -1.173782
v 0.282925 0.316947 1.197248
v -0.788618 0.316947 -1.174897
v -0.637427 0.377049 -1.174652
v 0.286762 0.316947 -1.173157
v -0.788820 0.316947 -1.050467
v -0.788719 0.377049 -1.112682
v -0.490073 0.316947 1.195996
v -0.103574 0.377049 1.196622
v 0.282830 0.000000 1.256352
v 0.282830 0.256844 1.256352
v -0.641455 0.000000 1.313961
v -0.641455 0.256844 1.313961
v -0.788719 0.000000 -1.112682
v -0.788719 0.256844 -1.112682
v -0.099737 0.000000 -1.173782
v -0.099737 0.256844 -1.173782
v -0.641360 -0.256844 1.254856
v -0.792551 0.316947 1.254611
v -0.792551 0.256844 1.254611
v 0.286661 0.000000 -1.110941
v 0.286661 0.256844 -1.110941
v -0.790637 0.000000 0.072520
v -0.790637 0.256844 0.072520
v -0.637528 -0.256844 -1.112437
v -0.103765 0.316947 1.314831
v -0.103765 0.256844 1.314831
v -0.101756 0.256844 0.073636
v -0.488255 0.256844 0.073010
v -0.099938 0.256844 -1.049351
v -0.637427 0.000000 -1.174652
v -0.637427 0.256844 -1.174652
v -0.103765 0.000000 1.314831
v -0.639446 -0.256844 0.072765
v -0.101756 -0.256844 0.073635
v -0.792551 0.000000 1.254611
v -0.099837 -0.256844 -1.111567
v 0.284743 0.000000 0.074261
v -0.099938 0.316947 -1.049351
v -0.637628 0.316947 -1.050222
v -0.637628 0.256844 -1.050222
v -0.103669 -0.256844 1.255727
v -0.790637 0.561665 0.072520
v -0.641264 0.300820 1.195752
v -0.641264 0.256844 1.195752
v -0.790637 0.300820 0.072520
v -0.641264 0.561665 1.195752
v -0.488255 0.300820 0.073010
v -0.488255 0.561665 0.073010
v -0.639446 0.778534 0.072765
v -0.637628 0.300820 -1.050222
v -0.637628 0.561665 -1.050222
v -0.103669 0.377049 1.255727
v -0.099838 0.377049 -1.111567
v -0.637528 0.377049 -1.112437
v -0.641360 0.377049 1.254856
v -0.641264 0.316947 1.195752
v -0.641455 0.316947 1.313961
v -0.099737 0.316947 -1.173782
v 0.282830 0.316947 1.256352
v -0.637427 0.316947 -1.174652
v 0.286661 0.316947 -1.110941
v -0.788719 0.316947 -1.112682
v -0.103574 0.316947 1.196622
v 0.282766 -0.085615 1.295755
v 0.282893 -0.171229 1.216949
v -0.742249 -0.085615 1.313797
v -0.540661 -0.171229 1.314124
v -0.788652 -0.085615 -1.154159
v -0.788786 -0.171229 -1.071205
v 0.157929 -0.085615 -1.173365
v -0.357403 -0.171229 -1.174199
v -0.691820 -0.256844 1.294178
v -0.742090 -0.256844 1.215290
v -0.792614 0.336981 1.294014
v -0.792487 0.357015 1.215209
v 0.286594 -0.085615 -1.069464
v 0.286728 -0.171229 -1.152418
v -0.789426 -0.085615 -0.676138
v -0.791849 -0.171229 0.821178
v -0.687992 -0.256844 -1.071042
v -0.738255 -0.256844 -1.154077
v 0.153901 0.336981 1.315248
v -0.361431 0.357015 1.314414
v 0.025865 0.256844 0.822502
v 0.157121 0.256844 -0.674605
v -0.536633 -0.085615 -1.174489
v -0.738221 -0.171229 -1.174815
v -0.361431 -0.085615 1.314414
v 0.153901 -0.171229 1.315248
v -0.691055 -0.256844 0.821341
v -0.739029 -0.256844 -0.676056
v -0.231801 -0.256844 0.822084
v -0.358210 -0.256844 -0.675440
v -0.792487 -0.085615 1.215209
v -0.792614 -0.171229 1.294014
v -0.228738 -0.256844 -1.070298
v -0.357437 -0.256844 -1.153461
v 0.283531 -0.085615 0.822919
v 0.285954 -0.171229 -0.674397
v 0.157727 0.336981 -1.048934
v -0.357604 0.357015 -1.049768
v -0.536834 0.336981 -1.050059
v -0.738423 0.357015 -1.050385
v -0.232566 -0.256844 1.294921
v -0.361272 -0.256844 1.215906
v -0.791849 0.633955 0.821178
v -0.789426 0.706244 -0.676138
v -0.540470 0.315479 1.195915
v -0.742058 0.330138 1.195589
v -0.791849 0.315479 0.821178
v -0.789426 0.330138 -0.676138
v -0.540470 0.633955 1.195915
v -0.742058 0.706244 1.195589
v -0.487043 0.315479 -0.675648
v -0.489467 0.330138 0.821667
v -0.487043 0.633955 -0.675648
v -0.489467 0.706244 0.821667
v -0.590261 0.778534 0.821504
v -0.537440 0.778534 -0.675730
v -0.738423 0.315479 -1.050385
v -0.536834 0.330138 -1.050059
v -0.738423 0.633955 -1.050385
v -0.536834 0.706244 -1.050059
v 0.025100 0.377049 1.295338
v 0.154060 0.377049 1.216741
v 0.028928 0.377049 -1.069881
v 0.157895 0.377049 -1.152627
v -0.587198 0.377049 -1.070879
v -0.536667 0.377049 -1.153751
v -0.591026 0.377049 1.294341
v -0.540502 0.377049 1.215616
v -0.742058 0.336981 1.195589
v -0.540470 0.357015 1.195915
v -0.540661 0.336981 1.314124
v -0.742249 0.357015 1.313797
v -0.357403 0.336981 -1.174199
v 0.157929 0.357015 -1.173365
v 0.282893 0.336981 1.216949
v 0.282766 0.357015 1.295755
v -0.738221 0.336981 -1.174815
v -0.536633 0.357015 -1.174489
v 0.286728 0.336981 -1.152418
v 0.286594 0.357015 -1.069464
v -0.788786 0.336981 -1.071205
v -0.788652 0.357015 -1.154159
v -0.361240 0.336981 1.196205
v 0.154092 0.357015 1.197039
v 0.282861 0.171229 1.236651
v 0.282766 0.171229 1.295755
v 0.282893 0.085615 1.216949
v 0.282798 -0.171229 1.276054
v -0.591058 0.171229 1.314042
v -0.742249 0.171229 1.313797
v -0.540661 0.085615 1.314124
v -0.691852 -0.171229 1.313879
v -0.788753 0.171229 -1.091944
v -0.788652 0.171229 -1.154159
v -0.788786 0.085615 -1.071205
v -0.788685 -0.171229 -1.133420
v -0.228570 0.171229 -1.173991
v 0.157929 0.171229 -1.173365
v -0.357403 0.085615 -1.174199
v 0.029096 -0.171229 -1.173574
v -0.540534 -0.256844 1.235317
v -0.540629 -0.256844 1.294422
v -0.590899 -0.256844 1.215535
v -0.742185 -0.256844 1.274395
v -0.792519 0.276878 1.234910
v -0.792614 0.276878 1.294014
v -0.792487 0.296912 1.215209
v -0.792582 0.357015 1.274313
v 0.286695 0.171229 -1.131680
v 0.286594 0.171229 -1.069464
v 0.286728 0.085615 -1.152418
v 0.286627 -0.171229 -1.090203
v -0.791243 0.171229 0.446849
v -0.789426 0.171229 -0.676138
v -0.791849 0.085615 0.821178
v -0.790032 -0.171229 -0.301809
v -0.536700 -0.256844 -1.133013
v -0.536801 -0.256844 -1.070797
v -0.587064 -0.256844 -1.153833
v -0.738356 -0.256844 -1.091862
v -0.232598 0.276878 1.314622
v 0.153901 0.276878 1.315248
v -0.361431 0.296912 1.314414
v 0.025068 0.357015 1.315040
v -0.358816 0.256844 -0.301111
v -0.360634 0.256844 0.821876
v -0.229377 0.256844 -0.675231
v 0.155304 0.256844 0.448381
v -0.687824 0.171229 -1.174734
v -0.536633 0.171229 -1.174489
v -0.738221 0.085615 -1.174815
v -0.587030 -0.171229 -1.174571
v 0.025068 0.171229 1.315040
v -0.361431 0.171229 1.314414
v 0.153901 0.085615 1.315248
v -0.232598 -0.171229 1.314622
v -0.538046 -0.256844 -0.301401
v -0.539864 -0.256844 0.821586
v -0.587837 -0.256844 -0.675811
v -0.740846 -0.256844 0.446931
v 0.156515 -0.256844 -0.300277
v 0.154698 -0.256844 0.822710
v 0.028288 -0.256844 -0.674814
v -0.360028 -0.256844 0.447547
v -0.792582 0.171229 1.274313
v -0.792487 0.171229 1.215209
v -0.792614 0.085615 1.294014
v -0.792519 -0.171229 1.234910
v 0.157862 -0.256844 -1.131888
v 0.157761 -0.256844 -1.069673
v 0.029063 -0.256844 -1.152835
v -0.357537 -0.256844 -1.091245
v 0.285348 0.171229 -0.300068
v 0.283531 0.171229 0.822919
v 0.285954 0.085615 -0.674397
v 0.284137 -0.171229 0.448590
v -0.228771 0.276878 -1.049560
v 0.157727 0.276878 -1.048934
v -0.357604 0.296912 -1.049768
v 0.028894 0.357015 -1.049143
v -0.688026 0.276878 -1.050304
v -0.536834 0.276878 -1.050059
v -0.738423 0.296912 -1.050385
v -0.587231 0.357015 -1.050140
v 0.154028 -0.256844 1.236442
v 0.153933 -0.256844 1.295547
v 0.025227 -0.256844 1.216532
v -0.361367 -0.256844 1.275011
v -0.790032 0.417086 -0.301809
v -0.791849 0.417086 0.821178
v -0.789426 0.489376 -0.676138
v -0.791243 0.706244 0.446849
v -0.691661 0.271503 1.195670
v -0.540470 0.271503 1.195915
v -0.742058 0.286162 1.195589
v -0.590867 0.330138 1.195833
v -0.790032 0.271503 -0.301809
v -0.791849 0.271503 0.821178
v -0.789426 0.286162 -0.676138
v -0.791243 0.330138 0.446849
v -0.691661 0.417086 1.195670
v -0.540470 0.417086 1.195915
v -0.742058 0.489376 1.195589
v -0.590867 0.706244 1.195833
v -0.488861 0.271503 0.447338
v -0.487043 0.271503 -0.675648
v -0.489467 0.286162 0.821667
v -0.487649 0.330138 -0.301319
v -0.488861 0.417086 0.447338
v -0.487043 0.417086 -0.675648
v -0.489467 0.489376 0.821667
v -0.487649 0.706244 -0.301319
v -0.739635 0.778534 -0.301727
v -0.741452 0.778534 0.821260
v -0.688632 0.778534 -0.675975
v -0.539258 0.778534 0.447257
v -0.587231 0.271503 -1.050140
v -0.738423 0.271503 -1.050385
v -0.536834 0.286162 -1.050059
v -0.688026 0.330138 -1.050304
v -0.587231 0.417086 -1.050140
v -0.738423 0.417086 -1.050385
v -0.536834 0.489376 -1.050059
v -0.688026 0.706244 -1.050304
v -0.361304 0.377049 1.235608
v -0.361399 0.377049 1.294712
v -0.232439 0.377049 1.216115
v 0.153965 0.377049 1.275845
v -0.357470 0.377049 -1.132722
v -0.357571 0.377049 -1.070507
v -0.228604 0.377049 -1.153252
v 0.157794 0.377049 -1.090411
v -0.738288 0.377049 -1.133339
v -0.738389 0.377049 -1.071124
v -0.687858 0.377049 -1.153996
v -0.536767 0.377049 -1.091535
v -0.742122 0.377049 1.234992
v -0.742217 0.377049 1.294096
v -0.691693 0.377049 1.215372
v -0.540597 0.377049 1.274721
v -0.590867 0.276878 1.195833
v -0.742058 0.276878 1.195589
v -0.540470 0.296912 1.195915
v -0.691661 0.357015 1.195670
v -0.691852 0.276878 1.313879
v -0.540661 0.276878 1.314124
v -0.742249 0.296912 1.313797
v -0.591058 0.357015 1.314042
v 0.029096 0.276878 -1.173574
v -0.357403 0.276878 -1.174199
v 0.157929 0.296912 -1.173365
v -0.228570 0.357015 -1.173991
v 0.282798 0.276878 1.276054
v 0.282893 0.276878 1.216949
v 0.282766 0.296912 1.295755
v 0.282861 0.357015 1.236651
v -0.587030 0.276878 -1.174571
v -0.738221 0.276878 -1.174815
v -0.536633 0.296912 -1.174489
v -0.687824 0.357015 -1.174734
v 0.286627 0.276878 -1.090203
v 0.286728 0.276878 -1.152418
v 0.286594 0.296912 -1.069464
v 0.286695 0.357015 -1.131680
v -0.788685 0.276878 -1.133420
v -0.788786 0.276878 -1.071205
v -0.788652 0.296912 -1.154159
v -0.788753 0.357015 -1.091944
v 0.025259 0.276878 1.196831
v -0.361240 0.276878 1.196205
v 0.154092 0.296912 1.197039
v -0.232407 0.357015 1.196413
v 0.282766 0.042807 1.295755
v 0.282845 -0.171229 1.246502
v -0.742249 0.042807 1.313797
v -0.616256 -0.171229 1.314001
v -0.788652 0.042807 -1.154159
v -0.788736 -0.171229 -1.102313
v 0.157929 0.042807 -1.173365
v -0.164154 -0.171229 -1.173887
v -0.616225 -0.256844 1.294300
v -0.742138 -0.256844 1.244842
v -0.792614 0.306929 1.294014
v -0.792535 0.357015 1.244761
v 0.286594 0.042807 -1.069464
v 0.286678 -0.171229 -1.121311
v -0.789426 0.042807 -0.676138
v -0.790940 -0.171229 0.259685
v -0.612396 -0.256844 -1.070920
v -0.738305 -0.256844 -1.122970
v 0.153901 0.306929 1.315248
v -0.168181 0.357015 1.314727
v -0.167384 0.256844 0.822189
v 0.156213 0.256844 -0.113112
v -0.536633 0.042807 -1.174489
v -0.662626 -0.171229 -1.174693
v -0.361431 0.042807 1.314414
v -0.039348 -0.171229 1.314935
v -0.615460 -0.256844 0.821463
v -0.739937 -0.256844 -0.114563
v -0.038552 -0.256844 0.822397
v -0.359119 -0.256844 -0.113946
v -0.792487 0.042807 1.215209
v -0.792566 -0.171229 1.264462
v -0.035488 -0.256844 -1.069986
v -0.357487 -0.256844 -1.122353
v 0.283531 0.042807 0.822919
v 0.285045 -0.171229 -0.112903
v 0.157727 0.306929 -1.048934
v -0.164355 0.357015 -1.049456
v -0.536834 0.306929 -1.050059
v -0.662827 0.357015 -1.050263
v -0.039317 -0.256844 1.295234
v -0.361320 -0.256844 1.245458
v -0.791849 0.525521 0.821178
v -0.790335 0.706244 -0.114644
v -0.540470 0.293491 1.195915
v -0.666463 0.330138 1.195711
v -0.791849 0.293491 0.821178
v -0.790335 0.330138 -0.114644
v -0.540470 0.525521 1.195915
v -0.666463 0.706244 1.195711
v -0.487043 0.293491 -0.675648
v -0.488558 0.330138 0.260174
v -0.487043 0.525521 -0.675648
v -0.488558 0.706244 0.260174
v -0.665857 0.778534 0.821382
v -0.538349 0.778534 -0.114237
v -0.738423 0.293491 -1.050385
v -0.612430 0.330138 -1.050181
v -0.738423 0.525521 -1.050385
v -0.612430 0.706244 -1.050181
v -0.168150 0.377049 1.295025
v 0.154012 0.377049 1.246293
v -0.164321 0.377049 -1.070194
v 0.157845 0.377049 -1.121519
v -0.662793 0.377049 -1.071001
v -0.536717 0.377049 -1.122643
v -0.666622 0.377049 1.294218
v -0.540550 0.377049 1.245168
v -0.742058 0.306929 1.195589
v -0.616066 0.357015 1.195792
v -0.540661 0.306929 1.314124
v -0.666654 0.357015 1.313920
v -0.357403 0.306929 -1.174199
v -0.035321 0.357015 -1.173678
v 0.282893 0.306929 1.216949
v 0.282814 0.357015 1.266203
v -0.738221 0.306929 -1.174815
v -0.612229 0.357015 -1.174612
v 0.286728 0.306929 -1.152418
v 0.286644 0.357015 -1.100572
v -0.788786 0.306929 -1.071205
v -0.788702 0.357015 -1.123051
v -0.361240 0.306929 1.196205
v -0.039157 0.357015 1.196726
v 0.282814 0.042807 1.266203
v 0.282814 0.171229 1.266203
v 0.282893 -0.042807 1.216949
v 0.282845 -0.042807 1.246502
v -0.666654 0.042807 1.313920
v -0.666654 0.171229 1.313920
v -0.540661 -0.042807 1.314124
v -0.616256 -0.042807 1.314001
v -0.788702 0.042807 -1.123051
v -0.788702 0.171229 -1.123051
v -0.788786 -0.042807 -1.071205
v -0.788736 -0.042807 -1.102313
v -0.035321 0.042807 -1.173678
v -0.035321 0.171229 -1.173678
v -0.357403 -0.042807 -1.174199
v -0.164154 -0.042807 -1.173887
v -0.616177 -0.256844 1.264748
v -0.540581 -0.256844 1.264870
v -0.666494 -0.256844 1.215412
v -0.666542 -0.256844 1.244965
v -0.792566 0.306929 1.264462
v -0.792566 0.276878 1.264462
v -0.792487 0.326964 1.215209
v -0.792535 0.326964 1.244761
v 0.286644 0.042807 -1.100572
v 0.286644 0.171229 -1.100572
v 0.286728 -0.042807 -1.152418
v 0.286678 -0.042807 -1.121311
v -0.790335 0.042807 -0.114644
v -0.790335 0.171229 -0.114644
v -0.791849 -0.042807 0.821178
v -0.790940 -0.042807 0.259685
v -0.612346 -0.256844 -1.102027
v -0.536750 -0.256844 -1.101905
v -0.662659 -0.256844 -1.153955
v -0.662710 -0.256844 -1.122847
v -0.039348 0.306929 1.314935
v -0.039348 0.276878 1.314935
v -0.361431 0.326964 1.314414
v -0.168181 0.326964 1.314727
v -0.166475 0.256844 0.260696
v -0.359725 0.256844 0.260383
v -0.036128 0.256844 -0.674918
v -0.037037 0.256844 -0.113425
v -0.612229 0.042807 -1.174612
v -0.612229 0.171229 -1.174612
v -0.738221 -0.042807 -1.174815
v -0.662626 -0.042807 -1.174693
v -0.168181 0.042807 1.314727
v -0.168181 0.171229 1.314727
v 0.153901 -0.042807 1.315248
v -0.039348 -0.042807 1.314935
v -0.614550 -0.256844 0.259970
v -0.538955 -0.256844 0.260092
v -0.663433 -0.256844 -0.675934
v -0.664342 -0.256844 -0.114440
v -0.037643 -0.256844 0.260904
v 0.155607 -0.256844 0.261217
v -0.164961 -0.256844 -0.675127
v -0.165870 -0.256844 -0.113634
v -0.792535 0.042807 1.244761
v -0.792535 0.171229 1.244761
v -0.792614 -0.042807 1.294014
v -0.792566 -0.042807 1.264462
v -0.035438 -0.256844 -1.101094
v 0.157811 -0.256844 -1.100781
v -0.164187 -0.256844 -1.153148
v -0.164237 -0.256844 -1.122041
v 0.284440 0.042807 0.261425
v 0.284440 0.171229 0.261425
v 0.285954 -0.042807 -0.674397
v 0.285045 -0.042807 -0.112903
v -0.035522 0.306929 -1.049247
v -0.035522 0.276878 -1.049247
v -0.357604 0.326964 -1.049768
v -0.164355 0.326964 -1.049456
v -0.612430 0.306929 -1.050181
v -0.612430 0.276878 -1.050181
v -0.738423 0.326964 -1.050385
v -0.662827 0.326964 -1.050263
v -0.039269 -0.256844 1.265682
v 0.153981 -0.256844 1.265995
v -0.168022 -0.256844 1.216219
v -0.168070 -0.256844 1.245771
v -0.790940 0.525521 0.259685
v -0.790940 0.417086 0.259685
v -0.789426 0.597810 -0.676138
v -0.790335 0.597810 -0.114644
v -0.616066 0.293491 1.195792
v -0.616066 0.271503 1.195792
v -0.742058 0.308150 1.195589
v -0.666463 0.308150 1.195711
v -0.790940 0.293491 0.259685
v -0.790940 0.271503 0.259685
v -0.789426 0.308150 -0.676138
v -0.790335 0.308150 -0.114644
v -0.616066 0.525521 1.195792
v -0.616066 0.417086 1.195792
v -0.742058 0.597810 1.195589
v -0.666463 0.597810 1.195711
v -0.487952 0.293491 -0.114155
v -0.487952 0.271503 -0.114155
v -0.489467 0.308150 0.821667
v -0.488558 0.308150 0.260174
v -0.487952 0.525521 -0.114155
v -0.487952 0.417086 -0.114155
v -0.489467 0.597810 0.821667
v -0.488558 0.597810 0.260174
v -0.664948 0.778534 0.259888
v -0.740543 0.778534 0.259766
v -0.613036 0.778534 -0.675852
v -0.613945 0.778534 -0.114359
v -0.662827 0.293491 -1.050263
v -0.662827 0.271503 -1.050263
v -0.536834 0.308150 -1.050059
v -0.612430 0.308150 -1.050181
v -0.662827 0.525521 -1.050263
v -0.662827 0.417086 -1.050263
v -0.536834 0.597810 -1.050059
v -0.612430 0.597810 -1.050181
v -0.168102 0.377049 1.265473
v -0.361351 0.377049 1.265160
v -0.039189 0.377049 1.216428
v -0.039237 0.377049 1.245980
v -0.164271 0.377049 -1.101302
v -0.357520 0.377049 -1.101615
v -0.035354 0.377049 -1.152940
v -0.035405 0.377049 -1.121832
v -0.662743 0.377049 -1.102109
v -0.738339 0.377049 -1.102231
v -0.612262 0.377049 -1.153873
v -0.612312 0.377049 -1.122766
v -0.666574 0.377049 1.264666
v -0.742169 0.377049 1.264544
v -0.616097 0.377049 1.215494
v -0.616145 0.377049 1.245046
v -0.666463 0.306929 1.195711
v -0.666463 0.276878 1.195711
v -0.540470 0.326964 1.195915
v -0.616066 0.326964 1.195792
v -0.616256 0.306929 1.314001
v -0.616256 0.276878 1.314001
v -0.742249 0.326964 1.313797
v -0.666654 0.326964 1.313920
v -0.164154 0.306929 -1.173887
v -0.164154 0.276878 -1.173887
v 0.157929 0.326964 -1.173365
v -0.035321 0.326964 -1.173678
v 0.282845 0.306929 1.246502
v 0.282845 0.276878 1.246502
v 0.282766 0.326964 1.295755
v 0.282814 0.326964 1.266203
v -0.662626 0.306929 -1.174693
v -0.662626 0.276878 -1.174693
v -0.536633 0.326964 -1.174489
v -0.612229 0.326964 -1.174612
v 0.286678 0.306929 -1.121311
v 0.286678 0.276878 -1.121311
v 0.286594 0.326964 -1.069464
v 0.286644 0.326964 -1.100572
v -0.788736 0.306929 -1.102313
v -0.788736 0.276878 -1.102313
v -0.788652 0.326964 -1.154159
v -0.788702 0.326964 -1.123051
v -0.167990 0.306929 1.196518
v -0.167990 0.276878 1.196518
v 0.154092 0.326964 1.197039
v -0.039157 0.326964 1.196726
v 0.282734 0.128422 1.315457
v 0.282734 -0.128422 1.315457
v 0.282782 -0.256844 1.285905
v 0.282877 -0.256844 1.226800
v -0.792646 0.128422 1.313716
v -0.792646 -0.128422 1.313716
v -0.717050 -0.256844 1.313838
v -0.565859 -0.256844 1.314083
v -0.788618 0.128422 -1.174897
v -0.788618 -0.128422 -1.174897
v -0.788669 -0.256844 -1.143790
v -0.788770 -0.256844 -1.081574
v 0.286762 0.128422 -1.173157
v 0.286762 -0.128422 -1.173157
v 0.093512 -0.256844 -1.173470
v -0.292987 -0.256844 -1.174095
v -0.792598 -0.256844 1.284164
v -0.792503 -0.256844 1.225059
v -0.792646 0.286895 1.313716
v -0.792646 0.346998 1.313716
v -0.792598 0.377049 1.284164
v -0.792503 0.377049 1.225059
v 0.286560 0.128422 -1.048726
v 0.286560 -0.128422 -1.048726
v 0.286610 -0.256844 -1.079834
v 0.286712 -0.256844 -1.142049
v -0.788820 0.128422 -1.050467
v -0.788820 -0.128422 -1.050467
v -0.789729 -0.256844 -0.488973
v -0.791546 -0.256844 0.634014
v -0.562033 -0.256844 -1.050099
v -0.713224 -0.256844 -1.050344
v 0.282734 0.286895 1.315457
v 0.282734 0.346998 1.315457
v 0.089485 0.377049 1.315144
v -0.297015 0.377049 1.314518
v -0.296824 0.256844 1.196309
v 0.089676 0.256844 1.196935
v 0.283834 0.256844 0.635754
v 0.285651 0.256844 -0.487232
v -0.486236 0.128422 -1.174408
v -0.486236 -0.128422 -1.174408
v -0.561832 -0.256844 -1.174530
v -0.713023 -0.256844 -1.174775
v -0.490264 0.128422 1.314205
v -0.490264 -0.128422 1.314205
v -0.297015 -0.256844 1.314518
v 0.089485 -0.256844 1.315144
v -0.565669 -0.256844 1.195874
v -0.716860 -0.256844 1.195629
v 0.089676 -0.256844 1.196935
v -0.296824 -0.256844 1.196309
v -0.489164 -0.256844 0.634503
v -0.487346 -0.256844 -0.488484
v -0.792455 0.128422 1.195507
v -0.792455 -0.128422 1.195507
v 0.093311 -0.256844 -1.049039
v -0.293188 -0.256844 -1.049664
v -0.486387 -0.256844 -1.081085
v -0.486286 -0.256844 -1.143300
v 0.282925 0.128422 1.197248
v 0.282925 -0.128422 1.197248
v 0.283834 -0.256844 0.635754
v 0.285651 -0.256844 -0.487232
v 0.286560 0.286895 -1.048726
v 0.286560 0.346998 -1.048726
v 0.093311 0.377049 -1.049039
v -0.293188 0.377049 -1.049664
v -0.486437 0.286895 -1.049977
v -0.486437 0.346998 -1.049977
v -0.562033 0.377049 -1.050099
v -0.713224 0.377049 -1.050344
v -0.490216 -0.256844 1.284653
v -0.490121 -0.256844 1.225548
v -0.792455 0.453231 1.195507
v -0.792455 0.670100 1.195507
v -0.791546 0.778534 0.634014
v -0.789729 0.778534 -0.488973
v -0.490073 0.278832 1.195996
v -0.490073 0.322809 1.195996
v -0.565669 0.344797 1.195874
v -0.716860 0.344797 1.195629
v -0.792455 0.278832 1.195507
v -0.792455 0.322809 1.195507
v -0.791546 0.344797 0.634014
v -0.789729 0.344797 -0.488973
v -0.490073 0.453231 1.195996
v -0.490073 0.670100 1.195996
v -0.565669 0.778534 1.195874
v -0.716860 0.778534 1.195629
v -0.486437 0.278832 -1.049977
v -0.486437 0.322809 -1.049977
v -0.487346 0.344797 -0.488484
v -0.489164 0.344797 0.634503
v -0.486437 0.453231 -1.049977
v -0.486437 0.670100 -1.049977
v -0.487346 0.778534 -0.488484
v -0.489164 0.778534 0.634503
v -0.788820 0.278832 -1.050467
v -0.788820 0.322809 -1.050467
v -0.713224 0.344797 -1.050344
v -0.562033 0.344797 -1.050099
v -0.788820 0.453231 -1.050467
v -0.788820 0.670100 -1.050467
v -0.713224 0.778534 -1.050344
v -0.562033 0.778534 -1.050099
v 0.282782 0.377049 1.285905
v 0.282877 0.377049 1.226800
v 0.286610 0.377049 -1.079834
v 0.286712 0.377049 -1.142049
v -0.486387 0.377049 -1.081085
v -0.486286 0.377049 -1.143300
v -0.717050 0.377049 1.313838
v -0.565859 0.377049 1.314083
v -0.490216 0.377049 1.284653
v -0.490121 0.377049 1.225548
v -0.792455 0.286895 1.195507
v -0.792455 0.346998 1.195507
v -0.716860 0.377049 1.195629
v -0.565669 0.377049 1.195874
v -0.490264 0.286895 1.314205
v -0.490264 0.346998 1.314205
v -0.486236 0.286895 -1.174408
v -0.486236 0.346998 -1.174408
v -0.292987 0.377049 -1.174095
v 0.093512 0.377049 -1.173470
v 0.282925 0.286895 1.197248
v 0.282925 0.346998 1.197248
v -0.788618 0.286895 -1.174897
v -0.788618 0.346998 -1.174897
v -0.713023 0.377049 -1.174775
v -0.561832 0.377049 -1.174530
v 0.286762 0.286895 -1.173157
v 0.286762 0.346998 -1.173157
v -0.788820 0.286895 -1.050467
v -0.788820 0.346998 -1.050467
v -0.788770 0.377049 -1.081574
v -0.788669 0.377049 -1.143790
v -0.490073 0.286895 1.195996
v -0.490073 0.346998 1.195996
v -0.296824 0.377049 1.196309
v 0.089676 0.377049 1.196935
v 0.282782 -0.128422 1.285905
v 0.282877 0.128422 1.226800
v 0.282877 0.256844 1.226800
v 0.282782 0.256844 1.285905
v -0.717050 -0.128422 1.313838
v -0.565859 0.128422 1.314083
v -0.565859 0.256844 1.314083
v -0.717050 0.256844 1.313838
v -0.788669 -0.128422 -1.143790
v -0.788770 0.128422 -1.081574
v -0.788770 0.256844 -1.081574
v -0.788669 0.256844 -1.143790
v 0.093512 -0.128422 -1.173470
v -0.292987 0.128422 -1.174095
v -0.292987 0.256844 -1.174095
v 0.093512 0.256844 -1.173470
v -0.717003 -0.256844 1.284286
v -0.565716 -0.256844 1.225426
v -0.792598 0.346998 1.284164
v -0.792503 0.286895 1.225059
v -0.792503 0.256844 1.225059
v -0.792598 0.256844 1.284164
v 0.286610 -0.128422 -1.079834
v 0.286712 0.128422 -1.142049
v 0.286712 0.256844 -1.142049
v 0.286610 0.256844 -1.079834
v -0.789729 -0.128422 -0.488973
v -0.791546 0.128422 0.634014
v -0.791546 0.256844 0.634014
v -0.789729 0.256844 -0.488973
v -0.713174 -0.256844 -1.081452
v -0.561882 -0.256844 -1.143423
v 0.089485 0.346998 1.315144
v -0.297015 0.286895 1.314518
v -0.297015 0.256844 1.314518
v 0.089485 0.256844 1.315144
v 0.090585 0.256844 0.635442
v -0.294096 0.256844 -0.488171
v -0.487346 0.256844 -0.488484
v -0.489164 0.256844 0.634503
v 0.093311 0.256844 -1.049039
v -0.293188 0.256844 -1.049664
v -0.561832 -0.128422 -1.174530
v -0.713023 0.128422 -1.174775
v -0.713023 0.256844 -1.174775
v -0.561832 0.256844 -1.174530
v -0.297015 -0.128422 1.314518
v 0.089485 0.128422 1.315144
v -0.715950 -0.256844 0.634136
v -0.562941 -0.256844 -0.488606
v -0.295915 -0.256844 0.634816
v 0.092402 -0.256844 -0.487545
v -0.792503 -0.128422 1.225059
v -0.792598 0.128422 1.284164
v -0.293137 -0.256844 -1.080772
v 0.093462 -0.256844 -1.142362
v 0.283834 -0.128422 0.635754
v 0.285651 0.128422 -0.487232
v 0.093311 0.346998 -1.049039
v -0.293188 0.286895 -1.049664
v -0.562033 0.346998 -1.050099
v -0.713224 0.286895 -1.050344
v -0.713224 0.256844 -1.050344
v -0.562033 0.256844 -1.050099
v -0.296967 -0.256844 1.284966
v 0.089628 -0.256844 1.226487
v -0.791546 0.670100 0.634014
v -0.789729 0.453231 -0.488973
v -0.565669 0.322809 1.195874
v -0.716860 0.278832 1.195629
v -0.716860 0.256844 1.195629
v -0.565669 0.256844 1.195874
v -0.791546 0.322809 0.634014
v -0.789729 0.278832 -0.488973
v -0.565669 0.670100 1.195874
v -0.716860 0.453231 1.195629
v -0.487346 0.322809 -0.488484
v -0.489164 0.278832 0.634503
v -0.487346 0.670100 -0.488484
v -0.489164 0.453231 0.634503
v -0.564760 0.778534 0.634380
v -0.714133 0.778534 -0.488851
v -0.713224 0.322809 -1.050344
v -0.562033 0.278832 -1.050099
v -0.713224 0.670100 -1.050344
v -0.562033 0.453231 -1.050099
v 0.089532 0.377049 1.285592
v -0.296871 0.377049 1.225861
v 0.093361 0.377049 -1.080147
v -0.293037 0.377049 -1.142987
v -0.561982 0.377049 -1.081207
v -0.713073 0.377049 -1.143667
v -0.565812 0.377049 1.284531
v -0.716907 0.377049 1.225182
v -0.716860 0.346998 1.195629
v -0.565669 0.286895 1.195874
v -0.565859 0.346998 1.314083
v -0.717050 0.286895 1.313838
v -0.292987 0.346998 -1.174095
v 0.093512 0.286895 -1.173470
v 0.282877 0.346998 1.226800
v 0.282782 0.286895 1.285905
v -0.713023 0.346998 -1.174775
v -0.561832 0.286895 -1.174530
v 0.286712 0.346998 -1.142049
v 0.286610 0.286895 -1.079834
v -0.788770 0.346998 -1.081574
v -0.788669 0.286895 -1.143790
v -0.296824 0.346998 1.196309
v 0.089676 0.286895 1.196935
# 1010 vertices, 0 vertices normals

f 507 129 255
f 508 130 256
f 509 131 257
f 510 132 258
f 511 133 259
f 512 134 260
f 513 135 261
f 514 136 262
f 515 132 263
f 516 137 264
f 517 138 265
f 518 139 266
f 519 140 267
f 520 141 268
f 521 142 269
f 522 143 270
f 523 144 271
f 524 134 272
f 525 145 273
f 526 146 274
f 527 147 275
f 528 148 276
f 529 149 277
f 530 150 278
f 531 151 279
f 532 152 280
f 533 153 281
f 534 143 282
f 535 154 283
f 536 155 284
f 537 156 285
f 538 137 286
f 539 157 287
f 540 158 288
f 541 159 289
f 542 160 290
f 543 161 291
f 544 162 292
f 545 163 293
f 546 164 294
f 547 152 295
f 548 165 296
f 549 166 297
f 550 167 298
f 551 168 299
f 552 169 300
f 553 170 301
f 554 171 302
f 555 172 303
f 556 173 304
f 557 174 305
f 558 175 306
f 559 176 307
f 560 177 308
f 561 173 309
f 562 177 310
f 563 178 311
f 564 179 312
f 565 180 313
f 566 181 314
f 567 146 315
f 568 182 316
f 569 162 317
f 570 183 318
f 571 164 319
f 572 184 320
f 573 185 321
f 574 186 322
f 575 187 323
f 576 188 324
f 577 189 325
f 578 185 326
f 579 190 327
f 580 191 328
f 581 192 329
f 582 182 330
f 583 193 331
f 584 194 332
f 585 195 333
f 586 183 334
f 587 196 335
f 588 197 336
f 589 198 337
f 590 199 338
f 339 591 200
f 201 340 592
f 341 593 159
f 200 342 594
f 343 595 202
f 203 344 596
f 345 597 151
f 202 346 598
f 347 599 204
f 205 348 600
f 349 601 142
f 204 350 602
f 351 603 206
f 207 352 604
f 353 605 149
f 206 354 606
f 355 607 208
f 165 356 608
f 357 609 153
f 208 358 610
f 359 611 209
f 210 360 612
f 361 613 187
f 209 362 614
f 363 615 211
f 212 364 616
f 365 617 135
f 211 366 618
f 367 619 213
f 214 368 620
f 369 621 156
f 213 370 622
f 371 623 215
f 158 372 624
f 373 625 150
f 215 374 626
f 375 627 216
f 217 376 628
f 377 629 189
f 216 378 630
f 379 631 218
f 219 380 632
f 381 633 220
f 218 382 634
f 383 635 221
f 222 384 636
f 385 637 133
f 221 386 638
f 387 639 223
f 217 388 640
f 389 641 129
f 223 390 642
f 391 643 224
f 155 392 644
f 393 645 144
f 224 394 646
f 395 647 225
f 160 396 648
f 397 649 157
f 225 398 650
f 399 651 226
f 210 400 652
f 401 653 131
f 226 402 654
f 403 655 227
f 141 404 656
f 405 657 136
f 227 406 658
f 407 659 228
f 148 408 660
f 409 661 140
f 228 410 662
f 411 663 229
f 220 412 664
f 413 665 163
f 229 414 666
f 415 667 230
f 231 416 668
f 417 669 196
f 230 418 670
f 419 671 232
f 130 420 672
f 421 673 154
f 232 422 674
f 423 675 233
f 171 424 676
f 425 677 180
f 233 426 678
f 427 679 234
f 235 428 680
f 429 681 170
f 234 430 682
f 431 683 236
f 214 432 684
f 433 685 178
f 236 434 686
f 435 687 237
f 169 436 688
f 437 689 166
f 237 438 690
f 439 691 238
f 219 440 692
f 441 693 168
f 238 442 694
f 443 695 239
f 175 444 696
f 445 697 172
f 239 446 698
f 447 699 240
f 167 448 700
f 449 701 181
f 240 450 702
f 451 703 241
f 231 452 704
f 453 705 174
f 241 454 706
f 455 707 242
f 179 456 708
f 457 709 176
f 242 458 710
f 459 711 243
f 186 460 712
f 461 713 199
f 243 462 714
f 463 715 244
f 184 464 716
f 465 717 191
f 244 466 718
f 467 719 245
f 197 468 720
f 469 721 194
f 245 470 722
f 471 723 246
f 139 472 724
f 473 725 188
f 246 474 726
f 475 727 247
f 235 476 728
f 477 729 198
f 247 478 730
f 479 731 248
f 203 480 732
f 481 733 138
f 248 482 734
f 483 735 249
f 207 484 736
f 485 737 195
f 249 486 738
f 487 739 250
f 201 488 740
f 489 741 145
f 250 490 742
f 491 743 251
f 222 492 744
f 493 745 190
f 251 494 746
f 495 747 252
f 212 496 748
f 497 749 161
f 252 498 750
f 499 751 253
f 205 500 752
f 501 753 193
f 253 502 754
f 503 755 254
f 147 504 756
f 505 757 192
f 254 506 758
f 340 759 129
f 129 280 760
f 342 761 130
f 762 130 419
f 344 763 131
f 131 286 764
f 346 765 132
f 356 766 132
f 348 767 133
f 133 278 768
f 350 769 134
f 374 770 134
f 352 771 135
f 135 268 772
f 354 773 136
f 136 288 774
f 358 775 137
f 402 776 137
f 360 777 138
f 138 326 778
f 362 779 139
f 780 139 471
f 364 781 140
f 140 290 782
f 366 783 141
f 784 141 403
f 368 785 142
f 142 260 786
f 370 787 143
f 394 788 143
f 372 789 144
f 144 282 790
f 376 791 145
f 145 330 792
f 378 793 146
f 460 794 146
f 380 795 147
f 796 147 503
f 382 797 148
f 798 148 407
f 384 799 149
f 149 262 800
f 386 801 150
f 150 272 802
f 388 803 151
f 151 258 804
f 390 805 152
f 420 806 152
f 392 807 153
f 153 264 808
f 396 809 154
f 154 296 810
f 398 811 155
f 812 155 391
f 400 813 156
f 156 270 814
f 404 815 157
f 157 284 816
f 406 817 158
f 818 158 371
f 408 819 159
f 159 256 820
f 410 821 160
f 822 160 395
f 412 823 161
f 161 334 824
f 414 825 162
f 464 826 162
f 416 827 163
f 163 292 828
f 418 829 164
f 468 830 164
f 422 831 165
f 832 165 355
f 424 833 166
f 166 304 834
f 426 835 167
f 836 167 447
f 428 837 168
f 168 306 838
f 430 839 169
f 840 169 435
f 432 841 170
f 170 300 842
f 434 843 171
f 844 171 423
f 436 845 172
f 172 308 846
f 438 847 173
f 448 848 173
f 440 849 174
f 174 312 850
f 442 851 175
f 852 175 443
f 444 853 176
f 176 314 854
f 446 855 177
f 450 856 177
f 452 857 178
f 178 302 858
f 454 859 179
f 860 179 455
f 456 861 180
f 180 298 862
f 458 863 181
f 181 310 864
f 462 865 182
f 490 866 182
f 466 867 183
f 498 868 183
f 470 869 184
f 870 184 463
f 472 871 185
f 482 872 185
f 474 873 186
f 874 186 459
f 476 875 187
f 187 266 876
f 478 877 188
f 188 322 878
f 480 879 189
f 189 274 880
f 484 881 190
f 190 332 882
f 486 883 191
f 191 318 884
f 488 885 192
f 192 338 886
f 492 887 193
f 193 336 888
f 494 889 194
f 194 320 890
f 496 891 195
f 195 328 892
f 500 893 196
f 196 294 894
f 502 895 197
f 896 197 467
f 504 897 198
f 198 324 898
f 506 899 199
f 199 316 900
f 200 255 901
f 902 200 341
f 903 201 339
f 904 201 487
f 202 257 905
f 906 202 345
f 907 203 343
f 908 203 479
f 204 259 909
f 910 204 349
f 911 205 347
f 912 205 499
f 206 261 913
f 914 206 353
f 915 207 351
f 916 207 483
f 208 263 917
f 918 208 357
f 209 265 919
f 920 209 361
f 921 210 359
f 922 210 399
f 211 267 923
f 924 211 365
f 925 212 363
f 926 212 495
f 213 269 927
f 928 213 369
f 929 214 367
f 930 214 431
f 215 271 931
f 932 215 373
f 216 273 933
f 934 216 377
f 935 217 375
f 936 217 387
f 218 275 937
f 938 218 381
f 939 219 379
f 940 219 439
f 220 276 941
f 942 220 411
f 221 277 943
f 944 221 385
f 945 222 383
f 946 222 491
f 223 279 947
f 948 223 389
f 224 281 949
f 950 224 393
f 225 283 951
f 952 225 397
f 226 285 953
f 954 226 401
f 227 287 955
f 956 227 405
f 228 289 957
f 958 228 409
f 229 291 959
f 960 229 413
f 230 293 961
f 962 230 417
f 963 231 415
f 964 231 451
f 232 295 965
f 966 232 421
f 233 297 967
f 968 233 425
f 234 299 969
f 970 234 429
f 971 235 427
f 972 235 475
f 236 301 973
f 974 236 433
f 237 303 975
f 976 237 437
f 238 305 977
f 978 238 441
f 239 307 979
f 980 239 445
f 240 309 981
f 982 240 449
f 241 311 983
f 984 241 453
f 242 313 985
f 986 242 457
f 243 315 987
f 988 243 461
f 244 317 989
f 990 244 465
f 245 319 991
f 992 245 469
f 246 321 993
f 994 246 473
f 247 323 995
f 996 247 477
f 248 325 997
f 998 248 481
f 249 327 999
f 1000 249 485
f 250 329 1001
f 1002 250 489
f 251 331 1003
f 1004 251 493
f 252 333 1005
f 1006 252 497
f 253 335 1007
f 1008 253 501
f 254 337 1009
f 1010 254 505
f 255 760 2
f 591 45 255
f 256 762 22
f 593 46 256
f 257 764 3
f 595 47 257
f 258 766 18
f 597 48 258
f 259 768 4
f 599 49 259
f 260 770 12
f 601 50 260
f 261 772 1
f 603 51 261
f 262 774 20
f 605 52 262
f 263 765 3
f 607 53 263
f 264 776 23
f 609 54 264
f 265 778 35
f 611 55 265
f 266 780 43
f 613 56 266
f 267 782 10
f 615 57 267
f 268 784 1
f 617 58 268
f 269 786 12
f 619 59 269
f 270 788 23
f 621 60 270
f 271 790 12
f 623 61 271
f 272 769 4
f 625 62 272
f 273 792 34
f 627 63 273
f 274 794 41
f 629 64 274
f 275 796 24
f 631 65 275
f 276 798 9
f 633 66 276
f 277 800 20
f 635 67 277
f 278 802 4
f 637 68 278
f 279 804 18
f 639 69 279
f 280 806 2
f 641 70 280
f 281 808 23
f 643 71 281
f 282 787 12
f 645 72 282
f 283 810 15
f 647 73 283
f 284 812 13
f 649 74 284
f 285 814 23
f 651 75 285
f 286 775 3
f 653 76 286
f 287 816 13
f 655 77 287
f 288 818 20
f 657 78 288
f 289 820 22
f 659 79 289
f 290 822 10
f 661 80 290
f 291 824 37
f 663 81 291
f 292 826 39
f 665 82 292
f 293 828 39
f 667 83 293
f 294 830 38
f 669 84 294
f 295 805 18
f 671 85 295
f 296 832 15
f 673 86 296
f 297 834 29
f 675 87 297
f 298 836 32
f 677 88 298
f 299 838 28
f 679 89 299
f 300 840 27
f 681 90 300
f 301 842 27
f 683 91 301
f 302 844 26
f 685 92 302
f 303 846 30
f 687 93 303
f 304 848 29
f 689 94 304
f 305 850 25
f 691 95 305
f 306 852 28
f 693 96 306
f 307 854 31
f 695 97 307
f 308 856 30
f 697 98 308
f 309 847 30
f 699 99 309
f 310 855 31
f 701 100 310
f 311 858 26
f 703 101 311
f 312 860 25
f 705 102 312
f 313 862 32
f 707 103 313
f 314 864 31
f 709 104 314
f 315 793 34
f 711 105 315
f 316 866 44
f 713 106 316
f 317 825 37
f 715 107 317
f 318 868 33
f 717 108 318
f 319 829 39
f 719 109 319
f 320 870 42
f 721 110 320
f 321 872 41
f 723 111 321
f 322 874 40
f 725 112 322
f 323 876 43
f 727 113 323
f 324 878 40
f 729 114 324
f 325 880 41
f 731 115 325
f 326 871 35
f 733 116 326
f 327 882 42
f 735 117 327
f 328 884 33
f 737 118 328
f 329 886 44
f 739 119 329
f 330 865 34
f 741 120 330
f 331 888 36
f 743 121 331
f 332 890 42
f 745 122 332
f 333 892 33
f 747 123 333
f 334 867 37
f 749 124 334
f 335 894 38
f 751 125 335
f 336 896 36
f 753 126 336
f 337 898 40
f 755 127 337
f 338 900 44
f 757 128 338
f 24 339 902
f 339 592 45
f 904 6 340
f 45 340 507
f 24 341 819
f 341 594 46
f 901 2 342
f 46 342 508
f 17 343 906
f 343 596 47
f 908 7 344
f 47 344 509
f 17 345 803
f 345 598 48
f 905 3 346
f 48 346 510
f 11 347 910
f 347 600 49
f 912 8 348
f 49 348 511
f 11 349 785
f 349 602 50
f 909 4 350
f 50 350 512
f 19 351 914
f 351 604 51
f 916 5 352
f 51 352 513
f 19 353 799
f 353 606 52
f 913 1 354
f 52 354 514
f 15 355 918
f 355 608 53
f 831 18 356
f 53 356 515
f 15 357 807
f 357 610 54
f 917 3 358
f 54 358 516
f 21 359 920
f 359 612 55
f 922 7 360
f 55 360 517
f 21 361 875
f 361 614 56
f 919 35 362
f 56 362 518
f 5 363 924
f 363 616 57
f 926 9 364
f 57 364 519
f 5 365 771
f 365 618 58
f 923 10 366
f 58 366 520
f 21 367 928
f 367 620 59
f 930 11 368
f 59 368 521
f 21 369 813
f 369 622 60
f 927 12 370
f 60 370 522
f 20 371 932
f 371 624 61
f 817 13 372
f 61 372 523
f 20 373 801
f 373 626 62
f 931 12 374
f 62 374 524
f 17 375 934
f 375 628 63
f 936 6 376
f 63 376 525
f 17 377 879
f 377 630 64
f 933 34 378
f 64 378 526
f 14 379 938
f 379 632 65
f 940 16 380
f 65 380 527
f 14 381 942
f 381 634 66
f 937 24 382
f 66 382 528
f 8 383 944
f 383 636 67
f 946 19 384
f 67 384 529
f 8 385 767
f 385 638 68
f 943 20 386
f 68 386 530
f 6 387 948
f 387 640 69
f 935 17 388
f 69 388 531
f 6 389 759
f 389 642 70
f 947 18 390
f 70 390 532
f 13 391 950
f 391 644 71
f 811 15 392
f 71 392 533
f 13 393 789
f 393 646 72
f 949 23 394
f 72 394 534
f 10 395 952
f 395 648 73
f 821 22 396
f 73 396 535
f 10 397 815
f 397 650 74
f 951 15 398
f 74 398 536
f 7 399 954
f 399 652 75
f 921 21 400
f 75 400 537
f 7 401 763
f 401 654 76
f 953 23 402
f 76 402 538
f 1 403 956
f 403 656 77
f 783 10 404
f 77 404 539
f 1 405 773
f 405 658 78
f 955 13 406
f 78 406 540
f 9 407 958
f 407 660 79
f 797 24 408
f 79 408 541
f 9 409 781
f 409 662 80
f 957 22 410
f 80 410 542
f 14 411 960
f 411 664 81
f 941 9 412
f 81 412 543
f 14 413 827
f 413 666 82
f 959 37 414
f 82 414 544
f 11 415 962
f 415 668 83
f 964 14 416
f 83 416 545
f 11 417 893
f 417 670 84
f 961 39 418
f 84 418 546
f 22 419 966
f 419 672 85
f 761 2 420
f 85 420 547
f 22 421 809
f 421 674 86
f 965 18 422
f 86 422 548
f 26 423 968
f 423 676 87
f 843 27 424
f 87 424 549
f 26 425 861
f 425 678 88
f 967 29 426
f 88 426 550
f 21 427 970
f 427 680 89
f 972 16 428
f 89 428 551
f 21 429 841
f 429 682 90
f 969 28 430
f 90 430 552
f 11 431 974
f 431 684 91
f 929 21 432
f 91 432 553
f 11 433 857
f 433 686 92
f 973 27 434
f 92 434 554
f 27 435 976
f 435 688 93
f 839 28 436
f 93 436 555
f 27 437 833
f 437 690 94
f 975 30 438
f 94 438 556
f 16 439 978
f 439 692 95
f 939 14 440
f 95 440 557
f 16 441 837
f 441 694 96
f 977 25 442
f 96 442 558
f 28 443 980
f 443 696 97
f 851 25 444
f 97 444 559
f 28 445 845
f 445 698 98
f 979 31 446
f 98 446 560
f 32 447 982
f 447 700 99
f 835 29 448
f 99 448 561
f 32 449 863
f 449 702 100
f 981 30 450
f 100 450 562
f 14 451 984
f 451 704 101
f 963 11 452
f 101 452 563
f 14 453 849
f 453 706 102
f 983 26 454
f 102 454 564
f 25 455 986
f 455 708 103
f 859 26 456
f 103 456 565
f 25 457 853
f 457 710 104
f 985 32 458
f 104 458 566
f 40 459 988
f 459 712 105
f 873 41 460
f 105 460 567
f 40 461 899
f 461 714 106
f 987 34 462
f 106 462 568
f 42 463 990
f 463 716 107
f 869 39 464
f 107 464 569
f 42 465 883
f 465 718 108
f 989 37 466
f 108 466 570
f 36 467 992
f 467 720 109
f 895 38 468
f 109 468 571
f 36 469 889
f 469 722 110
f 991 39 470
f 110 470 572
f 43 471 994
f 471 724 111
f 779 35 472
f 111 472 573
f 43 473 877
f 473 726 112
f 993 41 474
f 112 474 574
f 16 475 996
f 475 728 113
f 971 21 476
f 113 476 575
f 16 477 897
f 477 730 114
f 995 43 478
f 114 478 576
f 7 479 998
f 479 732 115
f 907 17 480
f 115 480 577
f 7 481 777
f 481 734 116
f 997 41 482
f 116 482 578
f 5 483 1000
f 483 736 117
f 915 19 484
f 117 484 579
f 5 485 891
f 485 738 118
f 999 42 486
f 118 486 580
f 6 487 1002
f 487 740 119
f 903 24 488
f 119 488 581
f 6 489 791
f 489 742 120
f 1001 44 490
f 120 490 582
f 19 491 1004
f 491 744 121
f 945 8 492
f 121 492 583
f 19 493 881
f 493 746 122
f 1003 36 494
f 122 494 584
f 9 495 1006
f 495 748 123
f 925 5 496
f 123 496 585
f 9 497 823
f 497 750 124
f 1005 33 498
f 124 498 586
f 8 499 1008
f 499 752 125
f 911 11 500
f 125 500 587
f 8 501 887
f 501 754 126
f 1007 38 502
f 126 502 588
f 24 503 1010
f 503 756 127
f 795 16 504
f 127 504 589
f 24 505 885
f 505 758 128
f 1009 40 506
f 128 506 590
f 45 507 255
f 507 340 129
f 46 508 256
f 508 342 130
f 47 509 257
f 509 344 131
f 48 510 258
f 510 346 132
f 49 511 259
f 511 348 133
f 50 512 260
f 512 350 134
f 51 513 261
f 513 352 135
f 52 514 262
f 514 354 136
f 53 515 263
f 515 356 132
f 54 516 264
f 516 358 137
f 55 517 265
f 517 360 138
f 56 518 266
f 518 362 139
f 57 519 267
f 519 364 140
f 58 520 268
f 520 366 141
f 59 521 269
f 521 368 142
f 60 522 270
f 522 370 143
f 61 523 271
f 523 372 144
f 62 524 272
f 524 374 134
f 63 525 273
f 525 376 145
f 64 526 274
f 526 378 146
f 65 527 275
f 527 380 147
f 66 528 276
f 528 382 148
f 67 529 277
f 529 384 149
f 68 530 278
f 530 386 150
f 69 531 279
f 531 388 151
f 70 532 280
f 532 390 152
f 71 533 281
f 533 392 153
f 72 534 282
f 534 394 143
f 73 535 283
f 535 396 154
f 74 536 284
f 536 398 155
f 75 537 285
f 537 400 156
f 76 538 286
f 538 402 137
f 77 539 287
f 539 404 157
f 78 540 288
f 540 406 158
f 79 541 289
f 541 408 159
f 80 542 290
f 542 410 160
f 81 543 291
f 543 412 161
f 82 544 292
f 544 414 162
f 83 545 293
f 545 416 163
f 84 546 294
f 546 418 164
f 85 547 295
f 547 420 152
f 86 548 296
f 548 422 165
f 87 549 297
f 549 424 166
f 88 550 298
f 550 426 167
f 89 551 299
f 551 428 168
f 90 552 300
f 552 430 169
f 91 553 301
f 553 432 170
f 92 554 302
f 554 434 171
f 93 555 303
f 555 436 172
f 94 556 304
f 556 438 173
f 95 557 305
f 557 440 174
f 96 558 306
f 558 442 175
f 97 559 307
f 559 444 176
f 98 560 308
f 560 446 177
f 99 561 309
f 561 448 173
f 100 562 310
f 562 450 177
f 101 563 311
f 563 452 178
f 102 564 312
f 564 454 179
f 103 565 313
f 565 456 180
f 104 566 314
f 566 458 181
f 105 567 315
f 567 460 146
f 106 568 316
f 568 462 182
f 107 569 317
f 569 464 162
f 108 570 318
f 570 466 183
f 109 571 319
f 571 468 164
f 110 572 320
f 572 470 184
f 111 573 321
f 573 472 185
f 112 574 322
f 574 474 186
f 113 575 323
f 575 476 187
f 114 576 324
f 576 478 188
f 115 577 325
f 577 480 189
f 116 578 326
f 578 482 185
f 117 579 327
f 579 484 190
f 118 580 328
f 580 486 191
f 119 581 329
f 581 488 192
f 120 582 330
f 582 490 182
f 121 583 331
f 583 492 193
f 122 584 332
f 584 494 194
f 123 585 333
f 585 496 195
f 124 586 334
f 586 498 183
f 125 587 335
f 587 500 196
f 126 588 336
f 588 502 197
f 127 589 337
f 589 504 198
f 128 590 338
f 590 506 199
f 339 45 591
f 200 591 255
f 592 340 45
f 339 201 592
f 341 46 593
f 159 593 256
f 594 342 46
f 341 200 594
f 343 47 595
f 202 595 257
f 596 344 47
f 343 203 596
f 345 48 597
f 151 597 258
f 598 346 48
f 345 202 598
f 347 49 599
f 204 599 259
f 600 348 49
f 347 205 600
f 349 50 601
f 142 601 260
f 602 350 50
f 349 204 602
f 351 51 603
f 206 603 261
f 604 352 51
f 351 207 604
f 353 52 605
f 149 605 262
f 606 354 52
f 353 206 606
f 355 53 607
f 208 607 263
f 608 356 53
f 355 165 608
f 357 54 609
f 153 609 264
f 610 358 54
f 357 208 610
f 359 55 611
f 209 611 265
f 612 360 55
f 359 210 612
f 361 56 613
f 187 613 266
f 614 362 56
f 361 209 614
f 363 57 615
f 211 615 267
f 616 364 57
f 363 212 616
f 365 58 617
f 135 617 268
f 618 366 58
f 365 211 618
f 367 59 619
f 213 619 269
f 620 368 59
f 367 214 620
f 369 60 621
f 156 621 270
f 622 370 60
f 369 213 622
f 371 61 623
f 215 623 271
f 624 372 61
f 371 158 624
f 373 62 625
f 150 625 272
f 626 374 62
f 373 215 626
f 375 63 627
f 216 627 273
f 628 376 63
f 375 217 628
f 377 64 629
f 189 629 274
f 630 378 64
f 377 216 630
f 379 65 631
f 218 631 275
f 632 380 65
f 379 219 632
f 381 66 633
f 220 633 276
f 634 382 66
f 381 218 634
f 383 67 635
f 221 635 277
f 636 384 67
f 383 222 636
f 385 68 637
f 133 637 278
f 638 386 68
f 385 221 638
f 387 69 639
f 223 639 279
f 640 388 69
f 387 217 640
f 389 70 641
f 129 641 280
f 642 390 70
f 389 223 642
f 391 71 643
f 224 643 281
f 644 392 71
f 391 155 644
f 393 72 645
f 144 645 282
f 646 394 72
f 393 224 646
f 395 73 647
f 225 647 283
f 648 396 73
f 395 160 648
f 397 74 649
f 157 649 284
f 650 398 74
f 397 225 650
f 399 75 651
f 226 651 285
f 652 400 75
f 399 210 652
f 401 76 653
f 131 653 286
f 654 402 76
f 401 226 654
f 403 77 655
f 227 655 287
f 656 404 77
f 403 141 656
f 405 78 657
f 136 657 288
f 658 406 78
f 405 227 658
f 407 79 659
f 228 659 289
f 660 408 79
f 407 148 660
f 409 80 661
f 140 661 290
f 662 410 80
f 409 228 662
f 411 81 663
f 229 663 291
f 664 412 81
f 411 220 664
f 413 82 665
f 163 665 292
f 666 414 82
f 413 229 666
f 415 83 667
f 230 667 293
f 668 416 83
f 415 231 668
f 417 84 669
f 196 669 294
f 670 418 84
f 417 230 670
f 419 85 671
f 232 671 295
f 672 420 85
f 419 130 672
f 421 86 673
f 154 673 296
f 674 422 86
f 421 232 674
f 423 87 675
f 233 675 297
f 676 424 87
f 423 171 676
f 425 88 677
f 180 677 298
f 678 426 88
f 425 233 678
f 427 89 679
f 234 679 299
f 680 428 89
f 427 235 680
f 429 90 681
f 170 681 300
f 682 430 90
f 429 234 682
f 431 91 683
f 236 683 301
f 684 432 91
f 431 214 684
f 433 92 685
f 178 685 302
f 686 434 92
f 433 236 686
f 435 93 687
f 237 687 303
f 688 436 93
f 435 169 688
f 437 94 689
f 166 689 304
f 690 438 94
f 437 237 690
f 439 95 691
f 238 691 305
f 692 440 95
f 439 219 692
f 441 96 693
f 168 693 306
f 694 442 96
f 441 238 694
f 443 97 695
f 239 695 307
f 696 444 97
f 443 175 696
f 445 98 697
f 172 697 308
f 698 446 98
f 445 239 698
f 447 99 699
f 240 699 309
f 700 448 99
f 447 167 700
f 449 100 701
f 181 701 310
f 702 450 100
f 449 240 702
f 451 101 703
f 241 703 311
f 704 452 101
f 451 231 704
f 453 102 705
f 174 705 312
f 706 454 102
f 453 241 706
f 455 103 707
f 242 707 313
f 708 456 103
f 455 179 708
f 457 104 709
f 176 709 314
f 710 458 104
f 457 242 710
f 459 105 711
f 243 711 315
f 712 460 105
f 459 186 712
f 461 106 713
f 199 713 316
f 714 462 106
f 461 243 714
f 463 107 715
f 244 715 317
f 716 464 107
f 463 184 716
f 465 108 717
f 191 717 318
f 718 466 108
f 465 244 718
f 467 109 719
f 245 719 319
f 720 468 109
f 467 197 720
f 469 110 721
f 194 721 320
f 722 470 110
f 469 245 722
f 471 111 723
f 246 723 321
f 724 472 111
f 471 139 724
f 473 112 725
f 188 725 322
f 726 474 112
f 473 246 726
f 475 113 727
f 247 727 323
f 728 476 113
f 475 235 728
f 477 114 729
f 198 729 324
f 730 478 114
f 477 247 730
f 479 115 731
f 248 731 325
f 732 480 115
f 479 203 732
f 481 116 733
f 138 733 326
f 734 482 116
f 481 248 734
f 483 117 735
f 249 735 327
f 736 484 117
f 483 207 736
f 485 118 737
f 195 737 328
f 738 486 118
f 485 249 738
f 487 119 739
f 250 739 329
f 740 488 119
f 487 201 740
f 489 120 741
f 145 741 330
f 742 490 120
f 489 250 742
f 491 121 743
f 251 743 331
f 744 492 121
f 491 222 744
f 493 122 745
f 190 745 332
f 746 494 122
f 493 251 746
f 495 123 747
f 252 747 333
f 748 496 123
f 495 212 748
f 497 124 749
f 161 749 334
f 750 498 124
f 497 252 750
f 499 125 751
f 253 751 335
f 752 500 125
f 499 205 752
f 501 126 753
f 193 753 336
f 754 502 126
f 501 253 754
f 503 127 755
f 254 755 337
f 756 504 127
f 503 147 756
f 505 128 757
f 192 757 338
f 758 506 128
f 505 254 758
f 340 6 759
f 759 389 129
f 760 280 2
f 255 129 760
f 342 2 761
f 130 761 420
f 22 762 419
f 256 130 762
f 344 7 763
f 763 401 131
f 764 286 3
f 257 131 764
f 346 3 765
f 263 132 765
f 356 18 766
f 258 132 766
f 348 8 767
f 767 385 133
f 768 278 4
f 259 133 768
f 350 4 769
f 272 134 769
f 374 12 770
f 260 134 770
f 352 5 771
f 771 365 135
f 772 268 1
f 261 135 772
f 354 1 773
f 773 405 136
f 774 288 20
f 262 136 774
f 358 3 775
f 286 137 775
f 402 23 776
f 264 137 776
f 360 7 777
f 777 481 138
f 778 326 35
f 265 138 778
f 362 35 779
f 139 779 472
f 43 780 471
f 266 139 780
f 364 9 781
f 781 409 140
f 782 290 10
f 267 140 782
f 366 10 783
f 141 783 404
f 1 784 403
f 268 141 784
f 368 11 785
f 785 349 142
f 786 260 12
f 269 142 786
f 370 12 787
f 282 143 787
f 394 23 788
f 270 143 788
f 372 13 789
f 789 393 144
f 790 282 12
f 271 144 790
f 376 6 791
f 791 489 145
f 792 330 34
f 273 145 792
f 378 34 793
f 315 146 793
f 460 41 794
f 274 146 794
f 380 16 795
f 147 795 504
f 24 796 503
f 275 147 796
f 382 24 797
f 148 797 408
f 9 798 407
f 276 148 798
f 384 19 799
f 799 353 149
f 800 262 20
f 277 149 800
f 386 20 801
f 801 373 150
f 802 272 4
f 278 150 802
f 388 17 803
f 803 345 151
f 804 258 18
f 279 151 804
f 390 18 805
f 295 152 805
f 420 2 806
f 280 152 806
f 392 15 807
f 807 357 153
f 808 264 23
f 281 153 808
f 396 22 809
f 809 421 154
f 810 296 15
f 283 154 810
f 398 15 811
f 155 811 392
f 13 812 391
f 284 155 812
f 400 21 813
f 813 369 156
f 814 270 23
f 285 156 814
f 404 10 815
f 815 397 157
f 816 284 13
f 287 157 816
f 406 13 817
f 158 817 372
f 20 818 371
f 288 158 818
f 408 24 819
f 819 341 159
f 820 256 22
f 289 159 820
f 410 22 821
f 160 821 396
f 10 822 395
f 290 160 822
f 412 9 823
f 823 497 161
f 824 334 37
f 291 161 824
f 414 37 825
f 317 162 825
f 464 39 826
f 292 162 826
f 416 14 827
f 827 413 163
f 828 292 39
f 293 163 828
f 418 39 829
f 319 164 829
f 468 38 830
f 294 164 830
f 422 18 831
f 165 831 356
f 15 832 355
f 296 165 832
f 424 27 833
f 833 437 166
f 834 304 29
f 297 166 834
f 426 29 835
f 167 835 448
f 32 836 447
f 298 167 836
f 428 16 837
f 837 441 168
f 838 306 28
f 299 168 838
f 430 28 839
f 169 839 436
f 27 840 435
f 300 169 840
f 432 21 841
f 841 429 170
f 842 300 27
f 301 170 842
f 434 27 843
f 171 843 424
f 26 844 423
f 302 171 844
f 436 28 845
f 845 445 172
f 846 308 30
f 303 172 846
f 438 30 847
f 309 173 847
f 448 29 848
f 304 173 848
f 440 14 849
f 849 453 174
f 850 312 25
f 305 174 850
f 442 25 851
f 175 851 444
f 28 852 443
f 306 175 852
f 444 25 853
f 853 457 176
f 854 314 31
f 307 176 854
f 446 31 855
f 310 177 855
f 450 30 856
f 308 177 856
f 452 11 857
f 857 433 178
f 858 302 26
f 311 178 858
f 454 26 859
f 179 859 456
f 25 860 455
f 312 179 860
f 456 26 861
f 861 425 180
f 862 298 32
f 313 180 862
f 458 32 863
f 863 449 181
f 864 310 31
f 314 181 864
f 462 34 865
f 330 182 865
f 490 44 866
f 316 182 866
f 466 37 867
f 334 183 867
f 498 33 868
f 318 183 868
f 470 39 869
f 184 869 464
f 42 870 463
f 320 184 870
f 472 35 871
f 326 185 871
f 482 41 872
f 321 185 872
f 474 41 873
f 186 873 460
f 40 874 459
f 322 186 874
f 476 21 875
f 875 361 187
f 876 266 43
f 323 187 876
f 478 43 877
f 877 473 188
f 878 322 40
f 324 188 878
f 480 17 879
f 879 377 189
f 880 274 41
f 325 189 880
f 484 19 881
f 881 493 190
f 882 332 42
f 327 190 882
f 486 42 883
f 883 465 191
f 884 318 33
f 328 191 884
f 488 24 885
f 885 505 192
f 886 338 44
f 329 192 886
f 492 8 887
f 887 501 193
f 888 336 36
f 331 193 888
f 494 36 889
f 889 469 194
f 890 320 42
f 332 194 890
f 496 5 891
f 891 485 195
f 892 328 33
f 333 195 892
f 500 11 893
f 893 417 196
f 894 294 38
f 335 196 894
f 502 38 895
f 197 895 468
f 36 896 467
f 336 197 896
f 504 16 897
f 897 477 198
f 898 324 40
f 337 198 898
f 506 40 899
f 899 461 199
f 900 316 44
f 338 199 900
f 901 255 2
f 200 901 342
f 24 902 341
f 902 339 200
f 24 903 339
f 201 903 488
f 6 904 487
f 201 904 340
f 905 257 3
f 202 905 346
f 17 906 345
f 906 343 202
f 17 907 343
f 203 907 480
f 7 908 479
f 203 908 344
f 909 259 4
f 204 909 350
f 11 910 349
f 910 347 204
f 11 911 347
f 205 911 500
f 8 912 499
f 205 912 348
f 913 261 1
f 206 913 354
f 19 914 353
f 914 351 206
f 19 915 351
f 207 915 484
f 5 916 483
f 207 916 352
f 917 263 3
f 208 917 358
f 15 918 357
f 918 355 208
f 919 265 35
f 209 919 362
f 21 920 361
f 920 359 209
f 21 921 359
f 210 921 400
f 7 922 399
f 210 922 360
f 923 267 10
f 211 923 366
f 5 924 365
f 924 363 211
f 5 925 363
f 212 925 496
f 9 926 495
f 212 926 364
f 927 269 12
f 213 927 370
f 21 928 369
f 928 367 213
f 21 929 367
f 214 929 432
f 11 930 431
f 214 930 368
f 931 271 12
f 215 931 374
f 20 932 373
f 932 371 215
f 933 273 34
f 216 933 378
f 17 934 377
f 934 375 216
f 17 935 375
f 217 935 388
f 6 936 387
f 217 936 376
f 937 275 24
f 218 937 382
f 14 938 381
f 938 379 218
f 14 939 379
f 219 939 440
f 16 940 439
f 219 940 380
f 941 276 9
f 220 941 412
f 14 942 411
f 942 381 220
f 943 277 20
f 221 943 386
f 8 944 385
f 944 383 221
f 8 945 383
f 222 945 492
f 19 946 491
f 222 946 384
f 947 279 18
f 223 947 390
f 6 948 389
f 948 387 223
f 949 281 23
f 224 949 394
f 13 950 393
f 950 391 224
f 951 283 15
f 225 951 398
f 10 952 397
f 952 395 225
f 953 285 23
f 226 953 402
f 7 954 401
f 954 399 226
f 955 287 13
f 227 955 406
f 1 956 405
f 956 403 227
f 957 289 22
f 228 957 410
f 9 958 409
f 958 407 228
f 959 291 37
f 229 959 414
f 14 960 413
f 960 411 229
f 961 293 39
f 230 961 418
f 11 962 417
f 962 415 230
f 11 963 415
f 231 963 452
f 14 964 451
f 231 964 416
f 965 295 18
f 232 965 422
f 22 966 421
f 966 419 232
f 967 297 29
f 233 967 426
f 26 968 425
f 968 423 233
f 969 299 28
f 234 969 430
f 21 970 429
f 970 427 234
f 21 971 427
f 235 971 476
f 16 972 475
f 235 972 428
f 973 301 27
f 236 973 434
f 11 974 433
f 974 431 236
f 975 303 30
f 237 975 438
f 27 976 437
f 976 435 237
f 977 305 25
f 238 977 442
f 16 978 441
f 978 439 238
f 979 307 31
f 239 979 446
f 28 980 445
f 980 443 239
f 981 309 30
f 240 981 450
f 32 982 449
f 982 447 240
f 983 311 26
f 241 983 454
f 14 984 453
f 984 451 241
f 985 313 32
f 242 985 458
f 25 986 457
f 986 455 242
f 987 315 34
f 243 987 462
f 40 988 461
f 988 459 243
f 989 317 37
f 244 989 466
f 42 990 465
f 990 463 244
f 991 319 39
f 245 991 470
f 36 992 469
f 992 467 245
f 993 321 41
f 246 993 474
f 43 994 473
f 994 471 246
f 995 323 43
f 247 995 478
f 16 996 477
f 996 475 247
f 997 325 41
f 248 997 482
f 7 998 481
f 998 479 248
f 999 327 42
f 249 999 486
f 5 1000 485
f 1000 483 249
f 1001 329 44
f 250 1001 490
f 6 1002 489
f 1002 487 250
f 1003 331 36
f 251 1003 494
f 19 1004 493
f 1004 491 251
f 1005 333 33
f 252 1005 498
f 9 1006 497
f 1006 495 252
f 1007 335 38
f 253 1007 502
f 8 1008 501
f 1008 499 253
f 1009 337 40
f 254 1009 506
f 24 1010 505
f 1010 503 254
# 2016 faces, 0 coords texture

# End of File