{
  "mosaics" : [
    {
      "mosaic_name" : "wsim_composite_forecast",
      "layers"      : [
        {
          "published_name"  : "wsim_composite_surplus_forecast",
          "original_name"   : "surplus",
          "style"           : "composite_surplus"
        },
        {
          "published_name"  : "wsim_composite_deficit_forecast",
          "original_name"   : "deficit",
          "style"           : "composite_deficit"
        },
        {
          "published_name"  : "wsim_composite_both_forecast",
          "original_name"   : "both",
          "style"           : "composite_both"
        }
      ],
      "directory"   : "composite",
      "wildcard"    : "composite_*trgt*.nc",
      "dimensions"  : [ 
        {
          "name"  : "time",
          "type"  : "date",
          "regex" : "[0-9]{6}"
        },
        {
          "name"  : "window",
          "type"  : "int",
          "regex" : "[0-9]+(?=mo)"
        },
        {
          "name"  : "target",
          "type"  : "date",
          "regex" : "(?<=trgt)[0-9]{6}"
        }
      ]
    },
    {
      "mosaic_name" : "wsim_composite_adjusted_forecast",
      "layers"      : [
        {
          "published_name"  : "wsim_composite_adjusted_surplus_forecast",
          "original_name"   : "surplus",
          "style"           : "composite_surplus"
        },
        {
          "published_name"  : "wsim_composite_adjusted_deficit_forecast",
          "original_name"   : "deficit",
          "style"           : "composite_deficit"
        },
        {
          "published_name"  : "wsim_composite_adjusted_both_forecast",
          "original_name"   : "both",
          "style"           : "composite_both"
        }
      ],
      "directory"   : "composite_adjusted",
      "wildcard"    : "composite_adjusted_*trgt*.nc",
      "dimensions"  : [ 
        {
          "name"  : "time",
          "type"  : "date",
          "regex" : "[0-9]{6}"
        },
        {
          "name"  : "window",
          "type"  : "int",
          "regex" : "[0-9]+(?=mo)"
        },
        {
          "name"  : "target",
          "type"  : "date",
          "regex" : "(?<=trgt)[0-9]{6}"
        }
      ]
    },
    {
      "mosaic_name" : "wsim_composite_observed",
      "layers"      : [
        {
          "published_name"  : "wsim_composite_surplus_observed",
          "original_name"   : "surplus",
          "style"           : "composite_surplus"
        },
        {
          "published_name"  : "wsim_composite_deficit_observed",
          "original_name"   : "deficit",
          "style"           : "composite_deficit"
        },
        {
          "published_name"  : "wsim_composite_both_observed",
          "original_name"   : "both",
          "style"           : "composite_both"
        }
      ],
      "directory"   : "composite",
      "wildcard"    : "composite_*mo_??????.nc",
      "dimensions"  : [ 
        {
          "name"  : "time",
          "type"  : "date",
          "regex" : "[0-9]{6}"
        },
        {
          "name"  : "window",
          "type"  : "int",
          "regex" : "[0-9]+(?=mo)"
        }
      ]
    },
    {
      "mosaic_name" : "wsim_composite_adjusted_observed",
      "layers"      : [
        {
          "published_name"  : "wsim_composite_adjusted_surplus_observed",
          "original_name"   : "surplus",
          "style"           : "composite_surplus"
        },
        {
          "published_name"  : "wsim_composite_adjusted_deficit_observed",
          "original_name"   : "deficit",
          "style"           : "composite_deficit"
        },
        {
          "published_name"  : "wsim_composite_adjusted_both_observed",
          "original_name"   : "both",
          "style"           : "composite_both"
        }
      ],
      "directory"   : "composite_adjusted",
      "wildcard"    : "composite_adjusted_*mo_??????.nc",
      "dimensions"  : [ 
        {
          "name"  : "time",
          "type"  : "date",
          "regex" : "[0-9]{6}"
        },
        {
          "name"  : "window",
          "type"  : "int",
          "regex" : "[0-9]+(?=mo)"
        }
      ]
    },
    {
      "mosaic_name" : "wsim_forcing_observed",
      "layers"      : [
        {
          "published_name"  : "Pr_observed",
          "original_name"   : "Pr",
          "style"           : "precipitation"
        },
        {
          "published_name"  : "T_observed",
          "original_name"   : "T",
          "style"           : "temperature"
        },
        {
          "published_name"  : "pWetDays_observed",
          "original_name"   : "pWetDays",
          "style"           : "pwetdays"
        }
      ],
      "directory"   : "forcing",
      "wildcard"    : "forcing_*_??????.nc",
      "dimensions"  : [ 
       {
         "name"  : "time",
         "type"  : "date",
         "regex" : "[0-9]{6}"
       }
      ]
    },
    {
      "mosaic_name" : "wsim_state_observed",
      "layers"      : [
        {
          "published_name"  : "Snowpack_observed",
          "original_name"   : "Snowpack",
          "style"           : "precipitation"
        }
      ],
      "directory"   : "state",
      "wildcard"    : "state_201[8,9]??.nc",
      "dimensions"  : [ 
       {
         "name"  : "time",
         "type"  : "date",
         "regex" : "[0-9]{6}"
       }
      ]
        
    },
    {
      "mosaic_name" : "wsim_results_observed",
      "layers"      : [
        {
          "published_name" : "Bt_RO_observed",
          "original_name"  : "Bt_RO",
          "style"          : "blue_water"
        },
        {
          "published_name" : "E_observed",
          "original_name"  : "E",
          "style"          : "evapotranspiration"
        },
        {
          "published_name" : "PET_observed",
          "original_name"  : "PET",
          "style"          : "evapotranspiration"
        },
        {
          "published_name" : "PETmE_observed",
          "original_name"  : "PETmE",
          "style"          : "evapotranspiration"
        },
        {
          "published_name" : "RO_observed",
          "original_name"  : "RO_mm",
          "style"          : "runoff"
        },
        {
          "published_name" : "Sa_observed",
          "original_name"  : "Sa",
          "style"          : "precipitation"
        },
        {
          "published_name" : "Sm_observed",
          "original_name"  : "Sm",
          "style"          : "runoff"
        },
        {
          "published_name" : "Ws_observed",
          "original_name"  : "Ws",
          "style"          : "soil_moisture"
        },
        {
          "published_name" : "dWdt_observed",
          "original_name"  : "dWdt",
          "style"          : "soil_moisture_change"
        }
      ],
      "directory"   : "results",
      "wildcard"    : "results_1mo_2019??.nc",
      "dimensions"  : [ 
       {
         "name"  : "time",
         "type"  : "date",
         "regex" : "[0-9]{6}"
       }
      ]
    },
    {
      "mosaic_name" : "wsim_results_integrated_observed",
      "layers"      : [
        {
          "published_name"  : "E_sum_observed",
          "original_name"   : "E_sum",
          "style"           : "evapotranspiration"
        },
        {
          "published_name"  : "PETmE_sum_observed",
          "original_name"   : "PETmE_sum",
          "style"           : "evapotranspiration"
        },
        {
          "published_name"  : "Bt_RO_min_observed",
          "original_name"   : "Bt_RO_min",
          "style"           : "blue_water"
        },
        {
          "published_name"  : "Bt_RO_max_observed",
          "original_name"   : "Bt_RO_max",
          "style"           : "blue_water"
        },
        {
          "published_name"  : "Bt_RO_sum_observed",
          "original_name"   : "Bt_RO_sum",
          "style"           : "blue_water"
        },
        {
          "published_name"  : "RO_mm_sum_observed",
          "original_name"   : "RO_mm_sum",
          "style"           : "runoff"
        },
        {
          "published_name"  : "Ws_ave_observed",
          "original_name"   : "Ws_ave",
          "style"           : "soil_moisture"
        }
      ],
      "directory"   : "results_integrated",
      "wildcard"    : "results_*mo_2019??.nc",
      "dimensions"  : [ 
        {
          "name"  : "time",
          "type"  : "date",
          "regex" : "[0-9]{6}"
        },
        {
          "name"  : "window",
          "type"  : "int",
          "regex" : "[0-9]+(?=mo)"
        }
      ]
    },
    {
      "mosaic_name" : "wsim_rp_observed",
      "layers"      : [
        {
          "published_name" : "Bt_RO_rp_observed",
          "original_name"  : "Bt_RO_rp",
          "style"          : "return_period"
        },
        {
          "published_name" : "PET_rp_observed",
          "original_name"  : "PET_rp",
          "style"          : "return_period"
        },
        {
          "published_name" : "PETmE_rp_observed",
          "original_name"  : "PETmE_rp",
          "style"          : "return_period_inverted"
        },
        {
          "published_name" : "RO_rp_observed",
          "original_name"  : "RO_mm_rp",
          "style"          : "return_period"
        },
        {
          "published_name" : "Ws_rp_observed",
          "original_name"  : "Ws_rp",
          "style"          : "return_period"
        },
        {
          "published_name" : "Snowpack_rp_observed",
          "original_name"  : "Snowpack_rp",
          "style"          : "return_period"
        },
        {
          "published_name" : "T_rp_observed",
          "original_name"  : "T_rp",
          "style"          : "return_period_inverted"
        },
        {
          "published_name" : "Pr_rp_observed",
          "original_name"  : "Pr_rp",
          "style"          : "return_period"
        },
        {
          "published_name" : "Sm_rp_observed",
          "original_name"  : "Sm_rp",
          "style"          : "return_period"
        },
        {
          "published_name" : "Sa_rp_observed",
          "original_name"  : "Sa_rp",
          "style"          : "return_period"
        }
      ],
      "directory" : "rp",
      "wildcard"  : "rp_1mo_201[8,9]??.nc",
      "dimensions"  : [ 
        {
          "name"  : "time",
          "type"  : "date",
          "regex" : "[0-9]{6}"
        }
      ]
    },
    {
      "mosaic_name" : "wsim_rp_integrated_observed",
      "layers"      : [
        {
          "published_name"  : "E_sum_rp_observed",
          "original_name"   : "E_sum_rp",
          "style"           : "return_period"
        },
        {
          "published_name"  : "PETmE_sum_rp_observed",
          "original_name"   : "PETmE_sum_rp",
          "style"           : "return_period_inverted"
        },
        {
          "published_name"  : "Bt_RO_min_rp_observed",
          "original_name"   : "Bt_RO_min_rp",
          "style"           : "return_period"
        },
        {
          "published_name"  : "Bt_RO_max_rp_observed",
          "original_name"   : "Bt_RO_max_rp",
          "style"           : "return_period"
        },
        {
          "published_name"  : "Bt_RO_sum_rp_observed",
          "original_name"   : "Bt_RO_sum_rp",
          "style"           : "return_period"
        },
        {
          "published_name"  : "RO_mm_sum_rp_observed",
          "original_name"   : "RO_mm_sum_rp",
          "style"           : "return_period"
        },
        {
          "published_name"  : "Ws_ave_rp_observed",
          "original_name"   : "Ws_ave_rp",
          "style"           : "return_period"
        },
        {
          "published_name"  : "T_ave_rp_observed",
          "original_name"   : "T_ave_rp",
          "style"           : "return_period_inverted"
        },
        {
          "published_name"  : "Pr_sum_rp_observed",
          "original_name"   : "Pr_sum_rp",
          "style"           : "return_period"
        },
        {
          "published_name"  : "Sa_sum_rp_observed",
          "original_name"   : "Sa_sum_rp",
          "style"           : "return_period"
        }
      ],
      "directory"   : "rp_integrated",
      "wildcard"    : "rp_*mo_201[8,9]??.nc",
      "dimensions"  : [ 
        {
          "name"  : "time",
          "type"  : "date",
          "regex" : "[0-9]{6}"
        },
        {
          "name"  : "window",
          "type"  : "int",
          "regex" : "[0-9]+(?=mo)"
        }
      ]
    }
  ]
}
