Edit testCFSConfig s.t. window=1 passed to ws.forcing()

2 jobs for add-results-vars in 20 minutes and 33 seconds (queued for 1 second)
Status Job ID Name Coverage
  Build
passed #264967714
build

00:14:19

 
  Test
failed #264967717
test

00:06:14

 
Name Stage Failure
failed
test Test

----------------------------------------------------------------------
Ran 13 tests in 52.086s

FAILED (failures=1, skipped=1)
make[1]: Leaving directory '/wsim/workflow'
make[1]: *** [Makefile:3: check] Error 1
make: *** [Makefile:6: check] Error 1
ERROR: Job failed: exit code 2