Document new params in lsm_results

2 jobs for add-results-vars in 17 minutes and 54 seconds
Status Job ID Name Coverage
  Build
passed #259498031
build

00:08:17

 
  Test
failed #259498033
test

00:09:37

 
Name Stage Failure
failed
test Test
AssertionError: 60 != 3

----------------------------------------------------------------------
Ran 13 tests in 1.947s

FAILED (failures=1, errors=8, skipped=1)
make[1]: *** [Makefile:3: check] Error 1
make: *** [Makefile:6: check] Error 1
ERROR: Job failed: exit code 2