401457 967966 525
855964 397020 525
537888 180546 470
923405 526684 525
670382 445499 509
800035 560030 509
643454 951863 525
238602 286132 407
984821 99789 525
916790 159230 525
779513 360099 509
910605 258488 525
987077 755354 525
181961 147702 383
447367 379649 449
310921 956856 525
89535 478969 449
37840 966065 525
667431 347526 509
154948 854421 525
786162 178465 509
284751 689784 509
64719 983049 525
548515 488783 470
698051 866406 525
235676 920025 525
325639 432855 449
633495 329416 509
858408 84590 525
459650 264142 449
187543 98527 383
894363 325217 525
686539 721916 504
941786 596099 525
527724 721648 509
961510 369457 525
865674 111322 525
804503 43725 509
947196 673410 525
966361 181631 525
52855 819103 509
700370 313513 509
222307 644780 509
599089 943738 525
504215 198993 449
275912 196201 443
975345 605985 525
651711 75289 509
581347 94117 470
7811 961223 525
307184 455326 449
157307 46007 383
951601 183420 525
35465 301756 443
181894 747770 509
127343 319168 443
31108 14822 308
734518 56988 509
65814 128487 354
18497 852362 525
55474 514344 470
26528 527362 470
842377 252780 525
716629 308588 509
86296 143794 375
605504 378080 470
148346 897147 525
667503 329505 509
8506 536614 470
328736 190392 443
405658 508050 449
281654 121779 443
947298 155346 525
387598 169042 443
625452 2734 470
747681 279892 509
659184 852158 525
426138 589307 470
860053 309578 525
318800 238753 407
730085 129225 509
582433 965696 525
192188 983144 525
910607 662495 525
120768 173845 383
577791 212608 470
354650 110962 443
826533 430328 509
172274 498374 449
814339 821928 450
36851 663769 509
770008 769157 393
960562 371752 525
763527 760166 380
490506 224139 449
405386 989531 525
221955 743603 509
527721 352739 470
852891 123585 525
74238 829739 509
516857 779399 509
635617 883683 525
239471 192708 443
523670 819479 509
82147 343422 443
712380 544321 509
327727 212636 443
926774 133009 525
56172 831977 509
540207 515111 439
787698 243456 509
334580 642355 509
677929 731669 504
420726 169795 449
449401 131258 449
31865 85794 351
644016 511924 509
881971 783249 525
11623 667216 509
204603 619131 470
743329 95315 509
524112 64561 470
393806 820025 509
818755 919788 525
218006 515492 470
755195 903001 525
386995 113184 443
929289 735670 525
663588 979054 525
621085 727535 509
25048 536716 470
241764 52067 443
554638 728398 509
825368 703159 504
664551 796154 504
72867 890778 525
24929 616941 470
210066 927584 525
746937 47387 509
327494 420365 449
229855 65677 386
543296 867466 525
475396 90800 449
940910 124037 525
843502 596311 525
323589 178289 443
295474 401811 441
709094 764349 424
177049 245222 443
146935 26278 375
134040 66507 354
259343 934930 525
876459 472535 525
117481 350671 443
957655 294043 525
401302 581535 470
506810 911648 525
762876 338366 509
582569 1925 470
188869 654055 509
182566 430964 449
806106 814595 406
346212 7898 443
270627 84073 443
707532 232579 509
757163 293857 509
733372 198330 509
717144 812910 468
975981 33511 525
216690 168723 386
929993 514883 525
852729 61628 525
988846 528823 525
247361 264689 407
305193 223043 443
772690 418456 509
709623 291782 509
720748 441171 509
948829 897292 507
440682 993238 525
432732 605194 470
191267 967887 525
946250 659181 525
513213 533234 439
656209 607145 509
885037 107666 525
450670 838671 525
174238 30219 383
981360 841155 507
315523 593612 470
180705 178937 365
664258 286615 509
209534 543625 470
906779 925272 476
117765 627511 509
146357 16724 375
444301 815042 509
868964 812641 525
301790 931270 525
27404 811215 509
548989 376903 470
42498 479206 449
491453 267115 449
293251 133945 443
410307 262953 449
328348 771165 509
124150 634308 509
774035 758566 468
320296 606432 470
39940 920014 525
235537 934680 525
678531 512673 509
598045 254078 470
920168 235094 525
425584 10179 449
908729 285947 525
36268 90778 351
336706 777865 509
67092 208264 383
830885 283024 509
427428 359648 449
5048 467340 449
195502 356736 443
895450 249407 525
985223 359642 525
642392 683685 442
556952 337177 470
533479 834718 509
460880 702549 509
433754 30553 449
955590 200921 525
584999 518574 452
198156 154147 383
206699 169934 365
633077 913319 525
828292 779152 468
890756 856723 445
444085 418270 418
652072 992158 525
426215 799592 509
690081 518798 509
201480 375415 443
314508 227605 443
143960 820039 509
118002 811470 509
224018 250287 443
598976 206391 470
225467 198804 386
717198 116668 509
997259 352393 525
712638 818083 468
131676 210906 383
383810 396219 436
353118 896286 525
485194 400358 449
806198 163007 509
15567 433671 449
148386 967346 525
446316 580350 470
27204 594114 470
962175 874819 507
868557 670686 525
629829 841287 525
304278 233570 407
290005 996776 525
662904 244381 509
404772 770497 509
140015 733943 509
114223 330379 443
733011 634805 504
867340 708252 525
458797 232647 449
393259 201594 443
830183 862386 525
940380 757162 525
862867 780482 525
749133 547921 509
287328 124250 443
