86 1771
739 6019
730 2200
401 8086
625 2642
696 5045
887 4184
983 8273
928 2923
194 8275
957 4281
54 7008
773 5535
603 9034
55 4332
8 1376
769 2231
267 3793
592 9157
160 2999
261 1565
306 5690
761 5639
114 5392
419 3405
11 7239
143 6191
205 9543
577 1862
78 3866
43 9246
264 7851
192 4270
262 8413
671 5929
613 4666
565 1779
325 6360
480 8018
512 5770
65 6069
709 4398
146 2024
376 2552
960 5285
472 5432
303 6675
745 4135
247 5450
787 6132
679 8368
280 5669
732 3592
475 3296
460 4593
600 4428
277 2095
394 1321
871 4666
477 4456
639 2548
817 5357
259 1330
576 2097
923 2983
218 4569
693 6053
677 6763
824 4215
498 2822
852 9809
149 5299
592 5658
141 4998
995 1574
287 8285
974 7182
162 8872
895 4384
902 5208
472 5666
995 2102
3 2673
586 8738
255 4722
337 3711
775 5991
68 8744
874 1177
512 7179
920 8914
141 8800
898 3542
870 6194
246 2134
429 4536
635 9139
323 5771
756 7878
67 1509
606 2914
148 2640
336 8225
220 3540
30 5550
922 3844
468 3037
112 3284
451 8100
383 7326
205 9538
330 7959
447 1625
658 6198
58 6856
137 1136
873 5594
106 6779
243 4497
647 8451
479 2064
655 3654
283 9144
460 4800
832 9533
449 3457
585 1618
742 6617
158 2477
900 9108
384 1339
58 6601
132 8091
721 8651
397 6066
772 8045
127 4580
909 6325
524 6223
458 4294
220 1127
34 2004
619 4043
992 9090
78 8957
938 1539
321 2958
73 7533
272 9307
748 2266
563 5955
428 8027
527 2848
834 8513
384 5757
926 2102
910 9976
833 6743
297 1437
457 1092
729 8208
79 3820
311 5745
355 7184
519 9358
812 3050
217 4620
41 7846
910 1803
97 9529
379 3296
122 7768
503 7806
399 7761
776 2767
820 4955
508 3517
835 6153
196 8558
859 7865
32 2933
34 8811
205 4697
382 8654
762 5178
14 5663
635 4297
367 6027
356 4470
374 2913
315 2520
474 7432
743 2586
40 1381
821 7169
607 6618
902 2754
689 4253
98 1542
873 5706
600 6717
943 3244
117 4131
621 4368
692 5677
814 3809
614 7555
172 7465
756 6896
481 3404
53 2885
907 1044
939 1741
