388102 524230
954871 68736
453763 244062
167833 718228
548924 574366
287704 475253
175805 613958
1084 693120
236974 526550
734753 610660
880691 530456
522891 840108
719899 206547
195728 592040
237952 85591
568320 569059
599949 573719
366655 915276
967475 145549
477961 132573
265305 515569
321385 705258
248659 585109
488327 945437
330174 332711
728247 888477
311114 793274
969953 224807
575757 459254
780277 895269
785757 933668
377259 537584
271617 829619
873021 300181
704388 702747
317511 158102
434935 344159
308855 140109
270916 928294
481400 747829
349863 885382
316046 491504
51097 302097
332058 622940
786587 153616
581312 467713
469164 836204
938415 981190
766907 517636
391499 717529
641911 728393
801816 75221
849199 328504
920439 289728
666996 845034
857567 823488
272969 278431
681209 458232
376422 507733
832310 610038
558120 16770
131012 891152
637648 880539
225238 364419
130827 748868
143233 737630
648306 208487
612843 200695
543114 604255
891124 294447
371238 963431
772503 974042
25247 13192
283422 225353
595025 489921
147283 925596
73472 201620
750368 535117
496658 412502
254299 281415
324710 950496
235394 858569
188495 386610
593909 31654
500666 372382
748013 382307
729038 446334
92298 119937
464145 546998
186093 196845
254378 634981
38458 473322
978783 601733
136571 189867
818077 169985
445635 84872
307214 402045
301928 7594
134809 598507
449441 414314
786378 357268
684031 812382
565061 838060
462449 140002
653855 845972
620556 925945
280271 635849
394997 974680
44540 299049
824008 393157
514892 764341
912850 265436
349349 643795
190840 744187
849341 17497
208287 905455
412294 773692
243415 107588
192303 279515
587284 165506
251268 559879
236620 961405
471624 959874
214645 159111
302881 37070
516962 812682
384816 632205
201002 488355
281244 242980
879795 32214
504563 647529
396611 633489
929298 333386
960105 899185
611394 912377
596095 397360
486713 541180
754124 157686
700727 791775
182161 493305
473685 943394
318246 947919
89632 782632
792475 700788
569931 86091
108034 180988
711920 153913
719059 231250
566974 502195
793891 951309
940649 474832
791826 616003
564855 967842
821171 15458
721162 876146
389835 200231
229768 718417
386712 212324
891918 857044
954398 435949
28956 409281
964207 638753
454818 566151
910495 406917
93270 271184
758366 894037
901884 388005
938139 788120
949482 152781
850948 207377
253765 311906
127244 697017
736465 767663
73113 505587
875393 454394
970154 476202
757546 608052
638999 80907
156903 971583
170953 713551
563581 703996
262953 789997
427201 710846
102331 51728
103819 443979
142599 708721
133651 244258
455220 715175
823828 214229
503384 197116
892591 541513
843079 141754
261156 244723
633389 629348
102366 743602
713121 32822
909358 550693
654065 62761
456902 166210
982939 447470
114658 845763
600413 960630
771549 27713
584586 694636
969883 218203
278969 632100
346590 298739
831342 838350
40505 561626
152625 688166
537477 533068
65101 247374
620282 402594
799247 172102
881293 482116
816311 682163
451500 454868
936695 282252
466763 407123
166842 752951
254049 896069
77975 265572
235163 582258
317946 460110
302643 95594
311495 751581
305871 649330
550544 582462
370253 130986
458056 889145
646136 902370
456941 429912
448982 676200
177139 603650
775573 832778
197725 598746
109883 290360
999490 729147
191529 436177
899579 670899
518053 534436
229726 569754
996756 754324
281323 733848
16415 471282
824756 49852
503322 207368
659324 102801
868180 857344
377984 574778
520495 44481
465266 20248
433158 409779
472139 249689
314807 588099
395177 636344
317151 120776
