<svg xmlns="http://www.w3.org/2000/svg" viewBox="0 0 24 24">
    <path d="M7 10L12 15L17 10" stroke-width="2" stroke="#616161" fill="none" stroke-linecap="square" stroke-linejoin="round"></path>
</svg>
