<svg xmlns="http://www.w3.org/2000/svg" viewBox="0 0 24 24">
    <path d="M20 4L4 20" stroke="currentColor" stroke-width="2" stroke-linecap="square" stroke-linejoin="round"/>
    <path d="M4 4L20 20" stroke="currentColor" stroke-width="2" stroke-linecap="square" stroke-linejoin="round"/>
</svg>
