<svg  viewBox="0 0 24 24" fill="currentColor" xmlns="http://www.w3.org/2000/svg">
<path d="M20.2929 21.7071L21 22.4142L22.4142 21L21.7071 20.2929L20.2929 21.7071ZM15.7071 14.2929L15 13.5858L13.5858 15L14.2929 15.7071L15.7071 14.2929ZM10 17V18V17ZM3 10H2H3ZM10 3V4V3ZM21.7071 20.2929L15.7071 14.2929L14.2929 15.7071L20.2929 21.7071L21.7071 20.2929ZM16 10C16 10.7879 15.8448 11.5681 15.5433 12.2961L17.391 13.0615C17.7931 12.0909 18 11.0506 18 10H16ZM15.5433 12.2961C15.2417 13.0241 14.7998 13.6855 14.2426 14.2426L15.6569 15.6569C16.3997 14.914 16.989 14.0321 17.391 13.0615L15.5433 12.2961ZM14.2426 14.2426C13.6855 14.7998 13.0241 15.2417 12.2961 15.5433L13.0615 17.391C14.0321 16.989 14.914 16.3997 15.6569 15.6569L14.2426 14.2426ZM12.2961 15.5433C11.5681 15.8448 10.7879 16 10 16V18C11.0506 18 12.0909 17.7931 13.0615 17.391L12.2961 15.5433ZM10 16C9.21207 16 8.43185 15.8448 7.7039 15.5433L6.93853 17.391C7.90914 17.7931 8.94943 18 10 18V16ZM7.7039 15.5433C6.97595 15.2417 6.31451 14.7998 5.75736 14.2426L4.34315 15.6569C5.08601 16.3997 5.96793 16.989 6.93853 17.391L7.7039 15.5433ZM5.75736 14.2426C5.20021 13.6855 4.75825 13.0241 4.45672 12.2961L2.60896 13.0615C3.011 14.0321 3.60028 14.914 4.34315 15.6569L5.75736 14.2426ZM4.45672 12.2961C4.15519 11.5681 4 10.7879 4 10H2C2 11.0506 2.20693 12.0909 2.60896 13.0615L4.45672 12.2961ZM4 10C4 8.4087 4.63214 6.88258 5.75736 5.75736L4.34315 4.34315C2.84285 5.84344 2 7.87827 2 10H4ZM5.75736 5.75736C6.88258 4.63214 8.4087 4 10 4V2C7.87827 2 5.84344 2.84285 4.34315 4.34315L5.75736 5.75736ZM10 4C11.5913 4 13.1174 4.63214 14.2426 5.75736L15.6569 4.34315C14.1566 2.84285 12.1217 2 10 2V4ZM14.2426 5.75736C15.3679 6.88258 16 8.4087 16 10H18C18 7.87827 17.1571 5.84344 15.6569 4.34315L14.2426 5.75736Z"/>
</svg>
