<svg  viewBox="0 0 24 24" fill="none" xmlns="http://www.w3.org/2000/svg">
<path d="M11.1381 3.46529C11.5247 2.80798 12.4753 2.80798 12.8619 3.46529L21.1135 17.493C21.5057 18.1596 21.025 19 20.2516 19H3.74842C2.975 19 2.49435 18.1596 2.88648 17.493L11.1381 3.46529Z" stroke="currentColor" stroke-width="2" stroke-linecap="round" stroke-linejoin="round"/>
<path d="M11.9999 7.99999L12 12M11.9999 16H12.0099" stroke="currentColor" stroke-width="2" stroke-linecap="square" stroke-linejoin="round"/>
</svg>
