<svg width="24" height="24" viewBox="0 0 24 24" fill="none" xmlns="http://www.w3.org/2000/svg">
<path d="M1 5C1 2.79086 2.79086 1 5 1H19C21.2091 1 23 2.79086 23 5V19C23 21.2091 21.2091 23 19 23H5C2.79086 23 1 21.2091 1 19V5Z" fill="#F03E3E"/>
<path d="M7 7L6 7L6 9L7 9L7 7ZM13.875 18L13.1679 18.7071C13.5584 19.0976 14.1916 19.0976 14.5821 18.7071L13.875 18ZM11.4571 14.1679L10.75 13.4608L9.33579 14.875L10.0429 15.5821L11.4571 14.1679ZM17.7071 15.5821L18.4142 14.875L17 13.4608L16.2929 14.1679L17.7071 15.5821ZM11.875 8V9V8ZM7 9L11.875 9L11.875 7L7 7L7 9ZM12.875 10V18H14.875V10H12.875ZM14.5821 17.2929L11.4571 14.1679L10.0429 15.5821L13.1679 18.7071L14.5821 17.2929ZM14.5821 18.7071L17.7071 15.5821L16.2929 14.1679L13.1679 17.2929L14.5821 18.7071ZM11.875 9C12.4273 9 12.875 9.44772 12.875 10H14.875C14.875 8.34315 13.5319 7 11.875 7L11.875 9Z" fill="white"/>
</svg>
