<svg viewBox="0 0 24 24" fill="none" stroke="currentColor" stroke-width="2" stroke-linecap="round" stroke-linejoin="round" xmlns="http://www.w3.org/2000/svg">
  <path d="M20 15V19C20 19.5523 19.5523 20 19 20H5C4.44772 20 4 19.5523 4 19V15" />
  <path d="M17 9L12 4L7 9" />
  <path d="M12 5V16" />
</svg>
