Division,WeightClassKg,Place,Name,Team,BodyweightKg,Best3SquatKg,Best3BenchKg,Best3DeadliftKg,TotalKg,Equipment,Event,Sex
Girls,44.23,1,Lauren Aldape,Mercedes,42.64,120.2,49.9,122.47,292.57,Single-ply,SBD,F
Girls,44.23,2,Arielle Ruiz,Edcouch-Elsa,43.54,102.06,45.36,99.79,247.21,Single-ply,SBD,F
Girls,44.23,3,Natalie Pruneda,Pharr Valley View,42.18,83.91,38.56,97.52,219.99,Single-ply,SBD,F
Girls,44.23,4,Maria Pro,PSJA Southwest,43.77,88.45,40.82,83.91,213.19,Single-ply,SBD,F
Girls,44.23,5,Breanna Rodriguez,Edinburg Vela,44,72.57,49.9,90.72,213.19,Single-ply,SBD,F
Girls,44.23,6,Johanna Torres,Donna,44,90.72,34.02,79.38,204.12,Single-ply,SBD,F
Girls,44.23,7,Tiffany Herrera,Edinburg Vela,44.23,74.84,36.29,86.18,197.31,Single-ply,SBD,F
Girls,44.23,8,Destiny Loredo,Edcouch-Elsa,42.86,70.31,27.22,86.18,183.7,Single-ply,SBD,F
Girls,44.23,9,Anna Herrera,Edinburg,41.28,52.16,24.95,54.43,131.54,Single-ply,SBD,F
Girls,47.85,1,Yliana Beltran,Donna,45.13,117.93,58.97,102.06,278.96,Single-ply,SBD,F
Girls,47.85,2,Evelyn Hernandez,Weslaco East,47.63,106.59,45.36,115.67,267.62,Single-ply,SBD,F
Girls,47.85,3,Valeria Pérez,Weslaco East,46.49,113.4,45.36,106.59,265.35,Single-ply,SBD,F
Girls,47.85,4,Stephanie Martinez,Weslaco East,47.63,106.59,45.36,95.25,247.21,Single-ply,SBD,F
Girls,47.85,5,Esmi Saldana,Brownsville Lopez,46.49,92.99,45.36,88.45,226.8,Single-ply,SBD,F
Girls,47.85,6,Brittany Salcido,PSJA Memorial,47.4,83.91,45.36,97.52,226.8,Single-ply,SBD,F
Girls,47.85,7,Itzel Garcia #2,PSJA Southwest,46.27,83.91,36.29,102.06,222.26,Single-ply,SBD,F
Girls,47.85,8,Destiney Garza,PSJA Southwest,46.49,79.38,36.29,95.25,210.92,Single-ply,SBD,F
Girls,47.85,9,Britney Arriaga,PSJA Southwest,47.17,83.91,38.56,88.45,210.92,Single-ply,SBD,F
Girls,47.85,10,Janira Gonzalez,Edinburg Vela,47.85,79.38,38.56,86.18,204.12,Single-ply,SBD,F
Girls,47.85,11,Dulce Ybanez,Edcouch-Elsa,45.36,92.99,34.02,74.84,201.85,Single-ply,SBD,F
Girls,47.85,12,Haley Leal,Edcouch-Elsa,47.85,72.57,31.75,83.91,188.24,Single-ply,SBD,F
Girls,47.85,13,Geneva Magallan,Edinburg North,46.72,43.09,24.95,52.16,120.2,Single-ply,SBD,F
Girls,47.85,DQ,Ashley Garza,Edinburg North,47.63,,,,,Single-ply,SBD,F
Girls,47.85,DQ,Alexis Rivas #2,Brownsville Lopez,47.17,124.74,,,,Single-ply,SBD,F
Girls,47.85,DQ,Andrea Mendoza,Donna North,46.63,81.65,,,,Single-ply,SBD,F
Girls,47.85,DQ,Giselle De La Garza,Pharr Valley View,47.63,111.13,43.09,,,Single-ply,SBD,F
Girls,51.94,1,Leena Salinas,Donna,50.58,127.01,49.9,136.08,312.98,Single-ply,SBD,F
Girls,51.94,2,Norma Vega,Brownsville Lopez,48.99,111.13,49.9,115.67,276.69,Single-ply,SBD,F
Girls,51.94,3,Kalista Solis,PSJA Southwest,51.94,120.2,43.09,92.99,256.28,Single-ply,SBD,F
Girls,51.94,4,Alina Corpus,PSJA,50.58,86.18,49.9,113.4,249.48,Single-ply,SBD,F
Girls,51.94,5,Lesley Perez,Donna North,51.26,88.45,54.43,95.25,238.14,Single-ply,SBD,F
Girls,51.94,6,Leah Juarez,Edcouch-Elsa,50.8,92.99,43.09,83.91,219.99,Single-ply,SBD,F
Girls,51.94,6,Jasmine Sanchez,Edcouch-Elsa,51.44,111.13,45.36,102.06,258.55,Single-ply,SBD,F
Girls,51.94,7,Amanda Cruz,PSJA Southwest,51.03,83.91,38.56,92.99,215.46,Single-ply,SBD,F
Girls,51.94,8,Brianna Gutierrez,Mercedes,50.58,83.91,36.29,92.99,213.19,Single-ply,SBD,F
Girls,51.94,9,Katie Hill,Edinburg,48.31,86.18,38.56,86.18,210.92,Single-ply,SBD,F
Girls,51.94,10,Jimena Diaz,Edinburg,49.21,74.84,31.75,79.38,185.97,Single-ply,SBD,F
Girls,51.94,11,Monserrat Collado,Pharr Valley View,51.71,70.31,31.75,65.77,167.83,Single-ply,SBD,F
Girls,51.94,DQ,America Navarro,Pharr Valley View,50.35,,,,,Single-ply,SBD,F
Girls,51.94,DQ,Tiffany Olvera,Pharr Valley View,50.58,,,,,Single-ply,SBD,F
Girls,56.02,1,Corina Yanez,Donna,53.3,140.61,68.04,136.08,344.73,Single-ply,SBD,F
Girls,56.02,2,Jenacy Avitia,Donna North,55.43,127.01,74.84,136.08,337.93,Single-ply,SBD,F
Girls,56.02,3,Danielle Rocha,Donna North,55.7,117.93,54.43,113.4,285.76,Single-ply,SBD,F
Girls,56.02,4,Odalys Serna,Edinburg Economedes,54.88,106.59,56.7,120.2,283.5,Single-ply,SBD,F
Girls,56.02,5,Kayla Medellin,San Benito,54.88,102.06,47.63,127.01,276.69,Single-ply,SBD,F
Girls,56.02,7,Kayla Trevino,Mercedes,54.43,108.86,36.29,106.59,251.74,Single-ply,SBD,F
Girls,56.02,8,Wendy Olivarez,Weslaco East,55.34,102.06,40.82,104.33,247.21,Single-ply,SBD,F
Girls,56.02,9,Jannay Garcia,Mercedes,55.34,92.99,43.09,102.06,238.14,Single-ply,SBD,F
Girls,56.02,10,Esmeralda Meza,PSJA Southwest,55.11,97.52,38.56,95.25,231.33,Single-ply,SBD,F
Girls,56.02,11,Maritza Espinoza,Donna North,54.88,92.99,45.36,90.72,229.06,Single-ply,SBD,F
Girls,56.02,12,Desirae Ary,Edinburg Vela,55.11,86.18,47.63,90.72,224.53,Single-ply,SBD,F
Girls,56.02,13,Mercedes Hernandez,PSJA Memorial,55.79,65.77,36.29,97.52,199.58,Single-ply,SBD,F
Girls,56.02,14,Luna Garcia,Pharr Valley View,53.07,61.23,38.56,86.18,185.97,Single-ply,SBD,F
Girls,56.02,DQ,Elizabeth Leal,Mercedes,56.02,,,,,Single-ply,SBD,F
Girls,56.02,DQ,Nora Cortez,PSJA Southwest,55.57,,,,,Single-ply,SBD,F
Girls,56.02,DQ,Kimberly Salas,Edinburg Vela,55.11,111.13,63.5,,,Single-ply,SBD,F
Girls,56.02,DQ,Veronica Alanis,Edinburg,55.34,,,,,Single-ply,SBD,F
Girls,56.02,DQ,Brianha Romo,Edinburg,52.84,45.36,,,,Single-ply,SBD,F
Girls,60.1,1,Nora Balladares,Edinburg,56.7,138.35,83.91,129.27,351.53,Single-ply,SBD,F
Girls,60.1,2,Cassie Perez,San Benito,59.87,133.81,72.57,122.47,328.85,Single-ply,SBD,F
Girls,60.1,3,Karen Martinez,Donna,59.87,136.08,52.16,138.35,326.59,Single-ply,SBD,F
Girls,60.1,4,Aleiyah Mireles,San Benito,60.1,124.74,58.97,136.08,319.78,Single-ply,SBD,F
Girls,60.1,5,Kassidy Sanchez,Mercedes,59.42,117.93,54.43,140.61,312.98,Single-ply,SBD,F
Girls,60.1,6,Jocelyn Martinez,Pharr Valley View,59.19,127.01,47.63,136.08,310.71,Single-ply,SBD,F
Girls,60.1,7,Carla Lopez,Brownsville Lopez,56.47,120.2,52.16,136.08,308.44,Single-ply,SBD,F
Girls,60.1,8,Destini Thomas,Donna,59.19,127.01,68.04,97.52,292.57,Single-ply,SBD,F
Girls,60.1,9,Abri Luna,San Benito,59.87,102.06,61.23,122.47,285.76,Single-ply,SBD,F
Girls,60.1,10,Janice Fan,Weslaco East,57.83,108.86,49.9,120.2,278.96,Single-ply,SBD,F
Girls,60.1,11,Susan Jaramillo,PSJA Memorial,59.87,97.52,49.9,115.67,263.08,Single-ply,SBD,F
Girls,60.1,12,Giselle Gomez,Edinburg North,59.42,104.33,43.09,99.79,247.21,Single-ply,SBD,F
Girls,60.1,13,Matilynn Lopez,PSJA Southwest,59.87,83.91,38.56,95.25,217.72,Single-ply,SBD,F
Girls,60.1,DQ,Mayra Yanez #2,San Benito,59.65,70.31,,,,Single-ply,SBD,F
Girls,60.1,DQ,Erin Quiroz,Edinburg Vela,60.1,,,,,Single-ply,SBD,F
Girls,67.36,1,Marisol Pulido,Brownsville Lopez,66,179.17,70.31,172.37,421.84,Single-ply,SBD,F
Girls,67.36,2,Lizeth De La Fuente,Brownsville Lopez,66,174.63,63.5,156.49,394.63,Single-ply,SBD,F
Girls,67.36,3,Amanda Olivarez #1,Donna North,64.5,147.42,79.38,145.15,371.95,Single-ply,SBD,F
Girls,67.36,4,Jennifer Cisneros,Brownsville Lopez,66.45,142.88,56.7,156.49,356.07,Single-ply,SBD,F
Girls,67.36,5,Deandra Flores,Edinburg Vela,62.82,124.74,74.84,129.27,328.85,Single-ply,SBD,F
Girls,67.36,6,Destiny Lozcano,Edcouch-Elsa,62.6,136.08,38.56,145.15,319.78,Single-ply,SBD,F
Girls,67.36,7,Josie Munoz,Weslaco East,64.64,136.08,56.7,111.13,303.91,Single-ply,SBD,F
Girls,67.36,8,Mireya Martinez,PSJA Memorial,61.92,108.86,63.5,120.2,292.57,Single-ply,SBD,F
Girls,67.36,9,Karla Diaz,Edinburg,61.01,99.79,70.31,102.06,272.16,Single-ply,SBD,F
Girls,67.36,10,Julissa Zuniga,San Benito,66,122.47,52.16,90.72,265.35,Single-ply,SBD,F
Girls,67.36,11,Natalia Marquez,Mercedes,62.82,104.33,43.09,111.13,258.55,Single-ply,SBD,F
Girls,67.36,12,Laura Gomez,PSJA Memorial,63.28,102.06,38.56,104.33,244.94,Single-ply,SBD,F
Girls,67.36,13,Raven Dena,Mercedes,65.09,86.18,36.29,95.25,217.72,Single-ply,SBD,F
Girls,67.36,14,Yvette Solis,Donna,63.05,81.65,36.29,77.11,195.04,Single-ply,SBD,F
Girls,67.36,15,Zaylin Cavazos,Edinburg North,65.09,61.23,31.75,70.31,163.29,Single-ply,SBD,F
Girls,67.36,DQ,Denielle Islas,Edinburg,67.36,99.79,,,,Single-ply,SBD,F
Girls,67.36,DQ,Claudia Rodriguez,Pharr Valley View,66.68,129.27,,,,Single-ply,SBD,F
Girls,67.36,DQ,Nicole Anderson,Pharr Valley View,66.9,,,,,Single-ply,SBD,F
Girls,75.07,1,Destany Guzman,Edinburg Vela,73.03,138.35,83.91,151.95,374.21,Single-ply,SBD,F
Girls,75.07,2,Jessica Saenz,Donna North,74.75,147.42,74.84,145.15,367.41,Single-ply,SBD,F
Girls,75.07,3,Jozlyn Lara,Edcouch-Elsa,72.57,138.35,61.23,136.08,335.66,Single-ply,SBD,F
Girls,75.07,4,Virginia Watkins,Edinburg Vela,74.62,142.88,61.23,124.74,328.85,Single-ply,SBD,F
Girls,75.07,5,Mackenzie Contreras,Edcouch-Elsa,75.07,142.88,61.23,124.74,328.85,Single-ply,SBD,F
Girls,75.07,6,Arrianna Guerra,Donna,73.26,122.47,58.97,136.08,317.51,Single-ply,SBD,F
Girls,75.07,7,Victoria Trevino,PSJA Memorial,73.26,129.27,65.77,115.67,310.71,Single-ply,SBD,F
Girls,75.07,8,Alex Estevanes,PSJA,72.35,124.74,54.43,108.86,288.03,Single-ply,SBD,F
Girls,75.07,9,Ashley Pena,PSJA Memorial,72.12,117.93,54.43,108.86,281.23,Single-ply,SBD,F
Girls,75.07,10,Lorena Martinez,Edinburg Economedes,68.95,113.4,52.16,113.4,278.96,Single-ply,SBD,F
Girls,75.07,11,Leslie Palomares,Donna North,74.98,99.79,63.5,113.4,276.69,Single-ply,SBD,F
Girls,75.07,12,Mitzi de la Cruz,Edinburg Economedes,70.08,102.06,49.9,108.86,260.82,Single-ply,SBD,F
Girls,75.07,13,Gabrielle Featherstone,Edinburg,73.03,104.33,52.16,102.06,258.55,Single-ply,SBD,F
Girls,75.07,14,Cassy Maldonado,PSJA Southwest,73.03,97.52,54.43,92.99,244.94,Single-ply,SBD,F
Girls,75.07,15,Maricela Ramos,Edinburg North,73.48,102.06,31.75,102.06,235.87,Single-ply,SBD,F
Girls,75.07,16,Marisol Sauceda,Edinburg Economedes,69.17,83.91,34.02,88.45,206.38,Single-ply,SBD,F
Girls,75.07,17,Zayra Cavazos,Edinburg North,73.03,63.5,43.09,97.52,204.12,Single-ply,SBD,F
Girls,75.07,DQ,Alena Pena,Edinburg North,70.76,,,,,Single-ply,SBD,F
Girls,75.07,DQ,Lizbeth Rodriguez,Edcouch-Elsa,71.67,113.4,,,,Single-ply,SBD,F
Girls,75.07,DQ,Leanna Ramirez,San Benito,72.8,183.7,,,,Single-ply,SBD,F
Girls,82.33,1,Alyssa Juarez,Weslaco East,79.61,163.29,83.91,138.35,385.55,Single-ply,SBD,F
Girls,82.33,2,Katherine Garza,Edinburg Vela,80.29,147.42,79.38,145.15,371.95,Single-ply,SBD,F
Girls,82.33,3,Selena Martinez,Edinburg Economedes,78.93,142.88,61.23,142.88,347,Single-ply,SBD,F
Girls,82.33,4,Esmer Valdez,PSJA Southwest,80.06,136.08,74.84,117.93,328.85,Single-ply,SBD,F
Girls,82.33,5,Jamie Cisneros,Edinburg,79.61,120.2,92.99,108.86,322.05,Single-ply,SBD,F
Girls,82.33,6,Nicole Ozuna,Edinburg Vela,82.33,108.86,72.57,102.06,283.5,Single-ply,SBD,F
Girls,82.33,7,Audrey Estevanes,PSJA,80.06,92.99,52.16,113.4,258.55,Single-ply,SBD,F
Girls,82.33,8,Kayla Cox,Edinburg North,78.93,88.45,47.63,113.4,249.48,Single-ply,SBD,F
Girls,82.33,9,Natalie Maldonado,PSJA Memorial,78.47,95.25,45.36,102.06,242.67,Single-ply,SBD,F
Girls,82.33,10,Brittany Garza,Donna,80.51,90.72,47.63,88.45,226.8,Single-ply,SBD,F
Girls,82.33,11,Ruby Martinez #1,PSJA Memorial,81.42,86.18,40.82,92.99,219.99,Single-ply,SBD,F
Girls,82.33,DQ,Aaliyah Garcia,Edinburg North,78.7,,,,,Single-ply,SBD,F
Girls,82.33,DQ,Dalihla Cuevas,Edinburg,80.29,113.4,,,,Single-ply,SBD,F
Girls,90.04,1,Destinee Perez,Mercedes,87.54,142.88,56.7,142.88,342.46,Single-ply,SBD,F
Girls,90.04,2,Kaylee Lopez,Donna,84.14,138.35,63.5,136.08,337.93,Single-ply,SBD,F
Girls,90.04,3,Tiffani Gonzalez,Donna North,89.86,127.01,74.84,129.27,331.12,Single-ply,SBD,F
Girls,90.04,4,Sofia Lopez,Edinburg,88.22,124.74,65.77,131.54,322.05,Single-ply,SBD,F
Girls,90.04,5,Landry Munoz,Weslaco East,89.58,129.27,58.97,120.2,308.44,Single-ply,SBD,F
Girls,90.04,6,Kayla Cantu,Edinburg Vela,89.13,127.01,77.11,102.06,306.17,Single-ply,SBD,F
Girls,90.04,7,Caroline Hernandez,San Benito,87.32,113.4,68.04,115.67,297.1,Single-ply,SBD,F
Girls,90.04,8,Martha Reyes,PSJA Southwest,89.36,115.67,56.7,113.4,285.76,Single-ply,SBD,F
Girls,90.04,9,Ester Martinez,PSJA Memorial,89.58,97.52,56.7,97.52,251.74,Single-ply,SBD,F
Girls,90.04,DQ,Mariela Hefferon,Pharr Valley View,86.18,72.57,,,,Single-ply,SBD,F
Girls,90.04,DQ,Amabella Gonzalez,Pharr Valley View,85.96,,,,,Single-ply,SBD,F
Girls,100.02,1,Lupita Lerma,San Benito,99.79,183.7,79.38,138.35,401.43,Single-ply,SBD,F
Girls,100.02,2,Sadie Granados,Edcouch-Elsa,92.53,151.95,70.31,151.95,374.21,Single-ply,SBD,F
Girls,100.02,3,Damarys Salazar,Donna North,98.61,142.88,86.18,136.08,365.14,Single-ply,SBD,F
Girls,100.02,4,Leslie Villela,Donna North,92.8,54.43,49.9,108.86,213.19,Single-ply,SBD,F
Girls,100.02,DQ,Jennifer Azuna,Edinburg North,93.44,99.79,,,,Single-ply,SBD,F
Girls,100.02,DQ,Benda Lopez,Pharr Valley View,95.71,,,,,Single-ply,SBD,F
Girls,117.71,1,Ashley Tapia,PSJA,104.78,190.51,81.65,167.83,439.98,Single-ply,SBD,F
Girls,117.71,2,Jazzmine Barrera,Edcouch-Elsa,105.23,142.88,70.31,124.74,337.93,Single-ply,SBD,F
Girls,117.71,3,Elidia Flores,Edinburg North,108.18,99.79,43.09,113.4,256.28,Single-ply,SBD,F
Girls,117.71,DQ,Roxanne Martinez,Donna,102.74,,,,,Single-ply,SBD,F
Girls,117.71,DQ,Mariah Padron,Donna,104.55,,,,,Single-ply,SBD,F
Girls,117.71+,1,Marlene Martinez,Edinburg Economedes,123.83,172.37,92.99,136.08,401.43,Single-ply,SBD,F
Girls,117.71+,DQ,Anyssa Arellano,Edinburg North,122.02,,,,,Single-ply,SBD,F
Girls,117.71+,DQ,Victoria Casares,Donna,123.83,,,,,Single-ply,SBD,F
