Division,WeightClassKg,Place,Name,Team,BodyweightKg,Best3SquatKg,Best3BenchKg,Best3DeadliftKg,TotalKg,Equipment,Event,Sex,BirthDate
Boys,51.71,1,Conner Myrow,Pittsburg,50.62,115.67,70.31,120.2,306.17,Unlimited,SBD,M,
Boys,51.71,2,Evin Mauldin,Bogata Rivercrest,51.35,97.52,68.04,108.86,274.42,Unlimited,SBD,M,
Boys,51.71,3,Gage Brumit,Lone Oak,44.81,88.45,43.09,83.91,215.46,Unlimited,SBD,M,
Boys,55.79,1,Carlos Flores,Quitman,52.89,208.65,136.08,172.37,517.1,Unlimited,SBD,M,
Boys,55.79,2,Juan Ordorica,Winona,55.7,156.49,106.59,174.63,437.72,Unlimited,SBD,M,
Boys,55.79,3,Ramiro Reyes,Pittsburg,54.79,104.33,65.77,131.54,301.64,Unlimited,SBD,M,
Boys,55.79,DQ,Dakota Brown,Quitman,54.98,,,,,Unlimited,SBD,M,
Boys,59.87,1,Brody Perschbacher,Pittsburg,58.97,142.88,97.52,138.35,378.75,Unlimited,SBD,M,
Boys,59.87,2,Luis Pacheco,Palestine,57.06,136.08,63.5,140.61,340.19,Unlimited,SBD,M,
Boys,59.87,3,Joshua Roquez,Bogata Rivercrest,59.78,92.99,61.23,115.67,269.89,Unlimited,SBD,M,
Boys,59.87,4,Josh Waters,Pittsburg,58.79,92.99,52.16,111.13,256.28,Unlimited,SBD,M,
Boys,67.13,1,Jordan Pullum,Winona,66.77,185.97,120.2,188.24,494.42,Unlimited,SBD,M,
Boys,67.13,2,Jace Harrod,Palestine,60.51,179.17,115.67,176.9,471.74,Unlimited,SBD,M,
Boys,67.13,3,Cooper Perry,Palestine,66.68,181.44,95.25,181.44,458.13,Unlimited,SBD,M,
Boys,67.13,4,Max Ramirez,Lone Oak,60.42,181.44,115.67,158.76,455.86,Unlimited,SBD,M,
Boys,67.13,5,Jared Hernandez,Winona,66.41,176.9,104.33,172.37,453.59,Unlimited,SBD,M,
Boys,67.13,6,Aidan Gonzalez,Jacksonville,66.5,158.76,124.74,170.1,453.59,Unlimited,SBD,M,
Boys,67.13,7,Manny Monterosa,Palestine,61.96,163.29,102.06,185.97,451.32,Unlimited,SBD,M,
Boys,67.13,8,Cannon Miller,Wolfe City,63.87,170.1,113.4,165.56,449.06,Unlimited,SBD,M,
Boys,67.13,9,Ben Howell,Lone Oak,62.69,170.1,88.45,176.9,435.45,Unlimited,SBD,M,
Boys,67.13,10,Hayden Thomas,Lone Oak,66.95,170.1,102.06,161.03,433.18,Unlimited,SBD,M,
Boys,67.13,11,Nick Counts,Lone Oak,61.78,167.83,79.38,165.56,412.77,Unlimited,SBD,M,
Boys,67.13,12,Micah Green,Palestine,65.41,156.49,90.72,165.56,412.77,Unlimited,SBD,M,
Boys,67.13,13,Cain Ingram,Quitman,62.51,158.76,86.18,165.56,410.5,Unlimited,SBD,M,
Boys,67.13,14,Steven Turbyfill,Malakoff Cross Roads,64.41,142.88,81.65,181.44,405.97,Unlimited,SBD,M,
Boys,67.13,15,Kaiden Butler,Pittsburg,65.32,147.42,90.72,165.56,403.7,Unlimited,SBD,M,
Boys,67.13,16,Tony Mondono,Jacksonville,65.77,145.15,95.25,163.29,403.7,Unlimited,SBD,M,
Boys,67.13,17,Victor Angel,Winona,65.95,154.22,88.45,156.49,399.16,Unlimited,SBD,M,
Boys,67.13,18,Yahir Morales,Winona,62.51,140.61,83.91,154.22,378.75,Unlimited,SBD,M,
Boys,67.13,19,Boston Beasley,Jacksonville,64.68,124.74,72.57,167.83,365.14,Unlimited,SBD,M,
Boys,67.13,20,Daniel Barahona,Lone Oak,65.23,142.88,77.11,145.15,365.14,Unlimited,SBD,M,
Boys,67.13,21,Derek Cannon,Hawkins,67.04,136.08,83.91,138.35,358.34,Unlimited,SBD,M,
Boys,67.13,22,Joseph Roquez,Bogata Rivercrest,60.96,124.74,74.84,145.15,344.73,Unlimited,SBD,M,
Boys,67.13,23,Seth Escobar,Pittsburg,64.68,124.74,83.91,124.74,333.39,Unlimited,SBD,M,
Boys,67.13,24,Edgar Izaguirre,Malakoff Cross Roads,65.41,102.06,56.7,142.88,301.64,Unlimited,SBD,M,
Boys,67.13,25,John Wilson,Wolfe City,62.78,115.67,65.77,117.93,299.37,Unlimited,SBD,M,
Boys,74.84,1,Jordan Vickers,Pittsburg,74.84,199.58,124.74,219.99,544.31,Unlimited,SBD,M,
Boys,74.84,2,Morgan Cruces,Lone Oak,73.03,226.8,120.2,174.63,521.63,Unlimited,SBD,M,
Boys,74.84,3,Lurbryson Ross,Winona,73.3,192.78,129.27,188.24,510.29,Unlimited,SBD,M,
Boys,74.84,4,Chance Jowers,Canton,74.21,190.51,99.79,192.78,483.08,Unlimited,SBD,M,
Boys,74.84,5,Timothy Ryals,Frankston,74.57,183.7,102.06,190.51,476.27,Unlimited,SBD,M,
Boys,74.84,6,Hayden Harris,Malakoff Cross Roads,73.12,165.56,113.4,183.7,462.66,Unlimited,SBD,M,
Boys,74.84,7,Jacob Navarro,Wolfe City,71.3,179.17,77.11,179.17,435.45,Unlimited,SBD,M,
Boys,74.84,8,Aaron Garcia,Pittsburg,73.12,151.95,92.99,172.37,417.3,Unlimited,SBD,M,
Boys,74.84,9,Jose de la Rosa,Palestine,69.67,142.88,106.59,158.76,408.23,Unlimited,SBD,M,
Boys,74.84,10,Lance Taylor,Bogata Rivercrest,69.94,158.76,86.18,149.69,394.63,Unlimited,SBD,M,
Boys,74.84,11,Lane Supac,Malakoff Cross Roads,73.75,136.08,83.91,163.29,383.29,Unlimited,SBD,M,
Boys,74.84,12,Jeovanny Hernandez,New Summerfield,69.58,113.4,72.57,129.27,315.25,Unlimited,SBD,M,
Boys,74.84,13,Mateo Valdez,Lone Oak,70.03,117.93,65.77,131.54,315.25,Unlimited,SBD,M,
Boys,74.84,DQ,Adriano Vazquez,Palestine,72.39,192.78,,,,Unlimited,SBD,M,
Boys,74.84,DQ,Isiah Hill,Palestine,71.76,170.1,,,,Unlimited,SBD,M,
Boys,82.1,1,Jhony Martinez,Palestine,81.56,219.99,154.22,226.8,601.01,Unlimited,SBD,M,
Boys,82.1,2,Ben Boisclair,Quitman,76.48,208.65,120.2,206.38,535.24,Unlimited,SBD,M,
Boys,82.1,3,Zach Reagan,Palestine,75.39,195.04,111.13,226.8,532.97,Unlimited,SBD,M,
Boys,82.1,4,Tyson Hampton,Lone Oak,82.1,226.8,111.13,195.04,532.97,Unlimited,SBD,M,
Boys,82.1,5,Marcus Rinehart,Hawkins,79.56,181.44,129.27,181.44,492.15,Unlimited,SBD,M,
Boys,82.1,6,Levi White,Frankston,81.01,195.04,111.13,172.37,478.54,Unlimited,SBD,M,
Boys,82.1,7,Jacob Breding,Quitman,77.75,176.9,124.74,170.1,471.74,Unlimited,SBD,M,
Boys,82.1,8,Warren Richardson,Wolfe City,79.65,170.1,108.86,170.1,449.06,Unlimited,SBD,M,
Boys,82.1,9,Jones Elbe,Jacksonville,77.2,145.15,104.33,174.63,424.11,Unlimited,SBD,M,
Boys,82.1,10,Jesse Johnson,Lone Oak,81.92,142.88,81.65,154.22,378.75,Unlimited,SBD,M,
Boys,82.1,DQ,Jacob McClanahan,Lone Oak,81.28,147.42,81.65,,,Unlimited,SBD,M,
Boys,82.1,DQ,Tristan Williamson,Hawkins,80.74,208.65,,,,Unlimited,SBD,M,
Boys,89.81,1,Troy Conley,Hawkins,87.63,208.65,142.88,204.12,555.65,Unlimited,SBD,M,
Boys,89.81,2,Clayton Wallace,Lone Oak,89.63,210.92,138.35,190.51,539.77,Unlimited,SBD,M,
Boys,89.81,3,Jackson Daniels,Tyler All Saints Episcopal School,86.18,156.49,90.72,181.44,428.64,Unlimited,SBD,M,
Boys,89.81,4,Brody Gardner,Wolfe City,84.64,170.1,97.52,154.22,421.84,Unlimited,SBD,M,
Boys,89.81,5,Riley Crump,Wolfe City,88,120.2,79.38,151.95,351.53,Unlimited,SBD,M,
Boys,89.81,6,Nathan Comte,New Summerfield,88,136.08,68.04,131.54,335.66,Unlimited,SBD,M,
Boys,89.81,7,Alan Aguilar,Lone Oak,88.63,117.93,74.84,138.35,331.12,Unlimited,SBD,M,
Boys,89.81,DQ,Mason Boggs,Frankston,85.73,179.17,,,,Unlimited,SBD,M,
Boys,99.79,1,Gage Sanders,Wolfe City,97.98,213.19,147.42,204.12,564.72,Unlimited,SBD,M,
Boys,99.79,2,Isley Jackson,Hawkins,98.34,215.46,138.35,204.12,557.92,Unlimited,SBD,M,
Boys,99.79,3,Kevin Zamora,Palestine,91.63,219.99,113.4,197.31,530.7,Unlimited,SBD,M,
Boys,99.79,4,Cade Papez,Quitman,98.07,183.7,124.74,195.04,503.49,Unlimited,SBD,M,
Boys,99.79,5,Eli Dodd,Bogata Rivercrest,91.9,176.9,111.13,188.24,476.27,Unlimited,SBD,M,
Boys,99.79,6,Ty Lindsey,Jacksonville,92.9,176.9,111.13,179.17,467.2,Unlimited,SBD,M,
Boys,99.79,7,Aiden Samples,Wolfe City,93.44,190.51,102.06,172.37,464.93,Unlimited,SBD,M,
Boys,99.79,8,Garret Stedman,Palestine,90.81,158.76,120.2,183.7,462.66,Unlimited,SBD,M,
Boys,99.79,9,Daniel García,Wolfe City,94.26,183.7,117.93,158.76,460.4,Unlimited,SBD,M,
Boys,99.79,DQ,Zachary Suggs,Hawkins,98.52,158.76,111.13,,,Unlimited,SBD,M,
Boys,99.79,DQ,Caelan Soultanov,Jacksonville,93.35,183.7,131.54,,,Unlimited,SBD,M,
Boys,109.77,1,Cason McBride,Lone Oak,102.42,247.21,140.61,233.6,621.42,Unlimited,SBD,M,
Boys,109.77,2,Cameron Johnson,Hawkins,105.69,229.06,181.44,181.44,591.94,Unlimited,SBD,M,
Boys,109.77,3,Hunter Martin,Tyler All Saints Episcopal School,109.68,206.38,127.01,231.33,564.72,Unlimited,SBD,M,
Boys,109.77,4,Damion Joiner,Canton,106.41,210.92,120.2,217.72,548.85,Unlimited,SBD,M,
Boys,109.77,5,Alex Ramirez,Jacksonville,105.51,204.12,113.4,215.46,532.97,Unlimited,SBD,M,
Boys,109.77,6,Travis Scott,Lone Oak,102.69,172.37,147.42,181.44,501.22,Unlimited,SBD,M,
Boys,109.77,7,Isaac Diaz,Tyler All Saints Episcopal School,102.78,195.04,102.06,183.7,480.81,Unlimited,SBD,M,
Boys,109.77,8,Paxton Johnson,Jacksonville,108.77,183.7,102.06,192.78,478.54,Unlimited,SBD,M,
Boys,109.77,9,Mj Rose,Hawkins,107.59,183.7,117.93,172.37,474,Unlimited,SBD,M,
Boys,109.77,10,Guillermo Vargas,New Summerfield,108.86,181.44,102.06,185.97,469.47,Unlimited,SBD,M,
Boys,109.77,11,Peyton Hernandez,Tyler All Saints Episcopal School,104.24,167.83,102.06,190.51,460.4,Unlimited,SBD,M,
Boys,109.77,12,Tristan Mathews,Hawkins,101.7,156.49,97.52,145.15,399.16,Unlimited,SBD,M,
Boys,109.77,13,Daniel McDonald,Bogata Rivercrest,101.97,124.74,102.06,145.15,371.95,Unlimited,SBD,M,
Boys,109.77,DQ,Owen Mann,Lone Oak,103.06,133.81,,,,Unlimited,SBD,M,
Boys,124.74,1,Raphael Foy,Jacksonville,119.2,249.48,154.22,272.16,675.85,Unlimited,SBD,M,
Boys,124.74,2,Calvin Boyd,Jacksonville,121.38,240.4,167.83,231.33,639.57,Unlimited,SBD,M,
Boys,124.74,3,Alex Puentes,Wolfe City,114.58,238.14,183.7,183.7,605.55,Unlimited,SBD,M,
Boys,124.74,4,Brayden Dotson,Frankston,121.74,254.01,142.88,208.65,605.55,Unlimited,SBD,M,
Boys,124.74,5,Hunter Heacox,Malakoff Cross Roads,110.77,204.12,156.49,235.87,596.47,Unlimited,SBD,M,
Boys,124.74,6,Jase Williams,Wolfe City,121.2,206.38,136.08,190.51,532.97,Unlimited,SBD,M,
Boys,124.74,7,Cody Killgo,Wolfe City,120.66,204.12,136.08,172.37,512.56,Unlimited,SBD,M,
Boys,124.74,8,Nick Martinez,Winona,110.31,197.31,124.74,181.44,503.49,Unlimited,SBD,M,
Boys,124.74,9,David Alvarado,Malakoff Cross Roads,120.11,197.31,111.13,181.44,489.88,Unlimited,SBD,M,
Boys,124.74,10,Landon Skinner,Malakoff Cross Roads,113.4,154.22,92.99,188.24,435.45,Unlimited,SBD,M,
Boys,124.74,11,Joseph Villareal,Winona,124.38,147.42,92.99,165.56,405.97,Unlimited,SBD,M,
Boys,124.74,DQ,Steven Long,Frankston,112.4,244.94,,,,Unlimited,SBD,M,
Boys,139.71,1,Jiovann Rangel,Jacksonville,130.91,210.92,131.54,215.46,557.92,Unlimited,SBD,M,
Boys,139.71,2,Braxton Chenney,Bogata Rivercrest,130.73,226.8,122.47,192.78,542.04,Unlimited,SBD,M,
Boys,139.71,DQ,Michael Hipp,Quitman,125.55,,,,,Unlimited,SBD,M,
Boys,139.71+,1,Julian Griffin,Hawkins,158.3,233.6,142.88,204.12,580.6,Unlimited,SBD,M,
Boys,139.71+,2,Eli Hearn,Quitman,139.8,204.12,127.01,206.38,537.51,Unlimited,SBD,M,
Boys,139.71+,DQ,Julian Garcia,Palestine,144.61,249.48,,,,Unlimited,SBD,M,
Boys,,NS,Jose Herrera-Flores,Pittsburg,,,,,,Unlimited,SBD,M,
Boys,,NS,Ronnie Williams,Palestine,,,,,,Unlimited,SBD,M,
Boys,,NS,Alex Gaspar,Pittsburg,,,,,,Unlimited,SBD,M,
Boys,,NS,Javonte Smith,Pittsburg,,,,,,Unlimited,SBD,M,
Boys,,NS,Jaxon Durham,Canton,,,,,,Unlimited,SBD,M,
Boys,,NS,Croix Hesskew,Canton,,,,,,Unlimited,SBD,M,
Boys,,NS,Ayden Lewis,Frankston,,,,,,Unlimited,SBD,M,
Boys,,NS,Colton Watson,Tyler All Saints Episcopal School,,,,,,Unlimited,SBD,M,
Boys,,NS,Aiden Rogers,Hawkins,,,,,,Unlimited,SBD,M,
Boys,,NS,Camden Norris,Lone Oak,,,,,,Unlimited,SBD,M,
Boys,,NS,Raul Munoz,New Summerfield,,,,,,Unlimited,SBD,M,
