Division,WeightClassKg,Place,Name,Team,BodyweightKg,Best3SquatKg,Best3BenchKg,Best3DeadliftKg,TotalKg,Equipment,Event,Sex,BirthDate
Boys,51.71,1,Colby Murphey,Ponder,51.71,147.42,86.18,154.22,387.82,Unlimited,SBD,M,
Boys,51.71,2,Subha Karki,Keller Central,51.44,115.67,52.16,92.99,260.82,Unlimited,SBD,M,
Boys,51.71,3,Andre Nordie,Ponder,50.35,97.52,45.36,95.25,238.14,Unlimited,SBD,M,
Boys,51.71,DQ,Conner Barree,Keller Central,49.9,61.23,43.09,102.06,,Unlimited,SBD,M,
Boys,55.79,1,Gabriel Morse,Keller Central,55.7,145.15,81.65,124.74,351.53,Unlimited,SBD,M,
Boys,55.79,2,Caden Murphy,Ponder,55.61,127.01,68.04,124.74,319.78,Unlimited,SBD,M,
Boys,55.79,3,Thomas Cole Langham,Keller,54.34,102.06,88.45,124.74,315.25,Unlimited,SBD,M,
Boys,55.79,4,Aaron Kurien,Keller Fossil Ridge,53.98,92.99,38.56,115.67,247.21,Unlimited,SBD,M,
Boys,55.79,5,Kaiis Garza,Keller Fossil Ridge,52.16,72.57,52.16,92.99,217.72,Unlimited,SBD,M,
Boys,55.79,DQ,Cesar Gonzalez,Keller Fossil Ridge,55.34,74.84,61.23,102.06,,Unlimited,SBD,M,
Boys,55.79,DQ,Connor McWilliams,Keller Timber Creek,55.34,115.67,70.31,133.81,,Unlimited,SBD,M,
Boys,59.87,1,Jordan Brown,Keller Central,58.79,183.7,90.72,172.37,446.79,Unlimited,SBD,M,
Boys,59.87,2,LaMond Allison,Carrollton Smith,59.69,156.49,90.72,172.37,419.57,Unlimited,SBD,M,
Boys,59.87,3,Aiden Garza,Keller,58.83,140.61,97.52,156.49,394.63,Unlimited,SBD,M,
Boys,59.87,DQ,Alex Dragon,Keller Timber Creek,58.97,104.33,58.97,120.2,,Unlimited,SBD,M,
Boys,59.87,DQ,Jayden Thompson,Keller Fossil Ridge,58.06,74.84,52.16,92.99,,Unlimited,SBD,M,
Boys,67.13,1,Ace Akins,Keller Timber Creek,66.68,195.04,117.93,185.97,498.95,Unlimited,SBD,M,
Boys,67.13,2,Kendreich Scheving,Keller Fossil Ridge,67.13,192.78,127.01,174.63,494.42,Unlimited,SBD,M,
Boys,67.13,3,Guy Gonzales,Keller,66.22,170.1,124.74,167.83,462.66,Unlimited,SBD,M,
Boys,67.13,4,Kaleb Pozzani,Keller Timber Creek,64.86,151.95,86.18,142.88,381.02,Unlimited,SBD,M,
Boys,67.13,5,Alex Proctor,Keller,63.05,122.47,77.11,129.27,328.85,Unlimited,SBD,M,
Boys,67.13,6,Caylen Turner,Keller Fossil Ridge,60.78,97.52,49.9,117.93,265.35,Unlimited,SBD,M,
Boys,67.13,DQ,Harrison Malone,Keller,67.13,111.13,79.38,120.2,,Unlimited,SBD,M,
Boys,67.13,DQ,Javier Pierre,Keller,67.13,138.35,108.86,179.17,,Unlimited,SBD,M,
Boys,74.84,1,Kale Jones,Ponder,74.03,242.67,142.88,206.38,591.94,Unlimited,SBD,M,
Boys,74.84,2,Nathan Giddons,Keller Timber Creek,73.94,231.33,140.61,217.72,589.67,Unlimited,SBD,M,
Boys,74.84,3,Nick Luangrath,Keller Central,72.94,238.14,147.42,201.85,587.4,Unlimited,SBD,M,
Boys,74.84,4,Logan Deal,Keller,74.8,217.72,151.95,215.46,585.13,Unlimited,SBD,M,
Boys,74.84,5,Cristian Olmedo,Carrollton Smith,70.76,208.65,106.59,174.63,489.88,Unlimited,SBD,M,
Boys,74.84,6,Bentley Thao,Keller Fossil Ridge,74.84,174.63,102.06,161.03,437.72,Unlimited,SBD,M,
Boys,74.84,7,Cole Caldwell,Keller,74.84,149.69,102.06,163.29,415.04,Unlimited,SBD,M,
Boys,74.84,8,Thomas Huerta,Keller,70.49,136.08,113.4,158.76,408.23,Unlimited,SBD,M,
Boys,74.84,9,Cole DeKok,Keller,73.03,156.49,92.99,149.69,399.16,Unlimited,SBD,M,
Boys,74.84,10,Ivan Dominguez,Keller Fossil Ridge,70.76,124.74,79.38,149.69,353.8,Unlimited,SBD,M,
Boys,74.84,11,Anderson Starr,Keller,68.76,131.54,81.65,122.47,335.66,Unlimited,SBD,M,
Boys,74.84,12,Jamison Penn,Keller Fossil Ridge,71.67,106.59,61.23,129.27,297.1,Unlimited,SBD,M,
Boys,74.84,DQ,Samuel Tschacher,Keller Central,74.03,124.74,83.91,106.59,,Unlimited,SBD,M,
Boys,74.84,DQ,Jyotparkash Singh,Keller Fossil Ridge,70.31,61.23,63.5,92.99,,Unlimited,SBD,M,
Boys,74.84,DQ,Jerry Gray,Keller Fossil Ridge,68.04,68.04,38.56,90.72,,Unlimited,SBD,M,
Boys,74.84,DQ,Gabe Nunes,Keller Central,74.84,170.1,102.06,183.7,,Unlimited,SBD,M,
Boys,74.84,DQ,Khaidon Vorabout,Keller Fossil Ridge,68.04,142.88,83.91,129.27,,Unlimited,SBD,M,
Boys,82.1,1,Christian Perez,Keller Central,81.74,233.6,188.24,251.74,673.58,Unlimited,SBD,M,
Boys,82.1,2,Luis Huerta,Keller,81.37,201.85,151.95,244.94,598.74,Unlimited,SBD,M,
Boys,82.1,3,Kaleb Rothman,Keller Central,80.83,251.74,147.42,197.31,596.47,Unlimited,SBD,M,
Boys,82.1,4,Isaac Maldonado,Keller Central,81.65,242.67,145.15,208.65,596.47,Unlimited,SBD,M,
Boys,82.1,5,Michael Reinoshek,Keller Fossil Ridge,78.93,201.85,129.27,192.78,523.9,Unlimited,SBD,M,
Boys,82.1,6,Colin Bruce,Keller Timber Creek,78.02,188.24,113.4,183.7,485.34,Unlimited,SBD,M,
Boys,82.1,7,Cyle Papa,Keller Timber Creek,80.74,158.76,120.2,183.7,462.66,Unlimited,SBD,M,
Boys,82.1,8,Kanye Price,Keller Fossil Ridge,79.38,165.56,120.2,172.37,458.13,Unlimited,SBD,M,
Boys,82.1,9,Charel Tshibangu,Keller Fossil Ridge,80.29,185.97,115.67,156.49,458.13,Unlimited,SBD,M,
Boys,82.1,10,Weston Smith,Keller Fossil Ridge,80.29,142.88,108.86,147.42,399.16,Unlimited,SBD,M,
Boys,82.1,11,Thando Moyo,Keller Fossil Ridge,77.56,151.95,77.11,165.56,394.63,Unlimited,SBD,M,
Boys,89.81,1,Cody Ngyuen,Ponder,87.77,235.87,149.69,181.44,566.99,Unlimited,SBD,M,
Boys,89.81,2,Oliver Jimenez,Keller,89.72,185.97,127.01,201.85,514.83,Unlimited,SBD,M,
Boys,89.81,3,Winston Ayesu,Keller Fossil Ridge,88.9,204.12,127.01,165.56,496.68,Unlimited,SBD,M,
Boys,89.81,4,Andrew Bui,Keller Fossil Ridge,85.28,197.31,111.13,185.97,494.42,Unlimited,SBD,M,
Boys,89.81,5,Carter Williams,Keller,83.28,165.56,120.2,185.97,471.74,Unlimited,SBD,M,
Boys,89.81,6,Brayden Flemming,Keller Fossil Ridge,88.45,167.83,113.4,142.88,424.11,Unlimited,SBD,M,
Boys,89.81,DQ,Terrance Molina,Carrollton Smith,89.81,204.12,120.2,179.17,,Unlimited,SBD,M,
Boys,89.81,DQ,Angelo Tucker,Keller Timber Creek,83.91,142.88,83.91,145.15,,Unlimited,SBD,M,
Boys,89.81,DQ,JaCoreyon Swinney,Carrollton Smith,89.36,158.76,102.06,170.1,,Unlimited,SBD,M,
Boys,89.81,DQ,Logan Pruitt,Keller Fossil Ridge,83.91,106.14,52.16,124.74,,Unlimited,SBD,M,
Boys,99.79,1,Noah Read,Keller,98.52,254.01,151.95,206.38,612.35,Unlimited,SBD,M,
Boys,99.79,2,Jaime Montiel,Keller Fossil Ridge,99.34,249.48,145.15,215.46,610.08,Unlimited,SBD,M,
Boys,99.79,3,Jeremiah Clayton,Keller Fossil Ridge,99.79,238.14,165.56,204.12,607.81,Unlimited,SBD,M,
Boys,99.79,4,John Kvistad,Argyle Liberty Christian School,94.8,226.8,140.61,215.46,582.87,Unlimited,SBD,M,
Boys,99.79,5,Mohammed Mansour,Keller,96.16,213.19,131.54,219.99,564.72,Unlimited,SBD,M,
Boys,99.79,6,Daniel Aduh,Keller Fossil Ridge,99.79,204.12,133.81,226.8,564.72,Unlimited,SBD,M,
Boys,99.79,7,Sam Crane,Keller,95.16,190.51,142.88,188.24,521.63,Unlimited,SBD,M,
Boys,99.79,8,Caleb Muse,Keller,92.35,170.1,102.06,195.04,467.2,Unlimited,SBD,M,
Boys,99.79,9,Hunter Bartholomew,Keller,91.81,142.88,79.38,147.42,369.68,Unlimited,SBD,M,
Boys,99.79,DQ,Blaine Turner,Ponder,99.16,233.6,127.01,224.53,,Unlimited,SBD,M,
Boys,99.79,DQ,Will Siripanyo,Keller Fossil Ridge,90.72,183.7,129.27,142.88,,Unlimited,SBD,M,
Boys,99.79,DQ,Adrian Vazquez,Keller Fossil Ridge,98.43,170.1,115.67,136.08,,Unlimited,SBD,M,
Boys,109.77,1,Matthew Ehsan,McKinney,107.95,249.48,104.33,265.35,619.15,Unlimited,SBD,M,
Boys,109.77,2,Shaq Mpinda,Keller Fossil Ridge,108.86,201.85,142.88,188.24,532.97,Unlimited,SBD,M,
Boys,109.77,3,Jackson Carreker,Keller,105.14,124.74,92.99,161.03,378.75,Unlimited,SBD,M,
Boys,109.77,DQ,Carlos Gonzalez,Keller Fossil Ridge,108.86,204.12,142.88,147.42,,Unlimited,SBD,M,
Boys,124.74,1,Luke Williams,Keller,115.85,249.48,158.76,215.46,623.69,Unlimited,SBD,M,
Boys,124.74,2,Jamail Jones,Carrollton Smith,115.21,179.17,147.42,204.12,530.7,Unlimited,SBD,M,
Boys,124.74,3,Jacob Smith,Keller,117.66,206.38,111.13,206.38,523.9,Unlimited,SBD,M,
Boys,124.74,4,Jacob McCandless,Keller Timber Creek,117.93,147.42,122.47,170.1,439.98,Unlimited,SBD,M,
Boys,124.74,DQ,Jabari Washington,Carrollton Smith,124.74,158.76,108.86,170.1,,Unlimited,SBD,M,
Boys,124.74,DQ,Alex McClane,Carrollton Smith,124.74,204.12,120.2,174.63,,Unlimited,SBD,M,
Boys,124.74,DQ,Josh Mayshaw,Keller Timber Creek,114.76,170.1,113.4,174.63,,Unlimited,SBD,M,
Boys,139.71,1,Shaun Linnear,Keller,130.63,185.97,136.08,192.78,514.83,Unlimited,SBD,M,
Boys,139.71,2,John Flanagan,Keller Fossil Ridge,138.35,154.22,117.93,181.44,453.59,Unlimited,SBD,M,
Boys,139.71,3,Jacob Gearhart,Keller Fossil Ridge,130.63,170.1,120.2,151.95,442.25,Unlimited,SBD,M,
Boys,139.71+,1,Ian Davidson,Keller Central,139.89,229.06,195.04,210.92,635.03,Unlimited,SBD,M,
Boys,139.71+,DQ,Blake Smith,Keller Timber Creek,157.85,174.63,142.88,192.78,,Unlimited,SBD,M,
