Sex,WeightClassKg,Division,Name,BodyweightKg,Squat1Kg,Squat2Kg,Squat3Kg,Best3SquatKg,Bench1Kg,Bench2Kg,Bench3Kg,Best3BenchKg,Deadlift1Kg,Deadlift2Kg,Deadlift3Kg,Best3DeadliftKg,TotalKg,Place,Event,Equipment
M,66,Master I,Alberto Castellucci,64.43,130,-137.5,-137.5,130,90,95,98,98,157.5,162.5,-172.5,162.5,390.5,1,SBD,Raw
M,83,Junior,Alberto Dal Pozzo,80.52,-165,-170,-170,,,,,,,,,,,DQ,SBD,Raw
M,93,Master I,Alberto Dall,90.01,115,125,127.5,127.5,-95,100,115,115,165,185,200,200,442.5,4,SBD,Raw
M,93,Open,Alberto Famiano,91.69,175,187.5,-195,187.5,117.5,122.5,-125,122.5,177.5,190,200,200,510,18,SBD,Raw
M,74,Junior,Alberto Visconti,72.5,130,140,150,150,75,82.5,-87.5,82.5,-180,180,185,185,417.5,9,SBD,Raw
M,66,Open,Alen Salaj,66,-155,160,-165,160,112.5,117.5,122.5,122.5,190,200,-210,200,482.5,2,SBD,Raw
M,74,Open,Alessandro Andreello,70.74,135,-145,-155,135,120,-125,-125,120,185,195,-202.5,195,450,19,SBD,Raw
M,105,Open,Alessandro Camparsi,103.83,210,220,-225,220,-135,137.5,-140,137.5,200,210,217.5,217.5,575,12,SBD,Raw
M,66,Open,Alessandro Cuttini,65.09,117.5,122.5,127.5,127.5,87.5,90,92.5,92.5,160,170,185,185,405,6,SBD,Raw
M,83,Open,Alessandro Elefanti,78.08,-125,130,145,145,75,80,85,85,175,-190,-190,175,405,42,SBD,Raw
M,83,Open,Alessandro Girelli,82.35,145,155,162.5,162.5,122.5,127.5,-132.5,127.5,185,200,205,205,495,20,SBD,Raw
M,105,Open,Alessandro Lo Grieco,103.6,200,215,-230,215,140,150,-155,150,235,250,270,270,635,7,SBD,Raw
M,93,Master I,Alessandro Lusa,91.23,112.5,115,-120,115,-67.5,67.5,70,70,-140,142.5,-152.5,142.5,327.5,5,SBD,Raw
M,83,Open,Alessandro Marini,81.11,145,-157.5,-157.5,145,105,112.5,-120,112.5,175,-190,-190,175,432.5,38,SBD,Raw
M,93,Open,Alessandro Marseglia,88.78,150,167.5,-172.5,167.5,115,-122.5,125,125,190,210,-225,210,502.5,20,SBD,Raw
M,105,Open,Alessandro Sidiropoulos,98.2,-160,-160,160,160,-85,95,105,105,175,190,-200,190,455,22,SBD,Raw
M,83,Master I,Alessandro Silvas,81.86,180,190,200,200,115,122.5,125,125,240,-257.5,257.5,257.5,582.5,2,SBD,Raw
M,74,Open,Alessandro Trentini,71.52,-135,140,152.5,152.5,85,90,-97.5,90,160,170,177.5,177.5,420,22,SBD,Raw
M,105,Junior,Alessandro Zoppa,99.24,160,170,175,175,105,110,115,115,200,210,215,215,505,8,SBD,Raw
F,57,Open,Alessia Amodeo,56.53,75,85,95,95,47.5,57.5,-60,57.5,80,92.5,100,100,252.5,6,SBD,Raw
F,63,Open,Alessia Di Manno,62.33,-95,100,-107.5,100,57.5,-62.5,62.5,62.5,115,120,-122.5,120,282.5,6,SBD,Raw
M,74,Open,Alessio Bassi,73.16,170,180,-190,180,125,135,-140,135,180,190,200,200,515,9,SBD,Raw
M,83,Junior,Alessio Erba,82.76,190,200,205,205,-102.5,105,110,110,230,-250,-250,230,545,5,SBD,Raw
M,105,Master I,Alessio Saro,104.22,195,210,-215,210,145,-150,-150,145,210,225,232.5,232.5,587.5,3,SBD,Raw
M,120,Open,Alex Aguzzoli,113.08,155,165,170,170,115,122.5,-125,122.5,195,210,-232.5,210,502.5,10,SBD,Raw
M,83,Junior,Alex Barbieri,80.06,175,185,-195,185,100,-107.5,-107.5,100,-185,195,-205,195,480,10,SBD,Raw
M,74,Junior,Alex Caselli,70.73,140,155,-170,155,92.5,-95,-95,92.5,-175,180,190,190,437.5,8,SBD,Raw
F,52,Sub-Junior,Alice Dulcis,50.49,-80,85,-90,85,45,-50,-50,45,100,110,-115,110,240,1,SBD,Raw
F,63,Open,Alice Veniani,61.27,95,105,-110,105,50,55,-57.5,55,130,140,-145,140,300,3,SBD,Raw
F,57,Open,Anastasiya Bondarenko #1,54.58,-70,-70,70,70,42.5,45,-47.5,45,100,105,110,110,225,11,SBD,Raw
M,120,Junior,Andrea Avico,108.46,220,233,235.5,235.5,140,-147.5,-147.5,140,210,222.5,230,230,605.5,5,SBD,Raw
M,120,Junior,Andrea Boschetto,105.48,175,185,200,200,140,147.5,-152.5,147.5,175,190,200,200,547.5,7,SBD,Raw
M,59,Junior,Andrea Bruno,58.59,132.5,142.5,150,150,90,92.5,-97.5,92.5,165,180.5,-190,180.5,423,1,SBD,Raw
M,93,Junior,Andrea Cavicchioli,90.34,210,215,225,225,130,137.5,-142.5,137.5,232.5,252.5,280,280,642.5,2,SBD,Raw
M,66,Junior,Andrea Drusin,64.33,150,160,162.5,162.5,100,-105,-105,100,155,165,-170,165,427.5,2,SBD,Raw
M,93,Open,Andrea Giuliani,90.55,155,167.5,180,180,115,122.5,-130,122.5,195,-205,210,210,512.5,16,SBD,Raw
M,120+,Open,Andrea Guiseppe Di Palma,127.5,200,210,-220,210,160,170,-175,170,-250,250,-265,250,630,4,SBD,Raw
M,83,Open,Andrea La Rocca,82.93,220,232.5,-236.5,232.5,137.5,140,-142.5,140,255,267.5,-275,267.5,640,2,SBD,Raw
M,83,Open,Andrea Manca,76.34,125,135,145,145,110,117.5,-125,117.5,150,160,165,165,427.5,40,SBD,Raw
M,74,Junior,Andrea Marzocco,72.65,160,170,180,180,85,95,100,100,220,230,237.5,237.5,517.5,2,SBD,Raw
M,105,Junior,Andrea Missaggia,103.95,190,205,-212.5,205,130,140,145,145,190,200,-210,200,550,5,SBD,Raw
M,93,Master I,Andrea Mondo,87.81,190,200,-205,200,102.5,107.5,110,110,200,210,220,220,530,3,SBD,Raw
M,74,Junior,Andrea Pes,71.6,220,232.5,-237.5,232.5,160,170,-175,170,230,242.5,-246,242.5,645,1,SBD,Raw
M,83,Junior,Andrea Pozzan,78.81,185,192.5,-197.5,192.5,100,105,-110,105,190,200,-205,200,497.5,9,SBD,Raw
M,83,Open,Andrea Rizzato,80.47,-125,135,-145,135,125,-130,-130,125,170,180,190,190,450,34,SBD,Raw
M,105,Junior,Andrea Sardo,96.31,200,-210,210,210,125,-130,-130,125,235,245,250,250,585,3,SBD,Raw
M,74,Master I,Andrea Sguinzi,70.9,120,132.5,140,140,100,107.5,115,115,185,197.5,-202.5,197.5,452.5,3,SBD,Raw
M,83,Open,Angelo Famà,78.31,135,145,155,155,125,-132.5,-132.5,125,170,180,190,190,470,30,SBD,Raw
M,66,Open,Angelo Schembri,65.64,-150,-160,-165,,,,,,,,,,,DQ,SBD,Raw
F,84,Open,Anna Biondo,76.62,70,80,87.5,87.5,45,50,-52.5,50,100,110,-125,110,247.5,5,SBD,Raw
F,63,Open,Anna Cerruto,61.1,-65,70,75,75,42.5,47.5,-50,47.5,95,102.5,110,110,232.5,10,SBD,Raw
F,52,Master I,Anna Stenghel,51.02,-82.5,-85,87.5,87.5,55,58,-60,58,97.5,102.5,-107.5,102.5,248,1,SBD,Raw
F,57,Open,Anna Tagliapietra,56.11,67.5,72.5,-75,72.5,-42.5,42.5,-47.5,42.5,-90,90,-92.5,90,205,12,SBD,Raw
M,83,Open,Anton Mario Pieragostini,82.79,155,162.5,172.5,172.5,112.5,117.5,125,125,160,172.5,-182.5,172.5,470,31,SBD,Raw
M,105,Open,Antonella Boccola,100.88,170,180,187.5,187.5,-130,140,-145,140,190,200,207.5,207.5,535,17,SBD,Raw
M,105,Open,Antonio Cassano,101.44,155,167.5,-172.5,167.5,110,117.5,-120,117.5,190,200,-205,200,485,18,SBD,Raw
M,93,Open,Antonio Coppedè,90.01,180,200,-210,200,100,110,-115,110,180,200,-205,200,510,17,SBD,Raw
M,83,Junior,Antonio Gorga,80.69,180,190,-200,190,125,-132.5,135,135,200,215,-222.5,215,540,6,SBD,Raw
M,83,Master I,Antonio Mastrolonardo,80.45,180,-190,200,200,125,132.5,137.5,137.5,220,230,-235,230,567.5,3,SBD,Raw
M,74,Open,Antonio Miragliotta,70.83,130,140,-147.5,140,90,95,-100,95,180,195,200,200,435,21,SBD,Raw
M,93,Junior,Antonio Pio Gervasi,90.64,-230,235,242.5,242.5,140,-147.5,-150,140,250,255,260,260,642.5,3,SBD,Raw
M,93,Master II,Antonio Porpora,87.98,105,110,-115,110,82.5,85,87.5,87.5,155,-165,165,165,362.5,3,SBD,Raw
M,93,Open,Antonio Romano,90.19,160,-165,-165,160,130,-135,-135,130,210,-220,-220,210,500,21,SBD,Raw
M,74,Open,Antonio Tarantino,71.69,195,-202.5,202.5,202.5,-120,120,127.5,127.5,190,200,202.5,202.5,532.5,7,SBD,Raw
M,74,Sub-Junior,Arturo Busetto,69.98,-130,130,135,135,100,108,-111,108,135,140,145,145,388,2,SBD,Raw
F,72,Sub-Junior,Aurora Russo,63.38,80,-90,95,95,65,-70,-70,65,100,110,-120,110,270,1,SBD,Raw
F,84,Open,Barbara Giacomini,78.25,75,82.5,-95,82.5,55,-57.5,-57.5,55,110,122.5,-140,122.5,260,4,SBD,Raw
M,66,Open,Bruno Raffa,64.44,-130,-130,130,130,82.5,87.5,-90,87.5,165,-172.5,-172.5,165,382.5,7,SBD,Raw
M,83,Junior,Carlo Colombo,81.02,140,147.5,155,155,102.5,110,-120,110,157.5,165,170,170,435,14,SBD,Raw
M,83,Open,Carlo Princic,82.51,-207.5,215,227.5,227.5,142.5,150,155,155,265,285,-290.5,285,667.5,1,SBD,Raw
M,66,Open,Carlo Ricolo,63.52,155,160,-165,160,105,-110,-110,105,185,195,202.5,202.5,467.5,3,SBD,Raw
M,120,Sub-Junior,Carlo Sannino,115.01,185,195,205,205,130,135,-140,135,200,207.5,-220,207.5,547.5,1,SBD,Raw
F,63,Junior,Carola Garra,61.45,130,140,145,145,120,130,-132.5,130,145,160.5,167.5,167.5,442.5,1,SBD,Raw
M,66,Open,Casimiro Meli,65.72,145,152.5,-162.5,152.5,115,-120,,115,210,217.5,222.5,222.5,490,1,SBD,Raw
F,72,Open,Cecilia Facini,69.91,82.5,-92.5,92.5,92.5,42.5,-47.5,-47.5,42.5,95,105,-115,105,240,6,SBD,Raw
F,72,Open,Chiara Cisotta,69.86,-95,100,-105,100,45,-47.5,-50,45,145,150,-155,150,295,5,SBD,Raw
F,63,Open,Chiara Maria De Marco,60.24,90,95,100,100,47.5,50,-52.5,50,120,-130,-130,120,270,7,SBD,Raw
F,47,Junior,Chiara Pastorio,44.33,90.5,-95.5,-100,90.5,50,-53,-53,50,90,95.5,103,103,243.5,1,SBD,Raw
F,57,Open,Chiara Petrellini,56.8,85,95,102.5,102.5,-45,-52.5,-57.5,,,,,,,DQ,SBD,Raw
M,74,Open,Claudio Forti,72.09,185,195,200,200,115,117.5,120,120,230,242.5,255.5,255.5,575.5,3,SBD,Raw
M,74,Open,Claudio Perini,71.53,125,132.5,140,140,125,130,-135,130,170,180,-190,180,450,20,SBD,Raw
M,93,Master II,Claudio Portugalli,89.91,140,150,155,155,105,110,-112.5,110,190,200,210,210,475,1,SBD,Raw
M,74,Master I,Claudio Ravazzola,73.75,-170.5,-170.5,-175,,,,,,,,,,,DQ,SBD,Raw
M,93,Junior,Constantino Dipaolonicola,86.51,120,140,155,155,110,112.5,122.5,122.5,150,162.5,170,170,447.5,9,SBD,Raw
M,105,Open,Corrado Siragusa,103.19,300.5,-310,-310,300.5,165,170,-172.5,170,-305,-305,305,305,775.5,1,SBD,Raw
M,74,Master I,Cristian Cocchi,73.71,180,186,190,190,125,-128,128,128,175,182.5,185,185,503,1,SBD,Raw
M,105,Master I,Cristian Turco,97.14,230,240,250,250,165,170,-176.5,170,240,250,260.5,260.5,680.5,1,SBD,Raw
F,57,Open,Cristiana Velona,55.82,107.5,112.5,-115,112.5,60,63,-65,63,137.5,142.5,147.5,147.5,323,1,SBD,Raw
M,93,Junior,Cristiano Ballabio,88.07,155,-165,170,170,107.5,112.5,-115,112.5,190,205,215,215,497.5,7,SBD,Raw
M,93,Open,Cristiano Zanotelli,89.15,180,200,-210,200,-150,-150,150,150,200,-220,220,220,570,11,SBD,Raw
F,84,Open,Cristina Balduzi,75.61,105,115,-125,115,65,70,72.5,72.5,120,130,-135,130,317.5,2,SBD,Raw
F,57,Open,Cristina De Martin,54.63,75,80,-82.5,80,-45,45,-47.5,45,110,120,-125,120,245,8,SBD,Raw
M,83,Open,Damiano Capraro,81.26,-150,-155,157.5,157.5,95,100,-102.5,100,175,-182.5,-182.5,175,432.5,39,SBD,Raw
M,66,Open,Daniele Tarchi,64.65,130,137.5,-142.5,137.5,102.5,107.5,110,110,195,205,215,215,462.5,4,SBD,Raw
M,120,Open,Daniele Vasile,117.82,195,207.5,-220,207.5,175,182.5,-190,182.5,200,-215,-215,200,590,6,SBD,Raw
M,59,Junior,Dario Burruni,58.12,110,120,125,125,92.5,97.5,-100,97.5,130,137.5,142.5,142.5,365,3,SBD,Raw
M,66,Junior,Davide Artale,63.49,-150,150,-160,150,105,110,115,115,150,160,-162.5,160,425,3,SBD,Raw
M,105,Open,Davide Bettiol,104.13,-210,-225,225,225,130,-137.5,-137.5,130,250,270,290,290,645,6,SBD,Raw
M,59,Sub-Junior,Davide Cappa,55.84,95,102.5,113,113,-75,-85,85.5,85.5,105,110,115,115,313.5,1,SBD,Raw
M,93,Open,Davide Ferrante,88.76,190,200,210,210,155,160,-165,160,210,225,-232.5,225,595,8,SBD,Raw
M,74,Open,Davide Giannini,70.3,200,207.5,-212.5,207.5,127.5,135,-142.5,135,235,-242.5,-242.5,235,577.5,2,SBD,Raw
M,105,Junior,Davide Lovison,98.67,210,222.5,-230,222.5,135,142.5,147.5,147.5,252.5,270.5,-282.5,270.5,640.5,1,SBD,Raw
M,120,Open,Davide Zappoli,106.81,150,-157.5,157.5,157.5,95,100,-102.5,100,180,192.5,-200,192.5,450,11,SBD,Raw
M,66,Junior,Dennis Milello,64.07,125,135,137.5,137.5,105,110,-115,110,160,170,175,175,422.5,4,SBD,Raw
F,72,Junior,Desiree Di Marco,66.07,82.5,-87.5,-92.5,82.5,57.5,60,62.5,62.5,87.5,95,100,100,245,1,SBD,Raw
M,83,Junior,Diego Pezzo,80.13,165,-172.5,-172.5,165,95,102.5,105,105,145,152.5,157.5,157.5,427.5,15,SBD,Raw
M,93,Open,Diego Sebastiani,89.43,160,175,-185,175,110,-120,120,120,200,210,-220,210,505,19,SBD,Raw
M,83,Open,Dimitri Rizzo,82.97,162.5,170,-175,170,-150,-150,-150,,,,,,,DQ,SBD,Raw
M,59,Sub-Junior,Edoardo Crippa,57.6,95,-102.5,110.5,110.5,55,65,72.5,72.5,110,120,130,130,313,2,SBD,Raw
M,120,Junior,Edoardo Marinucci,109.55,212.5,225,233.5,233.5,152.5,162.5,-172.5,162.5,235,254,-265,254,650,2,SBD,Raw
M,74,Junior,Edoardo Pasqui,72.52,145,152.5,157.5,157.5,100,105,110,110,180,190,195,195,462.5,6,SBD,Raw
M,93,Junior,Edoardo Serafini,88.47,-150,150,-160,150,-120,122.5,-125,122.5,190,200,207.5,207.5,480,8,SBD,Raw
F,52,Junior,Eliana Tunno,51.15,85,90,-95,90,40,-42.5,-45,40,120,132,-143,132,262,3,SBD,Raw
F,57,Open,Elisa Businaro,56.75,100,-107.5,-110,100,55,60,-65,60,110,120,127.5,127.5,287.5,4,SBD,Raw
F,63,Sub-Junior,Elisebetta Marino,59.96,50,-57.5,60,60,35,-40,-40,35,72.5,77.5,-82.5,77.5,172.5,2,SBD,Raw
F,47,Open,Elita Milito,46.91,-65,72.5,-77.5,72.5,35,42.5,-47.5,42.5,105,110,112.5,112.5,227.5,2,SBD,Raw
F,57,Open,Emanuela Arcari,55.65,77.5,82.5,87.5,87.5,42.5,45,47.5,47.5,110,115,-120,115,250,7,SBD,Raw
M,74,Junior,Emanuele Monea,71.29,180,190,195,195,100,107.5,-112.5,107.5,190,202.5,-212.5,202.5,505,4,SBD,Raw
M,83,Junior,Enrico Scarcia,81.2,165,175,185,185,122.5,127.5,130,130,250,255,-262.5,255,570,2,SBD,Raw
M,120,Open,Enzo Falvo,116.19,-225,235,250,250,162.5,167.5,-172.5,167.5,240,255,262.5,262.5,680,5,SBD,Raw
F,63,Sub-Junior,Erika Arosio,59.1,72.5,77.5,82.5,82.5,45,47.5,50,50,95,-105,-105,95,227.5,1,SBD,Raw
F,63,Open,Erika Pace,61.22,-80,80,-90,80,50,-55,-55,50,90,95,100,100,230,11,SBD,Raw
F,63,Open,Eugenia Orlando,62.01,100,110,-117.5,110,75,-80,80,80,130,140,145,145,335,1,SBD,Raw
M,120,Junior,Fabio Di Curzio,115.12,160,172.5,182.5,182.5,125,132.5,-140,132.5,210,225,235,235,550,6,SBD,Raw
M,74,Open,Fabio Falzoi,74,160,170,175,175,105,112.5,-120,112.5,205,-220,-220,205,492.5,13,SBD,Raw
M,93,Open,Fabio Finardi,83.45,-150,-150,-150,,,,,,,,,,,DQ,SBD,Raw
M,120,Open,Fabio Gamba,117.32,232.5,245,255,255,162.5,170,175,175,237.5,245,265,265,695,3,SBD,Raw
M,66,Open,Fabio Guglielmini,63.73,125,132.5,140,140,92.5,97.5,-100,97.5,120,130,-137.5,130,367.5,8,SBD,Raw
M,83,Master I,Fabio Prescimone,77.94,190,-202.5,202.5,202.5,-130,130,-135,130,200,210,-217.5,210,542.5,4,SBD,Raw
M,93,Open,Fabio Tricomi,86.16,240,242.5,-245,242.5,150,155,-160,155,-270,-270,-272.5,,,DQ,SBD,Raw
M,105,Open,Fabrizio Ciancimino,95.13,145,155,-162.5,155,-125,130,-135,130,175,182.5,192.5,192.5,477.5,19,SBD,Raw
M,120,Open,Fabrizio Polloni,111.25,235,255,-265.5,255,185,-193,-193,185,250,270,-285,270,710,2,SBD,Raw
M,93,Open,Fabrizio Posca,90.56,240,255,-265,255,160,170,172.5,172.5,280,-300,-300,280,707.5,1,SBD,Raw
M,83,Open,Federico Di Manno,79.04,150,160,170,170,135,-137.5,-137.5,135,175,185,190,190,495,19,SBD,Raw
M,120,Open,Federico Gallo,113.4,170,185,-200,185,120,-140,-140,120,220,-232.5,-232.5,220,525,9,SBD,Raw
M,74,Open,Federico Martella,72.51,192.5,-202.5,-202.5,192.5,122.5,127.5,-132.5,127.5,215,225,-230,225,545,4,SBD,Raw
M,66,Junior,Federico Murgia,65.47,135,-142.5,142.5,142.5,90,95,-100,95,152.5,167.5,-190,167.5,405,5,SBD,Raw
M,120,Sub-Junior,Filippo Alongi,119.69,162.5,170,-180,170,125,130,-135.5,130,190,200,-225,200,500,2,SBD,Raw
M,105,Open,Filippo Azzali,101.75,220,230,-232.5,230,-137.5,142.5,-147.5,142.5,215,230,-240,230,602.5,9,SBD,Raw
M,83,Open,Filippo D'Albero,81.77,150,160,170,170,100,115,-120,115,180,195,-215,195,480,26,SBD,Raw
M,66,Junior,Filippo Repetti,62.4,130,-140,140,140,82.5,-90,-90,82.5,140,142.5,152.5,152.5,375,7,SBD,Raw
F,52,Junior,Francesca Kanzian,51.07,-70,70,-75,70,37.5,-40,-40,37.5,95,-105,105,105,212.5,4,SBD,Raw
F,47,Open,Francesca Serra,45.87,73,77.5,-82.5,77.5,45,47.5,-50,47.5,90,95,100,100,225,3,SBD,Raw
M,105,Open,Francesco Bovina,100.97,200,210,215,215,110,-120,-120,110,220,235,245,245,570,14,SBD,Raw
M,83,Junior,Francesco Ginesi,82.55,-130,135,145,145,80,85,-90,85,170,180,190,190,420,16,SBD,Raw
M,83,Master II,Francesco Morese,82.43,185,195,200,200,137.5,-143,143,143,225,235,-251,235,578,1,SBD,Raw
M,83,Sub-Junior,Francesco Vergara,78.36,180.5,190.5,198,198,90,97.5,103,103,180,192.5,200,200,501,2,SBD,Raw
M,66,Open,Franco Cosimo Malatesta,65.31,140,147.5,150,150,-105,-105,105,105,195,202.5,-207.5,202.5,457.5,5,SBD,Raw
M,59,Master III,Franco Giummarra,56.5,125,-135,135,135,60,-65,-65,60,140,150,-160,150,345,1,SBD,Raw
M,83,Open,Franco Linardi,81.85,115,125,-140,125,100,107.5,-110,107.5,165,180,-200,180,412.5,41,SBD,Raw
M,105,Open,Gabriele Baccaglini,93.26,225,240,250,250,150,160,-165,160,255,265,282.5,282.5,692.5,4,SBD,Raw
M,74,Sub-Junior,Gabriele Bottacini,72.07,165,172.5,180,180,105.5,110.5,-112.5,110.5,175.5,182.5,190,190,480.5,1,SBD,Raw
M,105,Junior,Gabriele Lodolo,98.78,-170,182.5,190,190,110,122.5,127.5,127.5,210,-222.5,230,230,547.5,6,SBD,Raw
M,83,Open,Gabriele Tufano,81.28,-150,150,160,160,107.5,115,-122.5,115,145,155,162.5,162.5,437.5,35,SBD,Raw
F,52,Master I,Gabriella Tenerelli,50.66,-65,70,72.5,72.5,42.5,47.5,-50,47.5,100,-107.5,-107.5,100,220,2,SBD,Raw
M,120,Open,Gennaro Mazzuoccolo,110.65,185,187.5,200,200,-125,127.5,132.5,132.5,-215,220,230,230,562.5,8,SBD,Raw
M,93,Junior,Giacomo Brondi,87.68,140,150,160,160,95,102.5,-105,102.5,155,167.5,175,175,437.5,10,SBD,Raw
M,83,Open,Giacomo Pascoli,77.91,150,157.5,162.5,162.5,115,-122.5,-122.5,115,185,195,-200,195,472.5,29,SBD,Raw
M,74,Open,Gian Luigi Paiano,69.42,110,120,130,130,85,90,100,100,130,145,160,160,390,24,SBD,Raw
M,74,Open,Gianmarco Luciano,72.14,172.5,-180,180,180,110,115,120,120,195,210,220,220,520,8,SBD,Raw
M,93,Open,Gianluca D'Antonio,84.13,150,165,172.5,172.5,102.5,110,117.5,117.5,190,205,-215,205,495,22,SBD,Raw
M,120,Junior,Gianluca Galletto,106.32,-220,220,-230,220,150,160,165,165,250,265,-290,265,650,1,SBD,Raw
M,93,Open,Gianluca Martino,86.73,215,225,230,230,147.5,152.5,155,155,260,280,285,285,670,3,SBD,Raw
M,105,Master I,Gianluca Minghetti,95.7,145,-155,160,160,105,110,-115,110,215,227.5,242.5,242.5,512.5,4,SBD,Raw
M,120,Open,Gianmario Gorga,119.18,261,-270,-270,261,185,190,-193.5,190,252.5,262.5,-287.5,262.5,713.5,1,SBD,Raw
F,52,Master I,Gina Esposito,51.07,-65,65,67.5,67.5,-42.5,-42.5,-42.5,,,,,,,DQ,SBD,Raw
M,83,Open,Gionata Grassi,82.49,170,180,-190,180,117.5,125,130,130,200,220,-225,220,530,9,SBD,Raw
M,83,Master II,Giorgio Agostinoni,80.63,-200.5,202.5,217.5,217.5,110,117.5,120,120,200,215,-235,215,552.5,2,SBD,Raw
M,83,Master IV,Giorgio Fontana,78.08,125,135,-145,135,75,80,-88,80,152.5,172.5,185,185,400,1,SBD,Raw
M,83,Open,Giorgio Pierotti,79.43,155,162.5,170,170,140,145,150,150,155,165,172.5,172.5,492.5,21,SBD,Raw
F,63,Open,Giulia Collerone,61.79,105,-110,-110,105,60,62.5,65,65,115,125,135,135,305,2,SBD,Raw
F,47,Open,Giulia Scarniglia,46.59,70,-75,-77.5,70,37.5,40,-42.5,40,75,80,85,85,195,4,SBD,Raw
M,83,Open,Giuliano Prati,79.22,-120,120,-127.5,120,75,80,82.5,82.5,-160,-165,165,165,367.5,45,SBD,Raw
F,72,Junior,Giulietta Stradotto,70.59,-127.5,-132.5,-132.5,,,,,,,,,,,DQ,SBD,Raw
M,105,Master II,Giuseppe Battisti,103.58,-205,-205,205,205,135,-140,140,140,250,260,270,270,615,1,SBD,Raw
M,93,Open,Giuseppe Manca,87.29,237.5,252.5,-270.5,252.5,155,160,-165,160,237.5,257.5,265,265,677.5,2,SBD,Raw
M,105,Open,Giuseppe Veraldi,98.87,160,180,-200,180,170,176,180,180,190,210,-217.5,210,570,13,SBD,Raw
F,72,Master I,Graziella Cernotta,68.61,-85,-85,-85,,,,,,,,,,,DQ,SBD,Raw
F,63,Open,Greta Costantini,62.96,95,105,110,110,45,-52.5,-52.5,45,115,122.5,130,130,285,5,SBD,Raw
M,83,Master I,Guido Papini,79.78,-160,160,-170,160,-130,130,-137.5,130,185,192.5,200,200,490,5,SBD,Raw
M,83,Open,Haxhi Teku,80.33,-130,142.5,150,150,75,82.5,-90,82.5,140,-150,150,150,382.5,44,SBD,Raw
M,83,Junior,Ion Trofim,78.33,175,-177.5,-192.5,175,137.5,142.5,147.5,147.5,-225,-242.5,242.5,242.5,565,3,SBD,Raw
M,83,Open,Ivan Bellesia,80.79,190,200,205,205,145,150,-155,150,230,242.5,250,250,605,4,SBD,Raw
M,93,Open,Ivan Re,83.9,160,170,175,175,120,127.5,132.5,132.5,190,205,212.5,212.5,520,15,SBD,Raw
M,74,Open,Ivan Vaiani,71.93,165,175,185,185,100,-110,110,110,180,200,212.5,212.5,507.5,10,SBD,Raw
M,66,Sub-Junior,Izmir Teku,61.1,130,137.5,140,140,90,100,,100,140,155,-165,155,395,1,SBD,Raw
M,105,Sub-Junior,Jacopo Greco,99.43,190,205,215,215,110,120,-130,120,210,-225,225,225,560,1,SBD,Raw
M,74,Open,Jennys Chiuchiolo,70.79,120,125,135,135,90,95,-100,95,155,165,175,175,405,23,SBD,Raw
F,52,Open,Jessica Palmieri,51.23,85,-90,-90,85,40,-45,-45,40,90,95,-100,95,220,4,SBD,Raw
F,84,Open,Laura Larini,72.03,90,100,-115,100,55,60,-67.5,60,95,97.5,115,115,275,3,SBD,Raw
F,57,Open,Laura Pugliese,54.79,90,-95,100,100,50,-55,-57.5,50,120,130,142.5,142.5,292.5,3,SBD,Raw
M,83,Sub-Junior,Leonardo Gamberoni,79.18,145,152.5,-160,152.5,95,-100,-100,95,115,122.5,-130,122.5,370,5,SBD,Raw
M,83,Open,Leonardo Pinsone,82.65,152.5,160,165,165,112.5,120,-125,120,195,207.5,-212.5,207.5,492.5,23,SBD,Raw
F,57,Open,Linda Monguzzi,53.99,77.5,82.5,-87.5,82.5,55,-60,-60,55,95,97.5,-110,97.5,235,10,SBD,Raw
F,52,Junior,Linda Signorini,50.88,93,98,-100.5,98,55,58,61,61,-95.5,100,105,105,264,2,SBD,Raw
M,66,Master III,Lorenzo Costa,62.02,-60,60,67.5,67.5,72.5,77.5,-80,77.5,135,142.5,150,150,295,1,SBD,Raw
M,105,Open,Lorenzo Di Giuseppe,102.27,-240,-250,250,250,150,160,-170,160,220,235,245,245,655,5,SBD,Raw
M,120+,Junior,Lorenzo Ferrara,131.64,220,240,-270,240,155,170,-172.5,170,230,-260,-260,230,640,1,SBD,Raw
M,105,Junior,Lorenzo Frustagatti,103.73,190,205,215,215,120,-130,-130,120,195,207.5,247.5,247.5,582.5,4,SBD,Raw
M,83,Junior,Lorenzo Lupo,81.88,180,195,-202.5,195,125,132.5,137.5,137.5,190,205,215,215,547.5,4,SBD,Raw
M,105,Open,Lorenzo Marchegiani,93.17,177.5,187.5,195,195,-125,125,132.5,132.5,205,220,-230,220,547.5,16,SBD,Raw
M,93,Junior,Lorenzo Milani,85.1,160,180,185,185,100,110,-115,110,185,200,205,205,500,6,SBD,Raw
M,93,Junior,Lorenzo Panichi,85.68,180,-182.5,-182.5,180,110,-120,-120,110,225,,,225,515,5,SBD,Raw
M,83,Open,Lorenzo Sala,81.05,190,200,-205,200,145,155,-157.5,155,-230,230,245,245,600,5,SBD,Raw
M,83,Sub-Junior,Luca Bertazzo,78.29,-125,-130,130,130,85,-92.5,-92.5,85,165,177.5,187.5,187.5,402.5,3,SBD,Raw
M,105,Open,Luca Cinelli,103.8,205,215,-225,215,147.5,-152.5,-152.5,147.5,205,-215,-215,205,567.5,15,SBD,Raw
M,74,Open,Luca Galvani,72.09,-155,160,-170,160,92.5,97.5,105,105,175,185,200,200,465,17,SBD,Raw
M,83,Open,Luca Merola,81.18,170,182.5,-190,182.5,110,-115,-115,110,200,210,215,215,507.5,15,SBD,Raw
M,83,Junior,Luca Murachelli,80.81,165,172.5,-180,172.5,85,90,-95,90,170,180,185,185,447.5,12,SBD,Raw
M,93,Open,Luca Pieroni,89.3,170,-182.5,190,190,125,-135,135,135,195,210,225,225,550,12,SBD,Raw
M,93,Open,Luca Seardo,90.56,150,162.5,-167.5,162.5,110,115,120,120,190,202.5,207.5,207.5,490,23,SBD,Raw
M,120+,Master I,Luigi Brivio,120.1,220,-235,245,245,160.5,167.5,172.5,172.5,215.5,225,235,235,652.5,1,SBD,Raw
M,105,Open,Luigi Celeste,104.1,270,-287.5,287.5,287.5,170,177.5,-181,177.5,280,-295,-295,280,745,2,SBD,Raw
M,66,Master IV,Luigino Neri,64.78,70,-77.5,-77.5,70,-52.5,52.5,-57.5,52.5,100,110,-112.5,110,232.5,1,SBD,Raw
F,72,Open,Luisa Torrisi,69.95,120,130,135,135,67.5,72.5,-77.5,72.5,125,132.5,137.5,137.5,345,3,SBD,Raw
M,59,Junior,Manuel Cardinale,56.94,110,117.5,125,125,75,80,85,85,130,142.5,155,155,365,2,SBD,Raw
M,83,Open,Manuel Sala,75.1,120,130,-135,130,92.5,100,-102.5,100,125,135,-150,135,365,46,SBD,Raw
M,93,Open,Manuel Vecchiato,92.37,165,172.5,-177.5,172.5,160,-165,-165,160,217.5,227.5,240,240,572.5,10,SBD,Raw
M,59,Open,Marco Baglio,57.53,100,110,130,130,60,72.5,-80,72.5,170,180,-190,180,382.5,2,SBD,Raw
M,93,Sub-Junior,Marco Bitti,89.92,175,-200,200,200,160,-175,-175,160,225,235,-242.5,235,595,1,SBD,Raw
M,74,Open,Marco Castellani #2,73.42,-165,175,180,180,105,-112.5,112.5,112.5,185,200,-215,200,492.5,12,SBD,Raw
M,74,Open,Marco Casuscelli,72.59,165,-180,-180,165,140,145,-150,145,170,180,190,190,500,11,SBD,Raw
M,83,Open,Marco Dantone,78.48,142.5,152.5,155,155,135,140,-145,140,157.5,170,180,180,475,28,SBD,Raw
M,83,Open,Marco Donatelli,79.06,155,-162.5,-162.5,155,95,100,-105,100,160,170,180,180,435,37,SBD,Raw
M,93,Open,Marco Guerretta,91.84,210,220,230,230,145,-150,-150,145,220,235,-245,235,610,7,SBD,Raw
M,120,Open,Marco Petrin,111.22,200,215,-230,215,130,-142.5,-142.5,130,190,210,225,225,570,7,SBD,Raw
M,74,Junior,Marco Poda,71.53,170,177.5,182.5,182.5,110,115,117.5,117.5,205,-212.5,-220,205,505,5,SBD,Raw
M,120,Junior,Marco Umberto Iannotti,113.11,220,230,235,235,170,-175,-175,170,-245,245,-260,245,650,3,SBD,Raw
M,83,Open,Marco Vecchio,82.12,190,200,-210,200,110,-120,-120,110,220,235,-250,235,545,8,SBD,Raw
M,93,Open,Marco Virdis,88.18,-190,190,-200,190,145,152.5,157.5,157.5,210,225,-235,225,572.5,9,SBD,Raw
F,57,Open,Maria Cristina Fuoco,56.99,85,92.5,-97.5,92.5,57.5,60,-62.5,60,110,-117.5,-117.5,110,262.5,5,SBD,Raw
F,57,Open,Maria Giovanna Brancati,56.08,75,82.5,-90,82.5,50,55,-57.5,55,90,100,105,105,242.5,9,SBD,Raw
F,63,Open,Mariella Trento,60.75,95,100,105,105,52.5,57.5,60,60,127.5,-132.5,132.5,132.5,297.5,4,SBD,Raw
M,105,Master I,Mario Pinna,103.9,225,232.5,237.5,237.5,135,140,-142.5,140,250,260,-267.5,260,637.5,2,SBD,Raw
F,72,Open,Martina Zellino,67.58,-127.5,127.5,-132.5,127.5,72.5,75,-80,75,120,127.5,137.5,137.5,340,4,SBD,Raw
F,52,Open,Maruska Bertoli,50.1,115,122.5,-127.5,122.5,67.5,-72.5,72.5,72.5,147.5,155,-160,155,350,1,SBD,Raw
M,83,Master I,Massimiliano Buccioni,82.65,205,215,222.5,222.5,130,137.5,-142.5,137.5,240,255,-260,255,615,1,SBD,Raw
M,83,Junior,Massimiliano Esposito,81.97,-190,195,200,200,130,-137.5,140,140,225,230,237.5,237.5,577.5,1,SBD,Raw
M,74,Open,Massimo De Giudici,71.73,115,-120,-120,115,90,92.5,-95,92.5,120,-130,130,130,337.5,25,SBD,Raw
M,120+,Open,Massimo Sgaramella,173.82,255,262.5,-270,262.5,180,187.5,195,195,250,257.5,262.5,262.5,720,1,SBD,Raw
M,105,Open,Massimo Uccelli,94.82,142.5,152.5,160,160,80,87.5,-90,87.5,190,205,220,220,467.5,21,SBD,Raw
M,83,Junior,Matteo Bonfatti,81.54,160,170,-175,170,80,82.5,-90,82.5,205,-217.5,-217.5,205,457.5,11,SBD,Raw
M,105,Open,Matteo Della Santa,93.25,140,150,-157.5,150,100,105,-110,105,190,205,217.5,217.5,472.5,20,SBD,Raw
M,83,Sub-Junior,Matteo Masciarelli,80.84,160,170,-185,170,100.5,-110,110,110,197.5,210,222.5,222.5,502.5,1,SBD,Raw
M,93,Junior,Matteo Merlo,90.11,200,215,-225,215,-140,147.5,-155,147.5,190,205,215,215,577.5,4,SBD,Raw
M,83,Open,Matteo Noseda,81.77,180,190,200,200,115,-122.5,-122.5,115,190,200,210,210,525,10,SBD,Raw
M,105,Open,Matteo Recchia,104.5,200,-210,215,215,-105,105,110,110,235,250,260,260,585,11,SBD,Raw
M,83,Junior,Matteo Rizzi,80.31,180,190,200,200,115,122.5,-130,122.5,190,205,215,215,537.5,7,SBD,Raw
M,120,Junior,Mattia Cravedi,118.91,195,210,222.5,222.5,120,125,130,130,210,225,255,255,607.5,4,SBD,Raw
M,83,Open,Mattia Del Bue,82.2,-145,-155,155,155,100,105,112.5,112.5,200,215,230,230,497.5,18,SBD,Raw
M,83,Junior,Mattia Ferro,82.41,130,-145,-145,130,75,82.5,-87.5,82.5,140,152.5,162.5,162.5,375,18,SBD,Raw
M,66,Junior,Mattia Hu,65.93,150,-160,160,160,97.5,105,110,110,160,170,177.5,177.5,447.5,1,SBD,Raw
M,74,Open,Mattia Passerini,71.77,140,-155,162.5,162.5,95,102.5,-110,102.5,180,192.5,205,205,470,16,SBD,Raw
M,93,Open,Mattia Perazzuolo,89.3,225,-230,-230,225,145,-150,155,155,280,-290,-290,280,660,4,SBD,Raw
M,93,Open,Mattia Scremin,91.11,155,-162.5,170,170,-95,95,-100,95,150,165,175,175,440,27,SBD,Raw
M,93,Open,Mattia Sileno,91.82,185,192.5,-200,192.5,130,-135,-135,130,205,212.5,-217.5,212.5,535,14,SBD,Raw
M,120,Junior,Mattia Tenerelli,110.89,160,172.5,185,185,125,135,-140,135,200,210,220,220,540,8,SBD,Raw
M,83,Open,Mattia Vitali,79.97,160,-167.5,170,170,117.5,122.5,-127.5,122.5,175,190,200,200,492.5,22,SBD,Raw
M,74,Open,Mattia Zanutto,73.49,175,-185,-185,175,140,147.5,-150,147.5,200,210,215,215,537.5,6,SBD,Raw
M,93,Open,Mauro Zampetti,91.96,160,180,195,195,-165,165,-175.5,165,235,245,255,255,615,6,SBD,Raw
M,105,Junior,Max Moduszewski,102.96,220,227.5,-245,227.5,140,147.5,-150,147.5,220,230,-240,230,605,2,SBD,Raw
M,74,Junior,Michele Cerioni,72.02,160,170,180,180,120,130,-132.5,130,180,195,205,205,515,3,SBD,Raw
M,105,Junior,Michele Coppede,96.4,115,122.5,127.5,127.5,85,92.5,-100,92.5,130,145,160,160,380,9,SBD,Raw
M,83,Master I,Michele Degiampietro,82.47,145,160,165,165,135,-145,-145,135,180,190,-200,190,490,6,SBD,Raw
M,74,Open,Michele Guerra,72.87,-155,155,-165,155,110,117.5,-120,117.5,200,210,-220,210,482.5,14,SBD,Raw
M,120+,Open,Michele Lestini,120.1,240,252.5,260,260,165,175,182.5,182.5,230,247.5,-272.5,247.5,690,2,SBD,Raw
M,93,Master I,Michele Lonardelli,85.26,200,210,-225,210,140,147.5,-152.5,147.5,240,-250.5,-251,240,597.5,1,SBD,Raw
M,74,Junior,Michele Masciave,73.3,-120,135,-145,135,-115,115,-120,115,180,190,-195,190,440,7,SBD,Raw
M,120+,Open,Michele Peluso,132.14,220,235,-245,235,165,175,180,180,240,260,-277.5,260,675,3,SBD,Raw
M,74,Open,Michele Rancini,73.5,175,185,190,190,102.5,-107.5,-107.5,102.5,235,250.5,-256,250.5,543,5,SBD,Raw
M,74,Open,Michele Simoni,72.64,135,-137.5,-150,135,-90,-100,-100,,,,,,,DQ,SBD,Raw
M,83,Open,Michele Torcasio,82.68,180,190,200,200,150,-160,-160,150,220,230,-245,230,580,6,SBD,Raw
M,83,Open,Mirco Brindani,76.23,105,-107.5,117.5,117.5,80,85,-90,85,160,180,200,200,402.5,43,SBD,Raw
M,59,Open,Moris Redini,58.31,-135,137.5,142.5,142.5,110,115,120.5,120.5,155,165,170,170,433,1,SBD,Raw
F,52,Junior,Munira Fornaciari,50.82,-92.5,-95.5,98.5,98.5,55,-60.5,-60.5,55,92.5,97.5,112.5,112.5,266,1,SBD,Raw
M,74,Open,Nico Carrara,72.75,150,155,-160,155,95,100,-102.5,100,200,-207.5,-207.5,200,455,18,SBD,Raw
F,63,Open,Nicol Feltrinelli,61.49,90,95,100,100,40,-45,45,45,100,-110,110,110,255,9,SBD,Raw
M,66,Master I,Nicola Bortone,64.55,132.5,-137.5,-137.5,132.5,92.5,95,-97,95,155,160,-170,160,387.5,2,SBD,Raw
M,105,Open,Nicola Marini,97.56,210,-220,-220,210,142.5,-147.5,-147.5,142.5,230,-240,240,240,592.5,10,SBD,Raw
M,93,Master I,Nicola Milli,90.56,165,170,-175,170,130,135,-140,135,225,232.5,-237.5,232.5,537.5,2,SBD,Raw
M,105,Junior,Nicola Pilia,103.17,175,182.5,-190,182.5,115,122.5,127.5,127.5,185,200,210,210,520,7,SBD,Raw
M,74,Master I,Nicola Porcu,73.35,120,130,-140,130,105,112.5,-117.5,112.5,-230,240,-260.5,240,482.5,2,SBD,Raw
M,83,Junior,Nicolo Fondaci,81.01,-195,195,-200,195,-125,125,130,130,180,195,205,205,530,8,SBD,Raw
M,83,Open,Nicolo Zaffani,79.86,-137.5,-137.5,137.5,137.5,115,120,127.5,127.5,180,-190,190,190,455,33,SBD,Raw
M,83,Open,Nikolla Gjeci,77.46,155,167.5,180,180,110,-115,-115,110,180,190,-195,190,480,24,SBD,Raw
F,63,Master I,Paola Migliacci,57.38,82.5,87.5,-95,87.5,62.5,-67.5,67.5,67.5,110,120,-135,120,275,2,SBD,Raw
F,84+,Master I,Paola Roccuzzo,92.45,140,147.5,152.5,152.5,70,75,-77.5,75,145,152.5,160,160,387.5,1,SBD,Raw
M,93,Open,Paolo Casotti,93,135,145,152.5,152.5,100,105,-107.5,105,165,175,182.5,182.5,440,28,SBD,Raw
M,93,Master II,Paolo Stefanelli,88.81,160,170,-175,170,90,-95,-95,90,170,-180,-180,170,430,2,SBD,Raw
F,57,Master I,Patrizia Gallo,56.83,-82.5,-86,86,86,50,-55,-57.5,50,125,136,-152,136,272,1,SBD,Raw
M,83,Sub-Junior,Piersilvio Falcone,79.81,135,-145,-145,135,77.5,82.5,87.5,87.5,140,157.5,-172.5,157.5,380,4,SBD,Raw
M,83,Open,Pietro Carlotto,82.95,190,202.5,207.5,207.5,130,-137.5,-137.5,130,220,232.5,240,240,577.5,7,SBD,Raw
M,83,Open,Pietro Selis,78.81,150,155,-160,155,-135,135,-137.5,135,190,200,210,210,500,17,SBD,Raw
M,74,Open,Pino Rocco Ciancia,72.94,177.5,190,200,200,122.5,130,135,135,220,240,251.5,251.5,586.5,1,SBD,Raw
M,74,Junior,René Bounaudo,71.53,130,135,-140,135,102.5,-107.5,-107.5,102.5,165,172.5,177.5,177.5,415,10,SBD,Raw
M,93,Junior,Riccardo D'Annunzio,86.81,150,165,-172.5,165,-80,87.5,-92.5,87.5,-160,175,-182.5,175,427.5,11,SBD,Raw
M,83,Open,Riccardo Focchiatti,79.04,180,-190,190,190,110,115,-120,115,195,210,215,215,520,11,SBD,Raw
M,93,Open,Roberto Biondi,87.84,140,150,162.5,162.5,110,115,120,120,155,167.5,175,175,457.5,25,SBD,Raw
M,120+,Open,Roberto Garigale,131.34,-185,-185,-185,,,,,,,,,,,DQ,SBD,Raw
M,74,Master III,Roberto Gianello,68.12,75,82.5,87.5,87.5,75,80.5,-82,80.5,165,171,-173.5,171,339,1,SBD,Raw
M,120,Open,Roberto Trapani,115.08,225,237.5,250,250,160,165,167.5,167.5,255,262.5,-277.5,262.5,680,4,SBD,Raw
M,93,Junior,Rocco Grillo,91.82,245,260.5,-270,260.5,160,170,175,175,260,-277.5,-277.5,260,695.5,1,SBD,Raw
F,47,Junior,Rosalba Di Vaia,46.54,-62.5,62.5,65,65,32.5,35,37.5,37.5,-70,70,75,75,177.5,2,SBD,Raw
M,83,Open,Salvatore Iodice,81.37,-135,-140,-142.5,,,,,,,,,,,DQ,SBD,Raw
M,93,Master III,Sandro Rossi,90.11,190,200,210,210,80,90,100,100,200,220,250.5,250.5,560.5,1,SBD,Raw
F,63,Open,Sara Baragatti,60.73,77.5,85,90,90,45,50,-52.5,50,117.5,122.5,-127.5,122.5,262.5,8,SBD,Raw
F,57,Junior,Sara Baratella,54.35,65,67.5,72.5,72.5,37.5,-40,40,40,92.5,-100,-100,92.5,205,2,SBD,Raw
F,72,Open,Sara Mazzantini,71.23,142.5,152.5,160,160,92.5,100,102.5,102.5,180,192.5,200,200,462.5,1,SBD,Raw
M,83,Open,Sebastiano Curreli,82.02,150,160,165,165,102.5,-110,-110,102.5,175,187.5,195,195,462.5,32,SBD,Raw
M,93,Open,Sergiy Blokhin,90.5,-147.5,-150,150,150,120,-130,-130,120,185,-200,-200,185,455,26,SBD,Raw
F,57,Junior,Silvia Naldi,52.78,90,92.5,95,95,-47.5,50,-52.5,50,95,100,102.5,102.5,247.5,1,SBD,Raw
F,47,Open,Silvia Priore,45.5,80,90,100,100,52.5,58,-62.5,58,100,110,-120,110,268,1,SBD,Raw
F,52,Open,Silvia Prosperi,51.12,-95,95,100,100,60,-65,-65,60,110,120,127.5,127.5,287.5,2,SBD,Raw
M,59,Sub-Junior,Simone Boselli,57.41,92.5,100.5,-105,100.5,60,-67.5,-67.5,60,127.5,135,142.5,142.5,303,3,SBD,Raw
M,74,Open,Simone Carli,73.97,172.5,-182.5,-185,172.5,75,-82.5,-82.5,75,200,220,230,230,477.5,15,SBD,Raw
M,74,Junior,Simone Carotenuto,69.65,120,125,-135,125,70,72.5,-77.5,72.5,140,150,155,155,352.5,11,SBD,Raw
M,93,Open,Simone Rubessi,90.06,210,222.5,-232.5,222.5,155,167.5,175,175,215,227.5,240,240,637.5,5,SBD,Raw
F,72,Open,Soledad Campostrini,68.32,125,135,142.5,142.5,97.5,105.5,-107.5,105.5,140,152.5,160,160,408,2,SBD,Raw
M,59,Junior,Stefano Bonura,56.87,112.5,115,122.5,122.5,82.5,87.5,-92.5,87.5,125,132.5,140,140,350,4,SBD,Raw
M,66,Master I,Stefano Costalunga,65.02,-115,115,-120,115,65,,,65,165,-175,177.5,177.5,357.5,3,SBD,Raw
M,83,Junior,Stefano Daniele,80.94,130,140,-150,140,95,102.5,107.5,107.5,170,180,187.5,187.5,435,13,SBD,Raw
M,83,Open,Stefano Mantovanelli,81.9,150,157.5,-160,157.5,110,-115,-120,110,160,170,-180,170,437.5,36,SBD,Raw
M,66,Junior,Stefano Riva,63.59,-130,130,-150,130,80,90,-100,90,140,150,160,160,380,6,SBD,Raw
M,83,Open,Stefano Robol,82.38,200,215,222.5,222.5,120,127.5,-130,127.5,230,245,257.5,257.5,607.5,3,SBD,Raw
F,63,Master I,Susanna Petroni,59.01,-99,100,105,105,60,63.5,65,65,123,128,133,133,303,1,SBD,Raw
F,84+,Open,Tamara Marabini,105.09,100,110,120,120,65,70,-72.5,70,115,130,140,140,330,1,SBD,Raw
F,47,Junior,Teresa Zappia,44.76,-72.5,-72.5,-72.5,,,,,,,,,,,DQ,SBD,Raw
M,83,Open,Thomas Gambella,77.63,165,175,185,185,115,-127.5,127.5,127.5,180,195,-202.5,195,507.5,14,SBD,Raw
M,83,Open,Tiziano Fendoni,78.71,185,-195,195,195,117.5,120,-122.5,120,190,200,-210,200,515,12,SBD,Raw
M,83,Junior,Tommaso Conti,79.42,-120,120,140,140,90,97.5,-102.5,97.5,120,130,140,140,377.5,17,SBD,Raw
M,83,Open,Tommaso Duvia,80.29,160,170,-175,170,145,152.5,-160,152.5,-180,180,190,190,512.5,13,SBD,Raw
M,83,Open,Umberto Fava,82.81,150,-160,165,165,-110,115,122.5,122.5,195,210,220,220,507.5,16,SBD,Raw
M,83,Open,Umberto Tagliasacchi,77.52,150,160,167.5,167.5,110,115,-117.5,115,180,192.5,197.5,197.5,480,25,SBD,Raw
F,84,Open,Valentina Barbieri,81.49,162.5,167.5,175,175,80,82.5,85,85,157.5,165,170,170,430,1,SBD,Raw
F,52,Open,Valentina Castiglione,51.48,95,102.5,-107.5,102.5,45,50,-52.5,50,110,115,120,120,272.5,3,SBD,Raw
F,63,Junior,Valentina Dell'Aversana,61.23,-85,-87.5,87.5,87.5,47.5,-50,-50,47.5,132.5,140,-150,140,275,2,SBD,Raw
F,52,Junior,Valentina Paratore,50.48,-75,77.5,-87.5,77.5,-32.5,37.5,-40,37.5,80,90,-100,90,205,5,SBD,Raw
F,57,Open,Valentina Presenti,54.79,112.5,117.5,-120,117.5,62.5,67.5,70,70,-130,130,-137.5,130,317.5,2,SBD,Raw
M,93,Open,Valentino Baccaglini,90,190,202.5,215,215,112.5,-117.5,-117.5,112.5,210,-222.5,222.5,222.5,550,13,SBD,Raw
M,105,Open,Valentino Durastanti,101.44,245,257.5,262.5,262.5,142.5,147.5,150,150,257.5,270,282.5,282.5,695,3,SBD,Raw
M,83,Open,Valentino Pinato,78.73,162.5,172.5,-177.5,172.5,95,-105,-105,95,195,205,210,210,477.5,27,SBD,Raw
F,63,Junior,Veronica Farace,61.95,-72.5,-72.5,-72.5,,,,,,,,,,,DQ,SBD,Raw
M,93,Open,Vincenzo Casillo,89.64,160,-170,170,170,110,-120,-120,110,170,185,190,190,470,24,SBD,Raw
F,57,Junior,Virginia Zamarra,56.9,65,-70,-70,65,-40,40,-45,40,75,80,-85,80,185,3,SBD,Raw
M,105,Open,Walter Foglia,99.16,200,215,-217.5,215,-175,175,-181,175,220,230,235,235,625,8,SBD,Raw
M,93,Junior,Anthony Cosano,92.53,,,,,210,220,-233.5,220,,,,,220,1,B,Single-ply
M,83,Junior,Matteo Ghirardello,81.85,,,,,190,-195.5,-195.5,190,,,,,190,1,B,Single-ply
M,105,Junior,Francesco Cimini,100.39,,,,,190,200,-212.5,200,,,,,200,1,B,Single-ply
M,93,Junior,Matteo Merlo,90.24,,,,,175,182.5,185,185,,,,,185,2,B,Single-ply
M,74,Junior,Michele Cerioni,72.95,,,,,150,160,-167.5,160,,,,,160,1,B,Single-ply
M,105,Junior,Andrea Missaggia,103.9,,,,,160,167.5,175,175,,,,,175,2,B,Single-ply
M,120,Junior,Giuseppe Gargiulo,112.35,,,,,130,135,-140,135,,,,,135,1,B,Single-ply
M,74,Junior,Alessio Zedda,71.73,,,,,-130,-130,-130,,,,,,,DQ,B,Single-ply
M,66,Open,Salvatore Pisasale,65.75,,,,,-185,-185,185,185,,,,,185,1,B,Single-ply
M,66,Open,Mouchine El Boujaoudi,60.19,,,,,135,140,145,145,,,,,145,2,B,Single-ply
M,74,Open,Marco Casuscelli,72.55,,,,,155,160,165,165,,,,,165,1,B,Single-ply
M,74,Open,Jonathan Andreatta,73.55,,,,,150,-157.5,-157.5,150,,,,,150,2,B,Single-ply
M,59,Open,Valerio Oldani,57.06,,,,,-115,115,-120,115,,,,,115,1,B,Single-ply
M,74,Open,Alessandro Malaspina,72.07,,,,,-120,120,-125,120,,,,,120,3,B,Single-ply
M,74,Open,Jacopo Fantuzzi,73.07,,,,,-165,-165,-170,,,,,,,DQ,B,Single-ply
M,83,Open,Niccolò De Giovanni,80.66,,,,,-200,200,-220.5,200,,,,,200,1,B,Single-ply
M,83,Open,Mirco Balzan,77.82,,,,,175,-180,180,180,,,,,180,2,B,Single-ply
M,83,Open,Andrea Garavaglia,81.17,,,,,175,180,-185,180,,,,,180,3,B,Single-ply
M,83,Open,Manuel Ricciuto,75.83,,,,,135,140,145,145,,,,,145,4,B,Single-ply
M,83,Open,Stefano Masiello,82.5,,,,,125,-130,-130,125,,,,,125,5,B,Single-ply
M,83,Open,Simone Panizza,82.3,,,,,-155,-155,-155,,,,,,,DQ,B,Single-ply
M,83,Open,Fabio Nadotti,82.26,,,,,-120,-120,-120,,,,,,,DQ,B,Single-ply
M,93,Open,Domingo Poliandri,90.53,,,,,230,-240,-240,230,,,,,230,1,B,Single-ply
M,93,Open,Simone Alberico,88,,,,,200,210,-227.5,210,,,,,210,2,B,Single-ply
M,93,Open,Luigi Falcone,85.68,,,,,175,-182.5,187.5,187.5,,,,,187.5,4,B,Single-ply
M,93,Open,Stefano Ramponi,88.24,,,,,185,190,-195,190,,,,,190,3,B,Single-ply
M,93,Open,Alessio Masala,88.35,,,,,-160,160,-165,160,,,,,160,5,B,Single-ply
M,93,Open,Alberto Famiano,92.12,,,,,-152.5,-155,-155,,,,,,,DQ,B,Single-ply
M,120,Open,Davide Nicolin,109.05,,,,,240,255,-271,255,,,,,255,1,B,Single-ply
M,105,Open,Juan Carlos Pereyra,97.19,,,,,225,-232.5,-232.5,225,,,,,225,1,B,Single-ply
M,105,Open,Giuseppe Veraldi,100.29,,,,,200,210,-220,210,,,,,210,2,B,Single-ply
M,105,Open,Andrea Mirabelli,102.79,,,,,202.5,210,-212.5,210,,,,,210,3,B,Single-ply
M,120,Open,Luca Cinelli,106.73,,,,,195,200,210,210,,,,,210,2,B,Single-ply
M,105,Open,Vincenzo Cusanno,94.28,,,,,180,190,-200,190,,,,,190,4,B,Single-ply
M,105,Open,Marco Redaelli,98.68,,,,,165,170,180,180,,,,,180,5,B,Single-ply
M,120,Open,Alessandro Artuso,109.45,,,,,155,-162.5,162.5,162.5,,,,,162.5,3,B,Single-ply
M,120+,Open,Andrea Rizzotto,120.3,,,,,-160,160,-175,160,,,,,160,1,B,Single-ply
M,120,Open,Davide Zappoli,108.75,,,,,102.5,107.5,-110,107.5,,,,,107.5,4,B,Single-ply
M,105,Open,Valerio Vaccaro,100.07,,,,,-260,-270.5,-270.5,,,,,,,DQ,B,Single-ply
M,105,Open,Antonio Contenta,100.29,,,,,-232.5,-232.5,-232.5,,,,,,,DQ,B,Single-ply
M,120+,Master I,Luigi Brivio,120.07,,,,,210.5,-220,-220,210.5,,,,,210.5,2,B,Single-ply
M,120+,Master I,Massimo Conti,131.7,,,,,200,210,211,211,,,,,211,1,B,Single-ply
M,105,Master I,Flavio Zilio,101.14,,,,,-180,180,185,185,,,,,185,1,B,Single-ply
M,93,Master I,Gregory Schillaci,88.8,,,,,167.5,-172.5,172.5,172.5,,,,,172.5,1,B,Single-ply
M,93,Master I,Fabio Fulvi,87.49,,,,,160,-165,-165,160,,,,,160,2,B,Single-ply
M,120+,Master II,Bartolomeo Lalario,120.01,,,,,185,190.5,-200,190.5,,,,,190.5,1,B,Single-ply
M,66,Master II,Franco Bonato,63.4,,,,,120,130,-135,130,,,,,130,1,B,Single-ply
M,93,Master II,Claudio Portugalli,90.15,,,,,130,135,-140,135,,,,,135,1,B,Single-ply
M,66,Master II,Luca Cenacchi,64,,,,,100,-105,-105,100,,,,,100,2,B,Single-ply
M,66,Master III,Lorenzo Costa,61.46,,,,,82.5,90,-92.5,90,,,,,90,1,B,Single-ply
M,120+,Master IV,Pier Gianni Prosperini,135.37,,,,,90,-100,110,110,,,,,110,1,B,Single-ply
F,72,Junior,Martina Zellino,66.41,,,,,95,-97.5,-97.5,95,,,,,95,1,B,Single-ply
F,57,Junior,Sabrina Mancini,56.8,,,,,75,82.5,-87.5,82.5,,,,,82.5,1,B,Single-ply
F,84,Junior,Silvia Marostica,74.37,,,,,77.5,80,-85,80,,,,,80,1,B,Single-ply
F,57,Open,Valentina Presenti,54.53,,,,,-91,91,97,97,,,,,97,1,B,Single-ply
F,57,Open,Margherita Gurrieri,53.78,,,,,50,52.5,55,55,,,,,55,2,B,Single-ply
F,57,Open,Chiara Di Trani,56.29,,,,,-90,-90,-90,,,,,,,DQ,B,Single-ply
F,57,Open,Federica Iannibelli,54.84,,,,,-70,-70,-70,,,,,,,DQ,B,Single-ply
F,72,Open,Sara Mazzantini,71.32,,,,,122.5,125,-127.5,125,,,,,125,1,B,Single-ply
F,72,Open,Eleonora Marzadro,69.51,,,,,112.5,117.5,-125,117.5,,,,,117.5,2,B,Single-ply
F,63,Open,Whelma Pineda,62.3,,,,,95,-100,-100,95,,,,,95,1,B,Single-ply
F,72,Open,Chiara Burchi,64.02,,,,,80,85,-90,85,,,,,85,3,B,Single-ply
F,63,Open,Alice Cappello,62.48,,,,,-95,-100,-100,,,,,,,DQ,B,Single-ply
F,63,Open,Giada Flamini,61.08,,,,,-80,-80,-80,,,,,,,DQ,B,Single-ply
F,57,Master I,Tiziana Troilo,57,,,,,87.5,-95,98,98,,,,,98,1,B,Single-ply
F,47,Master I,Barbara Peti,46.19,,,,,70,75,-80,75,,,,,75,1,B,Single-ply
F,52,Master I,Anna Stenghel,50.9,,,,,65,70,-75,70,,,,,70,1,B,Single-ply
F,57,Master I,Francesca Leoni,52.99,,,,,-55,57.5,-60,57.5,,,,,57.5,2,B,Single-ply
F,72,Master II,Antonietta Orsini,63.07,,,,,130,-135,-135,130,,,,,130,1,B,Single-ply
F,52,Master II,Manuela Stucchi,50.22,,,,,-80,80,-85,80,,,,,80,1,B,Single-ply
F,63,Master II,Nicoletta Perego,60.44,,,,,82.5,-87.5,-87.5,82.5,,,,,82.5,1,B,Single-ply
F,84,Master III,Sara Del Duca,73.05,,,,,90,95,-101.5,95,,,,,95,1,B,Single-ply
