Division,WeightClassKg,Place,Name,Team,BodyweightKg,Best3SquatKg,Best3BenchKg,Best3DeadliftKg,TotalKg,Equipment,Event,Sex,BirthDate
Boys,51.71,1,Greg Munoz,Premont,48.99,108.86,65.77,129.27,303.91,Unlimited,SBD,M,
Boys,51.71,2,Benjamin Ruiz,Laredo Nixon,51.71,52.16,43.09,83.91,179.17,Unlimited,SBD,M,
Boys,51.71,3,Aaron Trevino,Laredo Alexander,44.91,61.23,38.56,77.11,176.9,Unlimited,SBD,M,
Boys,55.79,1,Joaquín Romero,Laredo Alexander,55.34,129.27,79.38,133.81,342.46,Unlimited,SBD,M,
Boys,55.79,2,Josef Tobias,Laredo Nixon,54.88,95.25,61.23,115.67,272.16,Unlimited,SBD,M,
Boys,55.79,DQ,Zaydin Espinoza,Mathis,55.79,,,,,Unlimited,SBD,M,
Boys,59.87,1,David Salinas,Corpus Christi Calallen,59.42,158.76,117.93,170.1,446.79,Unlimited,SBD,M,
Boys,59.87,2,Sean Lamas,Premont,56.7,156.49,77.11,174.63,408.23,Unlimited,SBD,M,
Boys,59.87,3,Shalom Vega,Mathis,58.97,142.88,99.79,165.56,408.23,Unlimited,SBD,M,
Boys,59.87,4,J-Den Martinez,Mathis,59.42,158.76,83.91,136.08,378.75,Unlimited,SBD,M,
Boys,59.87,5,Romeo Pena,Premont,58.51,124.74,81.65,154.22,360.61,Unlimited,SBD,M,
Boys,59.87,6,Brennan Keese,Skidmore-Tynan,59.87,133.81,61.23,136.08,331.12,Unlimited,SBD,M,
Boys,59.87,7,Diego Pulido,Laredo Nixon,58.51,117.93,52.16,142.88,312.98,Unlimited,SBD,M,
Boys,59.87,8,Benjamin Casterline,Corpus Christi Calallen,58.97,102.06,81.65,115.67,299.37,Unlimited,SBD,M,
Boys,67.13,1,Gadiel Andrade,Laredo United,66.22,231.33,142.88,249.48,623.69,Unlimited,SBD,M,
Boys,67.13,2,Roel Gonzalez,Alice,67.13,217.72,131.54,197.31,546.58,Unlimited,SBD,M,
Boys,67.13,3,Manny Vega,Premont,63.05,179.17,99.79,163.29,442.25,Unlimited,SBD,M,
Boys,67.13,4,Ramon Mejia,Laredo Alexander,60.78,149.69,111.13,149.69,410.5,Unlimited,SBD,M,
Boys,67.13,5,Carson Lopez,Ingleside,63.5,161.03,83.91,145.15,390.09,Unlimited,SBD,M,
Boys,67.13,6,Emiliano Hernandez,Laredo Nixon,66.68,133.81,72.57,151.95,358.34,Unlimited,SBD,M,
Boys,67.13,7,Tobias Alaniz,Premont,67.13,133.81,63.5,154.22,351.53,Unlimited,SBD,M,
Boys,67.13,8,Cody Mcalister,Laredo United,60.33,102.06,65.77,120.2,288.03,Unlimited,SBD,M,
Boys,67.13,DQ,Isreal Gibson,Banquete,67.13,,,,,Unlimited,SBD,M,
Boys,67.13,DQ,Davy Rodriguez,Mathis,67.13,,,,,Unlimited,SBD,M,
Boys,67.13,DQ,Exzavier Ybarra,Mathis,67.13,,,,,Unlimited,SBD,M,
Boys,67.13,DQ,Silas Diaz,Laredo Alexander,67.13,,,,,Unlimited,SBD,M,
Boys,74.84,1,Aaron Acosta,Mathis,72.48,235.87,158.76,235.87,630.49,Unlimited,SBD,M,
Boys,74.84,2,Duke Bernal,Mathis,74.39,226.8,147.42,192.78,566.99,Unlimited,SBD,M,
Boys,74.84,3,Aiden Martinez,Banquete,68.49,156.49,117.93,197.31,471.74,Unlimited,SBD,M,
Boys,74.84,4,Anthonie Cordova,Ingleside,71.67,161.03,108.86,183.7,453.59,Unlimited,SBD,M,
Boys,74.84,5,Victor Luna,Corpus Christi Calallen,69.4,174.63,122.47,142.88,439.98,Unlimited,SBD,M,
Boys,74.84,6,Marcus Barron,Ingleside,69.4,154.22,102.06,145.15,401.43,Unlimited,SBD,M,
Boys,74.84,7,Jesus Gonzalez,Laredo Alexander,73.48,133.81,106.59,158.76,399.16,Unlimited,SBD,M,
Boys,74.84,8,Avery Jesus Becerra,Laredo United,68.95,147.42,79.38,151.95,378.75,Unlimited,SBD,M,
Boys,74.84,9,Josue Garza,Corpus Christi Calallen,71.21,124.74,79.38,131.54,335.66,Unlimited,SBD,M,
Boys,74.84,DQ,Hayden Cameron,Banquete,74.84,,,,,Unlimited,SBD,M,
Boys,74.84,DQ,Mike Mendoza,Laredo United,74.84,,,,,Unlimited,SBD,M,
Boys,82.1,1,Alec Perez,Corpus Christi Calallen,81.65,165.56,117.93,188.24,471.74,Unlimited,SBD,M,
Boys,82.1,2,Mauricio Parra,Ben Bolt-Palito Blanco,81.65,188.24,102.06,176.9,467.2,Unlimited,SBD,M,
Boys,82.1,3,Caiden Payne,Corpus Christi Calallen,78.93,176.9,102.06,172.37,451.32,Unlimited,SBD,M,
Boys,82.1,4,Jesse Gonzalez,Laredo United,77.56,106.59,70.31,151.95,328.85,Unlimited,SBD,M,
Boys,82.1,DQ,Xavier Morin,Mathis,82.1,,,,,Unlimited,SBD,M,
Boys,82.1,DQ,Ismael Cavazos,Laredo Alexander,82.1,,,,,Unlimited,SBD,M,
Boys,82.1,DQ,Isaac Rivas,Mathis,82.1,,,,,Unlimited,SBD,M,
Boys,89.81,1,Damion Trevino,Mathis,86.18,231.33,165.56,235.87,632.76,Unlimited,SBD,M,
Boys,89.81,2,Mario Garibay,Laredo Alexander,87.54,217.72,156.49,231.33,605.55,Unlimited,SBD,M,
Boys,89.81,3,Ryan Castillo,Laredo Nixon,88.45,181.44,136.08,215.46,532.97,Unlimited,SBD,M,
Boys,89.81,4,Ayden Medellin,Corpus Christi Calallen,89.81,163.29,111.13,185.97,460.4,Unlimited,SBD,M,
Boys,89.81,5,Emilio Martinez,Ingleside,83.91,154.22,108.86,195.04,458.13,Unlimited,SBD,M,
Boys,89.81,6,Dante Del Toro,Laredo United,85.73,142.88,88.45,167.83,399.16,Unlimited,SBD,M,
Boys,89.81,7,Joaquin Padron,Corpus Christi Calallen,88,133.81,102.06,151.95,387.82,Unlimited,SBD,M,
Boys,89.81,8,Julian Guiteirrez,Skidmore-Tynan,87.09,133.81,86.18,136.08,356.07,Unlimited,SBD,M,
Boys,89.81,DQ,Jonathan Ryan White,Laredo United,89.81,,,,,Unlimited,SBD,M,
Boys,89.81,DQ,Emilio Patino,Laredo United,83.46,,,,,Unlimited,SBD,M,
Boys,99.79,1,Emmanuel Martinez,Corpus Christi Calallen,98.43,224.53,142.88,201.85,569.26,Unlimited,SBD,M,
Boys,99.79,2,Cael Cantu,Banquete,93.44,183.7,113.4,195.04,492.15,Unlimited,SBD,M,
Boys,99.79,3,Gilbert Deleon,Ben Bolt-Palito Blanco,94.8,204.12,104.33,183.7,492.15,Unlimited,SBD,M,
Boys,99.79,4,Danny Garcia,Banquete,98.88,183.7,104.33,197.31,485.34,Unlimited,SBD,M,
Boys,99.79,5,Simon Pena,Mathis,94.35,176.9,117.93,167.83,462.66,Unlimited,SBD,M,
Boys,99.79,6,Izaiah Gomez,Banquete,91.63,136.08,83.91,136.08,356.07,Unlimited,SBD,M,
Boys,99.79,7,Omar Valdez,Laredo Nixon,90.72,106.59,65.77,136.08,308.44,Unlimited,SBD,M,
Boys,99.79,DQ,Jorge Saldana,Laredo Alexander,99.79,,,,,Unlimited,SBD,M,
Boys,99.79,DQ,Jacob Sanchez,Laredo United,97.98,165.56,,,,Unlimited,SBD,M,
Boys,99.79,DQ,Jacob Edgington,Banquete,99.79,,,,,Unlimited,SBD,M,
Boys,109.77,1,Onyx Benavidez,Laredo Alexander,100.7,229.06,167.83,231.33,628.23,Unlimited,SBD,M,
Boys,109.77,2,Cameron Garcia,Three Rivers,101.15,199.58,167.83,190.51,557.92,Unlimited,SBD,M,
Boys,109.77,3,Tyler Fox,Banquete,105.69,204.12,136.08,195.04,535.24,Unlimited,SBD,M,
Boys,109.77,DQ,Zane Wills,Banquete,104.33,,,,,Unlimited,SBD,M,
Boys,109.77,DQ,Jacob Shephard,Corpus Christi Calallen,109.77,,,,,Unlimited,SBD,M,
Boys,124.74,1,Alex Botello,Alice,122.02,294.84,142.88,242.67,680.39,Unlimited,SBD,M,
Boys,124.74,2,Logan McGrath,Ingleside,115.67,265.35,174.63,213.19,653.17,Unlimited,SBD,M,
Boys,124.74,3,Christopher Goodman,Ben Bolt-Palito Blanco,117.03,272.16,170.1,201.85,644.1,Unlimited,SBD,M,
Boys,124.74,4,Mikey Carranza,Mathis,124.28,233.6,133.81,181.44,548.85,Unlimited,SBD,M,
Boys,124.74,5,Adam Madrigal,Laredo Alexander,112.94,215.46,156.49,172.37,544.31,Unlimited,SBD,M,
Boys,124.74,6,Hugo Fraire,Laredo Nixon,116.57,170.1,97.52,165.56,433.18,Unlimited,SBD,M,
Boys,124.74,7,Xavier Perry,Premont,115.67,111.13,74.84,181.44,367.41,Unlimited,SBD,M,
Boys,124.74,DQ,Bryan Mata,Laredo Alexander,124.74,,,,,Unlimited,SBD,M,
Boys,124.74,DQ,Andre Hernandez,Laredo United,117.48,,,,,Unlimited,SBD,M,
Boys,139.71,DQ,Javier Pulido,Laredo Alexander,139.71,,,,,Unlimited,SBD,M,
Boys,139.71+,1,Miggy Saenz,Alice,146.06,299.37,192.78,238.14,730.28,Unlimited,SBD,M,
Boys,139.71+,2,Dalton Romo,Three Rivers,183.25,136.08,88.45,161.03,385.55,Unlimited,SBD,M,
Boys,139.71+,DQ,Gregorio Miguel Lira,Laredo United,165.11,,,,,Unlimited,SBD,M,
