Name,BirthDate,Division,BodyweightKg,WeightClassKg,Squat1Kg,Squat2Kg,Squat3Kg,Best3SquatKg,Bench1Kg,Bench2Kg,Bench3Kg,Best3BenchKg,Deadlift1Kg,Deadlift2Kg,Deadlift3Kg,Best3DeadliftKg,TotalKg,State,Place,Event,Equipment,Sex
Alex Galant,1947-05-13,M-M3a,55.5,56,95,137.5,145,145,45,67.5,-75,67.5,95,142.5,152.5,152.5,365,CO,1,SBD,Single-ply,M
Eric Kupperstein,1966-04-01,M-M1a,59.7,60,210,225,235,235,120,127.5,132.5,132.5,237.5,252.5,-267.5,252.5,620,MA,1,SBD,Single-ply,M
Brian Foddrill,1964-04-09,M-M1a,59.9,60,165,180,-185,180,112.5,120,-125,120,205,-222.5,-222.5,205,505,MI,2,SBD,Single-ply,M
Kevin Jones #11,1962-07-10,M-M1b,59.7,60,-175,175,180,180,107.5,115,120,120,167.5,180,-185,180,480,TX,1,SBD,Single-ply,M
Robert Trujillo #1,1944-09-27,M-M3a,59.1,60,-150,150,160,160,100,102.5,-105,102.5,187.5,-200,-200,187.5,450,CO,1,SBD,Single-ply,M
Mike Lawson,1941-02-20,M-M3b,59.9,60,-105,105,-155,105,-97.5,97.5,-100,97.5,140,155,-185,155,357.5,IL,1,SBD,Single-ply,M
Dillon Maier,1935-03-14,M-M4a,59.3,60,92.5,105,117.5,117.5,52.5,-57.5,57.5,57.5,137.5,-155,160,160,335,FL,1,SBD,Single-ply,M
Brian Sato,1962-02-26,M-M1b,67.3,67.5,192.5,-210,210,210,125,-140,-140,125,202.5,-222.5,222.5,222.5,557.5,CO,1,SBD,Single-ply,M
Steve Lewis,1962-07-27,M-M1b,66.6,67.5,190,200,210,210,-125,-130,132.5,132.5,195,205,-215,205,547.5,MO,2,SBD,Single-ply,M
Paul Mears #1,1953-05-29,M-M2a,66.5,67.5,162.5,-172.5,-172.5,162.5,-92.5,92.5,-100,92.5,182.5,-190,190,190,445,MA,1,SBD,Single-ply,M
Richard Blaumuller,1952-06-25,M-M2b,66,67.5,-107.5,-107.5,-107.5,,,,,,,,,,,MS,DQ,SBD,Single-ply,M
Jeff Jacobs,1947-01-17,M-M3a,66.6,67.5,182.5,195,-200,195,-107.5,107.5,112.5,112.5,-200,200,217.5,217.5,525,NY,1,SBD,Single-ply,M
James Yeats,1944-09-07,M-M3a,67.4,67.5,150,160,165,165,87.5,92.5,97.5,97.5,175,192.5,202.5,202.5,465,IN,2,SBD,Single-ply,M
Robert Coleman,1948-01-20,M-M3a,62.5,67.5,110,122.5,127.5,127.5,60,62.5,67.5,67.5,125,140,145,145,340,GA,3,SBD,Single-ply,M
Jack Wolff #1,1938-07-01,M-M3b,65.1,67.5,115,125,132.5,132.5,70,80,-87.5,80,170,-177.5,177.5,177.5,390,NJ,1,SBD,Single-ply,M
Richard Nolan,1926-07-03,M-M5a,65.2,67.5,62.5,67.5,-70,67.5,55,60,62.5,62.5,107.5,120,125,125,255,NY,1,SBD,Single-ply,M
John D'Alessio,1968-06-20,M-G,74.5,75,227.5,240,247.5,247.5,152.5,162.5,167.5,167.5,240,252.5,-257.5,252.5,667.5,NJ,G,SBD,Single-ply,M
Donovan Thompson,1966-05-17,M-M1a,74.5,75,-232.5,237.5,245,245,-185,190,-195,190,205,220,235,235,670,NC,1,SBD,Single-ply,M
Mike Stanley,1963-08-01,M-M1a,74.5,75,-212.5,212.5,-225,212.5,142.5,152.5,157.5,157.5,237.5,257.5,-265,257.5,627.5,SC,2,SBD,Single-ply,M
Greg Page,1963-03-25,M-M1b,74.8,75,235,250,260,260,160,167.5,177.5,177.5,245,262.5,-267.5,262.5,700,OH,1,SBD,Single-ply,M
Mark Sigala,1961-06-18,M-M1b,72.9,75,210,222.5,-227.5,222.5,142.5,147.5,-150,147.5,250,-270,-277.5,250,620,CO,2,SBD,Single-ply,M
Carlos Lewis,1958-07-02,M-M1b,74.5,75,230,-245,250,250,-145,-145,145,145,-200,-200,,,,TX,DQ,SBD,Single-ply,M
Pete Long,1956-01-30,M-M2a,74.8,75,192.5,207.5,215,215,-125,-125,-125,,215,227.5,237.5,237.5,,MD,DQ,SBD,Single-ply,M
Gregory Klein,1951-11-05,M-M2b,74.6,75,195,215,-230,215,115,-125,-125,115,230,250,-260,250,580,IL,1,SBD,Single-ply,M
Joe Rizza,1949-07-14,M-M2b,74.2,75,165,175,185,185,62.5,67.5,72.5,72.5,165,175,185,185,442.5,MA,2,SBD,Single-ply,M
Robert Sainati,1945-02-28,M-M3a,73.9,75,130,135,-140,135,-70,-75,-75,,-170,,,,,MN,DQ,SBD,Single-ply,M
Sam Alduenda,1942-11-27,M-M3b,73.4,75,160,167.5,175,175,117.5,125,130,130,185,210,222.5,222.5,527.5,CA,1,SBD,Single-ply,M
Ben Brent,1937-11-14,M-M4a,74,75,-177.5,-177.5,177.5,177.5,80,87.5,92.5,92.5,-200,200,210,210,480,AK,1,SBD,Single-ply,M
Robert Mattison,1937-05-04,M-M4a,70.5,75,100,-120,-120,100,95,-107.5,-107.5,95,170,195,,195,390,CA,2,SBD,Single-ply,M
Dan Godwin,1932-01-13,M-M4b,71.8,75,70,85,-87.5,85,70,-75,-75,70,117.5,125,142.5,142.5,297.5,NE,1,SBD,Single-ply,M
Fred Archambault,1923-04-15,M-M5b,73.1,75,150,160,-170,160,85,-90,-90,85,-165,165,175,175,420,NH,1,SBD,Single-ply,M
Laddie Gibson,1965-02-07,M-M1a,82,82.5,245,267.5,-277.5,267.5,192.5,212.5,217.5,217.5,272.5,307.5,,307.5,792.5,NY,1,SBD,Single-ply,M
Richard Wenner,1963-10-19,M-M1a,82,82.5,205,222.5,235,235,142.5,157.5,165,165,215,232.5,242.5,242.5,642.5,AZ,2,SBD,Single-ply,M
Bill Scully,1958-09-16,M-M1b,82.2,82.5,245,260,267.5,267.5,152.5,-165,165,165,247.5,-252.5,260,260,692.5,NJ,1,SBD,Single-ply,M
Frank Agos,1962-10-08,M-M1b,82.3,82.5,182.5,192.5,197.5,197.5,145,-150,-150,145,237.5,250,255,255,597.5,CO,2,SBD,Single-ply,M
Joe Braca,1962-11-28,M-M1b,81,82.5,240,252.5,260,260,-165,-165,-165,,275,,,275,,PA,DQ,SBD,Single-ply,M
Randy Stone,1956-08-24,M-M2a,81.5,82.5,237.5,-247.5,247.5,247.5,160,175,-177.5,175,245,252.5,255,255,677.5,MO,1,SBD,Single-ply,M
Arthur Little,1955-04-11,M-M2a,75.4,82.5,237.5,255,-260,255,122.5,-127.5,,122.5,257.5,267.5,277.5,277.5,655,MI,2,SBD,Single-ply,M
Aaron Byas,1954-10-06,M-M2a,82.4,82.5,-222.5,230,-235,230,-140,-140,140,140,250,275,-287.5,275,645,FL,3,SBD,Single-ply,M
Bill Clayton,1953-11-12,M-M2a,81.9,82.5,167.5,187.5,-195,187.5,137.5,145,150,150,197.5,-212.5,-212.5,197.5,535,NJ,4,SBD,Single-ply,M
William Kellett,1957-05-20,M-M2a,79.5,82.5,,,,,,,,,,,,,,SC,DQ,SBD,Single-ply,M
Jim Klostergaard,1948-08-22,M-M2b,82.4,82.5,175,-185,,175,165,-172.5,172.5,172.5,150,175,190,190,537.5,TX,1,SBD,Single-ply,M
Gregory Saxon,1953-04-11,M-M2b,80,82.5,147.5,165,-182.5,165,102.5,-117.5,,102.5,192.5,205,-215,205,472.5,OH,2,SBD,Single-ply,M
Walter Terry,1951-10-24,M-M2b,81.7,82.5,142.5,155,-167.5,155,120,125,-132.5,125,170,-180,-180,170,450,WA,3,SBD,Single-ply,M
Roberto Contreras #2,1947-03-08,M-M3a,81,82.5,195,210,-217.5,210,-137.5,142.5,-150,142.5,217.5,230,-240,230,582.5,TX,1,SBD,Single-ply,M
Bill Weinstock,1946-10-15,M-M3a,78.2,82.5,165,177.5,182.5,182.5,87.5,92.5,-95,92.5,200,215,-220,215,490,CA,2,SBD,Single-ply,M
Jack Stevens,1945-10-27,M-M3a,80.3,82.5,150,162.5,182.5,182.5,-92.5,92.5,97.5,97.5,185,205,-215,205,485,FL,3,SBD,Single-ply,M
Nairanjan Singh,1945-10-20,M-M3a,82.5,82.5,-130,-142.5,142.5,142.5,-85,-100,105,105,175,-182.5,-182.5,175,422.5,MD,4,SBD,Single-ply,M
Alan Tepper,1945-07-10,M-M3a,79.8,82.5,-140,140,160,160,-120,-127.5,-127.5,,182.5,192.5,-200,192.5,,WA,DQ,SBD,Single-ply,M
Jim Lyons,1940-09-12,M-M3b,81.1,82.5,170,182.5,192.5,192.5,107.5,117.5,122.5,122.5,170,182.5,-190,182.5,497.5,TX,1,SBD,Single-ply,M
Richard Schuller,1940-06-03,M-M3b,81.8,82.5,167.5,-180,180,180,105,112.5,-117.5,112.5,182.5,195,205,205,497.5,WA,2,SBD,Single-ply,M
Dan Martin,1940-05-31,M-M3b,81.5,82.5,-200,-200,200,200,-122.5,-130,-130,,,,,,,NV,DQ,SBD,Single-ply,M
Craig Terry,1964-09-11,M-M1a,89.1,90,280,300,307.5,307.5,155,165,-175,165,312.5,337.5,-345,337.5,810,MI,1,SBD,Single-ply,M
Jim Brown,1965-08-27,M-M1a,89.4,90,280,292.5,300,300,210,-217.5,-220,210,237.5,252.5,257.5,257.5,767.5,PA,2,SBD,Single-ply,M
Rick Johnson,1963-12-04,M-M1a,89.4,90,205,215,-225,215,122.5,127.5,-132.5,127.5,240,250,-265,250,592.5,MA,3,SBD,Single-ply,M
Ivan Valentin,1963-11-17,M-M1a,88.5,90,-210,210,-220,210,152.5,-157.5,-157.5,152.5,210,225,-232.5,225,587.5,TX,4,SBD,Single-ply,M
Brian Burnbaum,1964-02-29,M-M1a,84.2,90,130,-142.5,150,150,120,-137.5,-137.5,120,160,185,-192.5,185,455,FL,5,SBD,Single-ply,M
Mike Jarrett,1965-02-17,M-M1a,88.1,90,-265,,,,,,,,,,,,,OH,DQ,SBD,Single-ply,M
Greg Jones #1,1961-06-12,M-M1b,90,90,295,-305,305,305,-212.5,212.5,-217.5,212.5,290,295,300,300,817.5,GA,1,SBD,Single-ply,M
Anthony Hambric #2,1962-04-20,M-M1b,85.1,90,212.5,227.5,242.5,242.5,120,130,132.5,132.5,237.5,260,272.5,272.5,647.5,TX,2,SBD,Single-ply,M
Ron Falcone,1961-11-16,M-M1b,88.8,90,227.5,240,-250,240,165,-180,-182.5,165,210,-225,225,225,630,NJ,3,SBD,Single-ply,M
Jeff Monahos,1959-06-04,M-M1b,89.7,90,232.5,255,262.5,262.5,137.5,-165,-165,137.5,210,230,-240,230,630,WI,4,SBD,Single-ply,M
Jerry Dally,1960-09-03,M-M1b,89.7,90,230,242.5,-255,242.5,137.5,-147.5,147.5,147.5,237.5,-272.5,-272.5,237.5,627.5,NJ,5,SBD,Single-ply,M
Mike Bridges,1957-02-01,M-M2a,89.5,90,240,255,,255,182.5,200,210,210,227.5,272.5,290,290,755,IL,1,SBD,Single-ply,M
Kent Walton,1957-07-15,M-M2a,84.7,90,197.5,-215,-220,197.5,127.5,137.5,-142.5,137.5,217.5,230,237.5,237.5,572.5,NC,2,SBD,Single-ply,M
Gary Grahn,1955-11-17,M-M2a,89.2,90,185,200,212.5,212.5,140,145,-150,145,185,200,215,215,572.5,MN,3,SBD,Single-ply,M
Delvan Worley,1949-04-18,M-M2b,89.8,90,225,240,-245,240,90,-95,-95,90,-225,225,-240,225,555,CO,1,SBD,Single-ply,M
Mick Stevens,1950-05-20,M-M2b,88,90,160,-172.5,-172.5,160,102.5,110,115,115,202.5,-217.5,-217.5,202.5,477.5,WA,2,SBD,Single-ply,M
Ray Penland,1952-01-12,M-M2b,88.3,90,-172.5,-172.5,-195,,,,,,,,,,,FL,DQ,SBD,Single-ply,M
Fred Rice,1944-12-18,M-M3a,89.3,90,210,227.5,,227.5,102.5,-110,-110,102.5,245,-257.5,265,265,595,AL,1,SBD,Single-ply,M
Bill Lindsey,1946-03-10,M-M3a,88.1,90,200,-215,215,215,170,177.5,-182.5,177.5,160,192.5,200,200,592.5,VA,2,SBD,Single-ply,M
Jim Yakubovsky,1947-05-01,M-M3a,88.7,90,205,-220,-220,205,-115,115,125,125,200,220,227.5,227.5,557.5,TX,3,SBD,Single-ply,M
Bugs Bayer,1945-07-29,M-M3a,88.3,90,227.5,237.5,242.5,242.5,-107.5,-107.5,-107.5,,,,,,,PA,DQ,SBD,Single-ply,M
Scott Waits,1965-08-08,M-M1a,98.8,100,-312.5,320,-330,320,-215,215,-217.5,215,265,277.5,290,290,825,NV,1,SBD,Single-ply,M
Daniel Mahan,1966-07-11,M-M1a,98.9,100,270,285,-297.5,285,160,165,-170,165,270,287.5,-305,287.5,737.5,CA,2,SBD,Single-ply,M
Bruce Thomas,1963-05-16,M-M1a,97.2,100,242.5,272.5,,272.5,145,155,-165,155,242.5,275,-280,275,702.5,KY,3,SBD,Single-ply,M
John Sheehan,1968-04-08,M-M1a,100,100,-272.5,-272.5,272.5,272.5,177.5,-182.5,-182.5,177.5,230,240,-255,240,690,IA,4,SBD,Single-ply,M
Kevin Farley,1966-06-17,M-M1a,97.1,100,-215,215,-227.5,215,195,-205,-207.5,195,200,230,240,240,650,IL,5,SBD,Single-ply,M
Robert Miller #4,1965-06-08,M-M1a,99.1,100,-260,-260,-260,,185,-190,-192.5,185,250,262.5,-272.5,262.5,,MN,DQ,SBD,Single-ply,M
John Demchak,1967-07-14,M-M1a,99.2,100,262.5,-272.5,275,275,-195,-195,-195,,262.5,-292.5,,262.5,,SC,DQ,SBD,Single-ply,M
John Schraub,1965-12-20,M-M1a,98.7,100,-295,-295,-295,,,,,,,,,,,GA,DQ,SBD,Single-ply,M
Julian Ulvang,1962-12-10,M-M1b,95.1,100,280,287.5,295,295,187.5,192.5,197.5,197.5,-280,280,285,285,777.5,FL,1,SBD,Single-ply,M
Doug Currence,1959-07-06,M-M1b,99.6,100,262.5,282.5,292.5,292.5,195,200,207.5,207.5,262.5,277.5,-280,277.5,777.5,WV,2,SBD,Single-ply,M
John Hare,1961-03-02,M-M1b,97.6,100,245,262.5,275,275,185,197.5,205,205,240,262.5,275,275,755,OH,3,SBD,Single-ply,M
Mitch Edelstein,1962-05-25,M-M1b,99.7,100,250,-262.5,-262.5,250,167.5,172.5,177.5,177.5,-277.5,287.5,-307.5,287.5,715,MN,4,SBD,Single-ply,M
Tim Womack,1961-02-01,M-M1b,99.2,100,-215,215,227.5,227.5,185,192.5,-200,192.5,220,230,-240,230,650,AL,5,SBD,Single-ply,M
Eliot Feldman,1962-10-03,M-M1b,95.1,100,220,232.5,250,250,70,75,,75,210,-222.5,-222.5,210,535,PA,6,SBD,Single-ply,M
Ray Baxter-Vonna,1958-03-16,M-M2a,92.2,100,250,272.5,280,280,170,-182.5,182.5,182.5,250,267.5,277.5,277.5,740,TX,1,SBD,Single-ply,M
Gary Edwards,1953-05-21,M-M2a,98.6,100,200,-220,220,220,-165,-170,170,170,245,255,260,260,650,MN,2,SBD,Single-ply,M
Thomas Acker,1955-07-10,M-M2a,98.9,100,-190,-190,190,190,-130,130,137.5,137.5,217.5,227.5,-237.5,227.5,555,,3,SBD,Single-ply,M
James Bell,1955-06-13,M-M2a,96.9,100,-202.5,210,217.5,217.5,115,-130,137.5,137.5,182.5,197.5,-217.5,197.5,552.5,MO,4,SBD,Single-ply,M
Michael Womelsdorf,1957-11-20,M-M2a,96.1,100,160,172.5,182.5,182.5,115,127.5,135,135,160,177.5,-185,177.5,495,CA,5,SBD,Single-ply,M
Floyd Givens,1951-10-07,M-M2b,99.4,100,-250,-250,250,250,190,-205,-205,190,275,290,-300,290,730,MI,1,SBD,Single-ply,M
Al Speech,1944-11-26,M-M3a,94.8,100,80,,,80,-125,125,140,140,135,145,150,150,370,FL,1,SBD,Single-ply,M
David Clark,1948-02-05,M-M3a,98.6,100,-227.5,-227.5,-235,,,,,,,,,,,IA,DQ,SBD,Single-ply,M
Thomas Arrington,1938-11-30,M-M3b,98.8,100,195,217.5,-227.5,217.5,127.5,-135,-142.5,127.5,195,215,-220,215,560,NC,1,SBD,Single-ply,M
James Weiss,1927-09-14,M-M5a,98.1,100,-80,-95,95,95,72.5,80,-85,80,95,-100,125,125,300,CA,1,SBD,Single-ply,M
Al Fritz,1968-06-12,M-G,109.3,110,330,350,-357.5,350,-222.5,222.5,227.5,227.5,295,312.5,-320,312.5,890,HI,G,SBD,Single-ply,M
Peter Maynard,1965-12-10,M-M1a,108.7,110,200,210,227.5,227.5,170,180,185,185,170,190,202.5,202.5,615,FL,1,SBD,Single-ply,M
Brian Birchmeier,1962-05-03,M-M1b,108.3,110,235,-257.5,-257.5,235,147.5,165,-170,165,210,237.5,250,250,650,MI,1,SBD,Single-ply,M
Gary Pamplin,1957-08-11,M-M2a,109.7,110,292.5,310,-326,310,242.5,255,-262.5,255,237.5,250,260,260,825,TX,1,SBD,Single-ply,M
Shawn Cain,1957-12-06,M-M2a,107.7,110,265,280,287.5,287.5,190,197.5,202.5,202.5,265,-285,-285,265,755,WI,2,SBD,Single-ply,M
Mark Bowen,1955-12-12,M-M2a,109.3,110,222.5,237.5,247.5,247.5,145,155,160,160,222.5,237.5,-245,237.5,645,PA,3,SBD,Single-ply,M
John Zintsmaster,1955-04-19,M-M2a,108.5,110,187.5,202.5,220,220,155,-175,175,175,220,242.5,-252.5,242.5,637.5,MI,4,SBD,Single-ply,M
Picky Pares,1957-08-07,M-M2a,106.6,110,205,-227.5,227.5,227.5,-220,-220,-220,,245,260,-265,260,,FL,DQ,SBD,Single-ply,M
Rick Chavez,1956-09-30,M-M2a,109.9,110,-277.5,277.5,287.5,287.5,-165,-165,-165,,-252.5,262.5,272.5,272.5,,FL,DQ,SBD,Single-ply,M
Steve Slavens,1951-01-18,M-M2b,104.1,110,62.5,-70,-70,62.5,62.5,-70,-70,62.5,62.5,-70,-70,62.5,187.5,WA,1,SBD,Single-ply,M
Crayton Taylor,1945-11-30,M-M3a,110,110,227.5,242.5,262.5,262.5,-137.5,137.5,-145,137.5,227.5,250,-262.5,250,650,GA,1,SBD,Single-ply,M
Bill Helmich,1942-02-08,M-M3b,106.3,110,220,235,245,245,-180,180,-188.5,180,250,267.5,281,281,706,NM,1,SBD,Single-ply,M
Chris Doyle,1968-06-30,M-G,123.4,125,-312.5,312.5,322.5,322.5,-205,212.5,-215,212.5,270,287.5,-295,287.5,822.5,IA,G,SBD,Single-ply,M
Anthony Harris #1,1964-11-04,M-M1a,110.1,125,365,380,-390,380,155,195,205,205,285,325,-340,325,910,HI,1,SBD,Single-ply,M
Thomas Smith,1967-10-01,M-M1a,124.6,125,-320,320,-332.5,320,220,230,-237.5,230,-265,265,280,280,830,WI,2,SBD,Single-ply,M
Deron Rogers,1965-06-24,M-M1a,122.3,125,300,-312.5,,300,175,-185,-185,175,315,-335,-335,315,790,TN,3,SBD,Single-ply,M
Carl Werda,1966-05-11,M-M1a,123.4,125,250,-272.5,275,275,-175,175,182.5,182.5,250,272.5,287.5,287.5,745,AK,4,SBD,Single-ply,M
Sean Culnan,1967-10-14,M-M1a,124.1,125,310,325,335,335,-235,235,-240,235,-312.5,-312.5,,,,NY,DQ,SBD,Single-ply,M
Bill McDonough,1966-12-27,M-M1a,124.6,125,-307.5,-325,-325,,-230,,,,,,,,,MO,DQ,SBD,Single-ply,M
David Gonzales,1961-06-01,M-M1b,124.2,125,320,-335,-335,320,230,-235,235,235,285,295,300,300,855,CO,1,SBD,Single-ply,M
Bill Collins,1961-04-10,M-M1b,123.6,125,285,300,312.5,312.5,227.5,235,237.5,237.5,272.5,292.5,-300,292.5,842.5,WY,2,SBD,Single-ply,M
Ken Ryder,1961-07-10,M-M1b,124.8,125,265,282.5,292.5,292.5,235,-242.5,242.5,242.5,295,-317.5,-322.5,295,830,VA,3,SBD,Single-ply,M
Jeff Capps,1959-08-24,M-M1b,123.4,125,275,-300,300,300,-210,215,227.5,227.5,275,300,-315,300,827.5,TX,4,SBD,Single-ply,M
Joe Dentice,1958-09-25,M-M1b,120.6,125,-215,-215,215,215,175,182.5,-187.5,182.5,242.5,-260,265,265,662.5,NV,5,SBD,Single-ply,M
Curtis Wainwright,1954-11-12,M-M2a,122.4,125,245,265,272.5,272.5,-172.5,172.5,185,185,230,242.5,-257.5,242.5,700,AL,1,SBD,Single-ply,M
Ted Stewart,1956-09-09,M-M2a,119.8,125,207.5,217.5,227.5,227.5,125,130,-137.5,130,217.5,240,247.5,247.5,605,NV,2,SBD,Single-ply,M
Bill Schull,1955-06-24,M-M2a,114.1,125,220,-240,-240,220,-147.5,147.5,-162.5,147.5,212.5,-235,235,235,602.5,GA,3,SBD,Single-ply,M
Dave Schneider,1956-10-24,M-M2a,110.1,125,-240,-265,-280,,,,,,,,,,,OH,DQ,SBD,Single-ply,M
Bill Sindelar,1951-01-17,M-M2b,113.7,125,232.5,250,257.5,257.5,177.5,187.5,-192.5,187.5,232.5,245,260,260,705,NE,1,SBD,Single-ply,M
Sean Anderson,1952-08-25,M-M2b,123.4,125,-265,265,285,285,160,-180,-182.5,160,182.5,212.5,-230,212.5,657.5,ID,2,SBD,Single-ply,M
Al Wood,1950-03-21,M-M2b,119.9,125,202.5,-220,-220,202.5,-155,-155,-155,,202.5,215,-222.5,215,,TX,DQ,SBD,Single-ply,M
Will Morris,1944-01-29,M-M3a,123.4,125,230,245,257.5,257.5,185,192.5,-202.5,192.5,220,232.5,,232.5,682.5,VA,1,SBD,Single-ply,M
Brad Gillingham,1966-04-26,M-M1a,147.3,125+,345,365,-370,365,260,267.5,272.5,272.5,342.5,365,380,380,1017.5,MN,1,SBD,Single-ply,M
Richard Edinger,1968-02-10,M-M1a,129.1,125+,-277.5,277.5,287.5,287.5,197.5,207.5,-212.5,207.5,277.5,-295,,277.5,772.5,ND,2,SBD,Single-ply,M
Jim Weiss,1962-08-28,M-M1b,132.7,125+,272.5,297.5,320,320,165,-175,175,175,272.5,290,-297.5,290,785,NJ,1,SBD,Single-ply,M
Mike Casey,1961-05-11,M-M1b,142,125+,247.5,265,-275,265,185,-205,-205,185,237.5,257.5,272.5,272.5,722.5,MI,2,SBD,Single-ply,M
Gary Hart,1961-08-31,M-M1b,135.9,125+,235,252.5,-272.5,252.5,-152.5,-152.5,152.5,152.5,182.5,205,-227.5,205,610,VA,3,SBD,Single-ply,M
Daniel Gaudreau,1959-11-30,M-M1b,159.6,125+,330,-352.5,352.5,352.5,-282.5,-282.5,-282.5,,-292.5,,,,,CO,DQ,SBD,Single-ply,M
Roger Hendrix,1955-05-20,M-M2a,134,125+,320,337.5,347.5,347.5,197.5,207.5,215,215,295,315,-331,315,877.5,WA,1,SBD,Single-ply,M
Steven Green,1951-02-09,M-M2b,139.1,125+,285,310,320,320,185,-242.5,-242.5,185,265,290,300,300,805,CA,1,SBD,Single-ply,M
Robert Crawford #1,1951-07-30,M-M2b,135.7,125+,205,230,-245,230,165,185,-197.5,185,215,240,,240,655,WI,2,SBD,Single-ply,M
Harry Heyman,1942-12-02,M-M3b,128.2,125+,-170,170,182.5,182.5,-100,100,,100,182.5,200,215,215,497.5,NM,1,SBD,Single-ply,M
