Division,WeightClassKg,Place,Name,Team,BodyweightKg,Best3SquatKg,Best3BenchKg,Best3DeadliftKg,TotalKg,Equipment,Event,Sex,BirthDate
Boys,51.71,1,Clark Smith,Pattonville Prairiland,49.9,95.25,56.7,117.93,269.89,Unlimited,SBD,M,
Boys,51.71,2,Jake Stufflebeme,Trenton,50.35,72.57,36.29,90.72,199.58,Unlimited,SBD,M,
Boys,55.79,1,Leyton Nguyen,Longview Pine Tree,54.43,113.4,61.23,124.74,299.37,Unlimited,SBD,M,
Boys,55.79,2,John Carter,Pattonville Prairiland,55.79,79.38,49.9,88.45,217.72,Unlimited,SBD,M,
Boys,55.79,3,Jp Fendley,Trenton,55.57,65.77,54.43,92.99,213.19,Unlimited,SBD,M,
Boys,59.87,1,Nathanial Cates,Mount Pleasant,59.19,176.9,108.86,165.56,451.32,Unlimited,SBD,M,
Boys,59.87,2,Gavin Johnson,Paris Chisum,59.87,142.88,83.91,151.95,378.75,Unlimited,SBD,M,
Boys,59.87,3,Dylan Childs,Sherman,58.74,151.95,86.18,138.35,376.48,Unlimited,SBD,M,
Boys,59.87,4,Haven Keisler,Pattonville Prairiland,59.42,127.01,70.31,140.61,337.93,Unlimited,SBD,M,
Boys,59.87,5,Isaac Hernandez,Mount Pleasant,58.51,111.13,52.16,122.47,285.76,Unlimited,SBD,M,
Boys,59.87,6,Cameron Pasley,Trenton,58.97,68.04,58.97,120.2,247.21,Unlimited,SBD,M,
Boys,67.13,1,Austen Gordon,Pattonville Prairiland,64.86,165.56,92.99,163.29,421.84,Unlimited,SBD,M,
Boys,67.13,2,Drake McComb,Pattonville Prairiland,65.54,149.69,77.11,161.03,387.82,Unlimited,SBD,M,
Boys,67.13,3,Zach Vrooman,Paris,66.77,156.49,79.38,151.95,387.82,Unlimited,SBD,M,
Boys,67.13,4,Carl King,Mount Pleasant,67.13,129.27,77.11,151.95,358.34,Unlimited,SBD,M,
Boys,67.13,5,Wyatt Easley,Paris Chisum,61.01,129.27,77.11,147.42,353.8,Unlimited,SBD,M,
Boys,67.13,6,Izaiah Vann,Longview Pine Tree,61.69,120.2,79.38,154.22,353.8,Unlimited,SBD,M,
Boys,67.13,7,Dyllan Melchior,Paris Chisum,67.13,124.74,61.23,124.74,310.71,Unlimited,SBD,M,
Boys,67.13,8,Eduardo Cruz,Mount Pleasant,64.86,120.2,54.43,124.74,299.37,Unlimited,SBD,M,
Boys,67.13,9,Aiden Flowers,Clarksville,61.23,115.67,61.23,108.86,285.76,Unlimited,SBD,M,
Boys,74.84,1,Adrian Juarez Vega,Longview Pine Tree,74.39,201.85,136.08,199.58,537.51,Unlimited,SBD,M,
Boys,74.84,2,Carl Turner,Longview Pine Tree,74.62,183.7,104.33,213.19,501.22,Unlimited,SBD,M,
Boys,74.84,3,Evan Morrow,Longview Pine Tree,73.48,167.83,95.25,204.12,467.2,Unlimited,SBD,M,
Boys,74.84,4,Justin Robertson,Mount Pleasant,74.84,161.03,95.25,163.29,419.57,Unlimited,SBD,M,
Boys,74.84,5,Christian Franklin,Paris,74.21,158.76,95.25,156.49,410.5,Unlimited,SBD,M,
Boys,74.84,6,Jagger Moss,Mount Pleasant,74.39,147.42,92.99,140.61,381.02,Unlimited,SBD,M,
Boys,74.84,7,Tristen Nunez,Clarksville,69.4,142.88,83.91,142.88,369.68,Unlimited,SBD,M,
Boys,74.84,8,Migel Ellis,Paris Chisum,74.39,124.74,83.91,151.95,360.61,Unlimited,SBD,M,
Boys,74.84,9,Keegan Galbraith,Pattonville Prairiland,74.39,122.47,90.72,131.54,344.73,Unlimited,SBD,M,
Boys,74.84,10,Gabriel Diaz,Sherman,74.84,120.2,65.77,147.42,333.39,Unlimited,SBD,M,
Boys,74.84,11,Jackson McCullough,Trenton,74.84,142.88,61.23,124.74,328.85,Unlimited,SBD,M,
Boys,74.84,DQ,Rylan Rosser,Clarksville,69.4,158.76,,,,Unlimited,SBD,M,
Boys,74.84,DQ,Adam Anderson,Pattonville Prairiland,74.84,,,,,Unlimited,SBD,M,
Boys,74.84,DQ,Lukaas Dickson,Paris Chisum,70.76,158.76,83.91,83.91,,Unlimited,SBD,M,
Boys,74.84,DQ,Jace Braziel,Paris Chisum,67.36,68.04,,,,Unlimited,SBD,M,
Boys,82.1,1,Caden King,Paris Chisum,79.83,215.46,120.2,197.31,532.97,Unlimited,SBD,M,
Boys,82.1,2,Bryson Taylor,Mount Pleasant,75.52,174.63,97.52,201.85,474,Unlimited,SBD,M,
Boys,82.1,3,Aiden Sampson,Paris,75.84,170.1,115.67,167.83,453.59,Unlimited,SBD,M,
Boys,82.1,4,Gael Gomez,Sherman,76.66,183.7,92.99,167.83,444.52,Unlimited,SBD,M,
Boys,82.1,5,Austin Sellers,Trenton,77.34,142.88,95.25,183.7,421.84,Unlimited,SBD,M,
Boys,82.1,6,Dylan Ramirez,Mount Pleasant,81.87,163.29,81.65,176.9,421.84,Unlimited,SBD,M,
Boys,82.1,DQ,Lance Miller,Clarksville,82.1,170.1,,,,Unlimited,SBD,M,
Boys,89.81,1,Issac Patino,Sherman,88,199.58,142.88,208.65,551.11,Unlimited,SBD,M,
Boys,89.81,2,Mario Farfan,Paris,89.45,210.92,127.01,210.92,548.85,Unlimited,SBD,M,
Boys,89.81,3,Aiden Smith,Longview Pine Tree,83.46,183.7,122.47,190.51,496.68,Unlimited,SBD,M,
Boys,89.81,4,Colby Glass,Longview Pine Tree,89.36,183.7,120.2,183.7,487.61,Unlimited,SBD,M,
Boys,89.81,5,Gio Dawson,Paris,85.28,181.44,117.93,183.7,483.08,Unlimited,SBD,M,
Boys,89.81,6,Nic Larue,Paris,89.13,185.97,99.79,176.9,462.66,Unlimited,SBD,M,
Boys,89.81,7,Conner Woods,Pattonville Prairiland,88.68,136.08,113.4,190.51,439.98,Unlimited,SBD,M,
Boys,89.81,8,Christian Villalta,Mount Pleasant,86.18,158.76,92.99,170.1,421.84,Unlimited,SBD,M,
Boys,89.81,9,Tanner Kuhn,Sherman,88.9,165.56,72.57,133.81,371.95,Unlimited,SBD,M,
Boys,89.81,10,Cj Poff,Trenton,86.18,145.15,68.04,154.22,367.41,Unlimited,SBD,M,
Boys,89.81,11,Takoda Chambers,Paris,88.45,138.35,86.18,142.88,367.41,Unlimited,SBD,M,
Boys,89.81,12,Ethan Parham,Pattonville Prairiland,86.86,131.54,77.11,151.95,360.61,Unlimited,SBD,M,
Boys,89.81,DQ,Mike Collins,Sherman,86.18,204.12,,,,Unlimited,SBD,M,
Boys,99.79,1,Angel Ramirez,Sherman,99.11,233.6,174.63,229.06,637.3,Unlimited,SBD,M,
Boys,99.79,2,Seth McFarland,Longview Pine Tree,99.79,233.6,151.95,226.8,612.35,Unlimited,SBD,M,
Boys,99.79,3,Leonel Terrazas,Sherman,99.79,204.12,124.74,183.7,512.56,Unlimited,SBD,M,
Boys,99.79,4,Christian Bello,Mount Pleasant,99.11,170.1,92.99,167.83,430.91,Unlimited,SBD,M,
Boys,99.79,5,Esteban Guzman,Paris,92.99,174.63,92.99,161.03,428.64,Unlimited,SBD,M,
Boys,99.79,6,Antonio Hernandez,Mount Pleasant,99.56,142.88,99.79,183.7,426.38,Unlimited,SBD,M,
Boys,99.79,7,Taylor Carroll,Paris,97.3,161.03,92.99,163.29,417.3,Unlimited,SBD,M,
Boys,99.79,8,Dillan Golightly,Trenton,93.67,142.88,102.06,136.08,381.02,Unlimited,SBD,M,
Boys,109.77,1,Preston Armstrong,Longview Pine Tree,105.69,272.16,163.29,226.8,662.24,Unlimited,SBD,M,
Boys,109.77,2,Danny Lopez,Sherman,103.65,244.94,158.76,206.38,610.08,Unlimited,SBD,M,
Boys,109.77,3,Brayden Berry,Sherman,106.59,210.92,124.74,188.24,523.9,Unlimited,SBD,M,
Boys,109.77,4,Ian Woodroof,Paris,109.09,197.31,129.27,181.44,508.02,Unlimited,SBD,M,
Boys,109.77,5,Andrew Guerette,Mount Pleasant,108.41,183.7,92.99,176.9,453.59,Unlimited,SBD,M,
Boys,124.74,1,Chris McCorkle,Trenton,114.76,183.7,145.15,158.76,487.61,Unlimited,SBD,M,
Boys,124.74,2,Gavin Avery,Paris,115.44,188.24,111.13,156.49,455.86,Unlimited,SBD,M,
Boys,124.74,3,Landen Robison,Sherman,116.8,142.88,124.74,181.44,449.06,Unlimited,SBD,M,
Boys,124.74,4,Braden Boone,Trenton,114.99,158.76,90.72,170.1,419.57,Unlimited,SBD,M,
Boys,124.74,5,Shawn Fowler,Trenton,114.31,145.15,138.35,129.27,412.77,Unlimited,SBD,M,
Boys,124.74,6,Hayden Guest,Trenton,112.04,106.59,90.72,113.4,310.71,Unlimited,SBD,M,
Boys,124.74,DQ,Hayden Brem,Sherman,116.12,,,,,Unlimited,SBD,M,
Boys,139.71,1,Matthew Rolen,Paris Chisum,136.98,226.8,136.08,213.19,576.06,Unlimited,SBD,M,
Boys,139.71+,1,Luke England,Paris Chisum,144.7,235.87,124.74,210.92,571.53,Unlimited,SBD,M,
Boys,139.71+,2,Justin West,Sherman,145.15,183.7,102.06,183.7,469.47,Unlimited,SBD,M,
Boys,139.71+,3,Charles Simmons,Longview Pine Tree,170.55,204.12,81.65,142.88,428.64,Unlimited,SBD,M,
