Place,Name,Sex,BirthDate,Age,Equipment,Division,BodyweightKg,WeightClassKg,Squat1Kg,Squat2Kg,Squat3Kg,Best3SquatKg,Bench1Kg,Bench2Kg,Bench3Kg,Best3BenchKg,Deadlift1Kg,Deadlift2Kg,Deadlift3Kg,Best3DeadliftKg,TotalKg,Event,Team
NS,Rosemary Millar,F,1971-01-17,52,Raw,F-O,,,,,,,,,,,,,,,,SBD,BST BARBELL
NS,Sarah Coulter,F,1995-02-11,28,Raw,F-O,,,,,,,,,,,,,,,,SBD,CG FITNESS
1,Marica Maguire,F,1994-08-14,28,Raw,F-O,50.8,52,95,100,105,105,67.5,70,-72.5,70,120,127.5,135,135,310,SBD,Evolution Strength Systems
1,René Curtis,F,2000-08-24,22,Raw,F-O,55.3,57,90,97.5,-105,97.5,47.5,50,-52.5,50,107.5,117.5,-125,117.5,265,SBD,Neart Strength Systems
1,Marie Mongan,F,1993-10-10,29,Raw,F-O,62.1,63,135,140,145,145,80,85,-90,85,175,182.5,-190,182.5,412.5,SBD,
2,Magdalena Kwiatek,F,1997-01-11,26,Raw,F-O,61.3,63,120,127.5,-137.5,127.5,-65,-65,65,65,115,125,132.5,132.5,325,SBD,Mind Over Matter
1,Elena O'Halloran,F,1991-02-26,32,Raw,F-O,67.6,69,115,125,130,130,55,60,62.5,62.5,135,145,150,150,342.5,SBD,ABS POWERLIFTING
2,Jackie Quinn,F,1992-09-08,30,Raw,F-O,67.4,69,115,122.5,-125,122.5,62.5,65,67.5,67.5,130,140,145,145,335,SBD,KAOS
3,Cathy Fitzgerald,F,1997-08-06,25,Raw,F-O,68.6,69,95,105,-107.5,105,47.5,52.5,-55,52.5,120,132.5,140,140,297.5,SBD,ABS POWERLIFTING
4,Abagail Byrne,F,2003-04-03,20,Raw,F-O,68.3,69,-97.5,102.5,107.5,107.5,47.5,-50,-50,47.5,122.5,132.5,140,140,295,SBD,ODYSSEY STRENGTH
5,Aoibhín McKeever,F,2002-09-28,20,Raw,F-O,66.4,69,90,100,105,105,42.5,45,-47.5,45,112.5,122.5,127.5,127.5,277.5,SBD,NEART STRENGTH
6,Lucia Lig Kennedy,F,1997-05-18,26,Raw,F-O,66.4,69,77.5,87.5,-92.5,87.5,45,50,55,55,97.5,107.5,-115,107.5,250,SBD,
7,Shannon Rafferty,F,1999-07-18,23,Raw,F-O,67.2,69,65,75,82.5,82.5,30,35,40,40,80,92.5,100,100,222.5,SBD,
1,Louise Millar,F,1986-06-16,36,Raw,F-O,74.3,76,157.5,165,170,170,97.5,102.5,-105,102.5,160,170,180,180,452.5,SBD,
2,Lauren McLean,F,1987-04-18,36,Raw,F-O,75.6,76,122.5,132.5,140,140,60,65,70,70,165,177.5,190,190,400,SBD,MAX OUT POWERLIFTING
3,Ónagh Martin,F,1987-02-28,36,Raw,F-O,75.2,76,117.5,122.5,-125,122.5,57.5,60,62.5,62.5,135,145,155,155,340,SBD,ABS POWERLIFTING
4,Hannah Rodgers,F,1993-11-20,29,Raw,F-O,75,76,102.5,110,112.5,112.5,60,62.5,65,65,125,132.5,140,140,317.5,SBD,
1,Comfort Adedokun,F,1987-10-26,35,Raw,F-O,81,84,-147.5,150,162.5,162.5,75,85,-90,85,170,180,190,190,437.5,SBD,
2,Orla McGurk,F,1993-11-22,29,Raw,F-O,84,84,132.5,-140,-140,132.5,57.5,60,-62.5,60,135,145,155,155,347.5,SBD,STRENGTH COACH NI
1,Maeve Mannion,F,1998-09-02,24,Raw,F-O,95.8,84+,140,-150,160,160,65,72.5,-75,72.5,140,155,-167.5,155,387.5,SBD,ABS POWERLIFTING
2,Donna Ivie,F,1985-11-17,37,Raw,F-O,104.3,84+,135,145,-150,145,75,-80,-80,75,145,155,-165,155,375,SBD,KAOS GYM
3,Aisling Lee,F,1993-08-25,29,Raw,F-O,110,84+,130,-140,145,145,57.5,62.5,-67.5,62.5,110,120,130,130,337.5,SBD,KAOS
NS,Conal McErlean,M,1997-12-23,25,Raw,M-O,,,,,,,,,,,,,,,,SBD,EVOLUTION STRENGTH SYSTEMS
NS,Cormac Cahalane,M,1971-09-01,51,Raw,M-O,,,,,,,,,,,,,,,,SBD,CG FITNESS
NS,Edwin Clarke,M,1967-03-31,56,Raw,M-O,,,,,,,,,,,,,,,,SBD,
NS,Nathan Keatley,M,2000-07-17,22,Raw,M-O,,,,,,,,,,,,,,,,SBD,
NS,Sam Dowling,M,2005-07-05,17,Raw,M-O,,,,,,,,,,,,,,,,SBD,
1,Ciarán Murray,M,1998-09-23,24,Raw,M-O,64.2,66,-205,205,-210,205,110,117.5,122.5,122.5,210,222.5,235,235,562.5,SBD,CITYGYM
2,Matthew Oglesby,M,,,Raw,M-O,65.5,66,152.5,165,-170,165,102.5,110,-115,110,200,210,220,220,495,SBD,
3,Conor Rossiter,M,2005-10-27,17,Raw,M-O,64.2,66,155,170,-180,170,100,107.5,-115,107.5,165,177.5,185,185,462.5,SBD,
1,Damian Maguire,M,1991-06-17,31,Raw,M-O,73.2,74,175,185,195,195,112.5,117.5,122.5,122.5,230,240,252.5,252.5,570,SBD,EVOLUTION STRENGTH SYSTEMS
2,Cahir McGrory,M,,,Raw,M-O,71.7,74,-182.5,187.5,195,195,125,130,-135,130,205,215,225,225,550,SBD,STRENGTH CLUB PERTH
3,Sean Langan,M,2001-05-17,22,Raw,M-O,73.9,74,-160,170,-185,170,95,-100,100,100,-185,200,217.5,217.5,487.5,SBD,
4,Conor Murphy,M,2006-05-01,17,Raw,M-O,73,74,152.5,167.5,-175,167.5,95,-102.5,-102.5,95,195,210,220,220,482.5,SBD,
5,Chris Lennon,M,1996-11-12,26,Raw,M-O,72.6,74,155,-170,172.5,172.5,92.5,100,-105,100,170,192.5,205,205,477.5,SBD,
6,Dale Carroll,M,1999-04-12,24,Raw,M-O,72.1,74,155,170,180,180,82.5,87.5,90,90,165,180,-195,180,450,SBD,
7,Billy Yates,M,2005-09-27,17,Raw,M-O,70.1,74,140,147.5,155,155,85,90,97.5,97.5,170,182.5,192.5,192.5,445,SBD,PHENOM
8,James Canny,M,1989-04-12,34,Raw,M-O,70.3,74,-132.5,132.5,140,140,77.5,82.5,-87.5,82.5,167.5,175,-182.5,175,397.5,SBD,ODYSSEY
9,Barra Doherty,M,1994-12-08,28,Raw,M-O,71.8,74,170,185,-187.5,185,100,-107.5,-107.5,100,75,-77.5,-77.5,75,360,SBD,
10,Sameer Shaikh,M,1999-08-30,23,Raw,M-O,72.7,74,100,112.5,120,120,67.5,72.5,-77.5,72.5,120,132.5,145,145,337.5,SBD,
1,Rían McKeever,M,2000-08-22,22,Raw,M-O,81.1,83,195,210,217.5,217.5,137.5,142.5,147.5,147.5,235,-250,-250,235,600,SBD,NEART STRENGTH SYSTEMS
2,Adam Lloyd,M,1999-11-03,23,Raw,M-O,80.6,83,182.5,190,195,195,100,-105,110,110,205,217.5,-222.5,217.5,522.5,SBD,ODYSSEY STRENGTH
3,Andrew Mcmackin,M,1995-09-19,27,Raw,M-O,80.4,83,150,-162.5,170,170,92.5,97.5,102.5,102.5,180,-192.5,200,200,472.5,SBD,
4,Jamie Rafferty,M,2003-01-23,20,Raw,M-O,75.7,83,-155,155,-165,155,112.5,117.5,-125,117.5,182.5,192.5,-205,192.5,465,SBD,ODYSSEY STRENGTH
5,Michael Wilson,M,1998-01-23,25,Raw,M-O,81.8,83,115,125,130,130,65,70,-72.5,70,165,-175,-175,165,365,SBD,ODYSSEY STRENGTH
DQ,Mark Mccourt,M,2002-06-03,20,Raw,M-O,81.7,83,130,-140,-140,130,,,,,,,,,,SBD,INSPIRE GYM LARNE
1,Austin Doherty,M,1998-06-26,24,Raw,M-O,92,93,190,202.5,-210,202.5,100,110,-117.5,110,220,232.5,-240,232.5,545,SBD,
2,Stephen McCollum,M,1992-04-09,31,Raw,M-O,89.3,93,175,185,-190,185,102.5,-107.5,-107.5,102.5,-225,225,237.5,237.5,525,SBD,ODYSSEY STRENGTH
3,Declan Fogarty,M,1983-09-27,39,Raw,M-O,89.5,93,160,167.5,175,175,115,120,-125,120,170,180,195,195,490,SBD,EQ STRENGTH & CONDITIONING
4,Clement Lai,M,2004-11-24,18,Raw,M-O,86.1,93,125,127.5,145,145,65,75,-85,75,175,185,-192.5,185,405,SBD,
DQ,Kenneth Pollin,M,1990-07-25,32,Raw,M-O,92,93,247.5,260,-272.5,260,-127.5,-127.5,-127.5,,-270,-285,-300,,,SBD,STRENGTH COACH NI
1,Adam Carroll #1,M,1996-12-17,26,Raw,M-O,102.3,105,235,245,-250,245,-135,135,145,145,240,255,-270,255,645,SBD,KAOS
2,Ciaran Phelan,M,1993-08-18,29,Raw,M-O,103,105,217.5,232.5,245,245,117.5,125,130,130,250,265,-285,265,640,SBD,ABS POWERLIFTING
3,Dean Manning,M,1999-09-19,23,Raw,M-O,103.4,105,207.5,220,225,225,142.5,150,-152.5,150,220,232.5,-240,232.5,607.5,SBD,ODYSSEY STRENGTH
4,Hugh Nowlan,M,1986-08-14,36,Raw,M-O,103.6,105,150,162.5,170,170,110,117.5,122.5,122.5,170,200,227.5,227.5,520,SBD,
5,Eoin English,M,1994-01-04,29,Raw,M-O,103.7,105,160,175,182.5,182.5,110,-115,115,115,205,-217.5,217.5,217.5,515,SBD,ABS
6,Cian Robinson,M,1998-06-03,24,Raw,M-O,103.8,105,150,160,167.5,167.5,100,105,-107.5,105,185,200,210,210,482.5,SBD,KAOS
1,Jack Thornton,M,1994-10-29,28,Raw,M-O,111,120,-272.5,287.5,300,300,165,170,175,175,287.5,302.5,-317.5,302.5,777.5,SBD,CITYGYM LIMERICK
2,Jordan Voss,M,1998-05-23,24,Raw,M-O,117.8,120,227.5,235,-247.5,235,130,135,-140,135,255,267.5,275,275,645,SBD,ODYSSEY STRENGTH
3,Ben Kearney,M,2005-10-31,17,Raw,M-O,110,120,-185,-190,190,190,100,107.5,112.5,112.5,200,215,225,225,527.5,SBD,ABS POWERLIFTING
4,Mark Carey,M,1996-03-27,27,Raw,M-O,112.7,120,195,207.5,212.5,212.5,127.5,132.5,137.5,137.5,167.5,172.5,177.5,177.5,527.5,SBD,
1,Ben Harrison #2,M,,,Raw,M-O,139.7,120+,235,-247.5,247.5,247.5,165,172.5,-175,172.5,225,235,245,245,665,SBD,
2,Enda Maher,M,1984-09-17,38,Raw,M-O,143,120+,185,200,215,215,125,135,-142.5,135,232.5,252.5,-270,252.5,602.5,SBD,EQ STRENGTH & CONDITIONING
3,Gavin Bolger,M,1994-08-31,28,Raw,M-O,130.2,120+,180,192.5,200,200,127.5,-135,135,135,200,-215,220,220,555,SBD,PHENOM GYM
