{
    "generationTool": "pwabuilder",
    "generationToolVersion": "2.0.3-rc.0",
    "platformId": "windows10",
    "platformPackage": "pwabuilder-windows10",
    "platformVersion": "2.0.3-rc.1",
    "generatedFrom": "CLI",
    "generationDate": "2018-12-03 13:31:11 Z",
    "generatedURL": "http://localhost:8080/manifest.json"
}