{
  "defaultSeverity": "error",
  "extends": [
    "tslint:recommended"
  ],
  "linterOptions": {
    "exclude": [
      "node_modules/**"
    ]
  },
  "rules": {
    "indent": [true, "spaces", 4],
    "interface-name": false,
    "max-line-length": false,
    "no-consecutive-blank-lines": false,
    "no-empty": false,
    "object-literal-sort-keys": false,
    "ordered-imports": false,
    "quotemark": [true, "single"],
    "variable-name": [true,
        "check-format",
        "allow-leading-underscore"
    ]
  }
}
