TABLE Database
Logiciel	Heavydyn
VersionBDD	1
TABLE Dossiers
Nom	chantier orly
Client	B
ContactClient	
Dossier	A
Localite	
Date	31/01/2019
Ouvrage	
Commentaire	
Smoothing	True
UnitDeplNom	1/100mm
UnitDeplRatio	1,0E-005
UnitForceNom	kN
UnitForceRatio	1,0E+003
TABLE PVs
Nom	PV1
Date	12/12/2018
Operateur	COLAS IDFN
Voie	
Sens	
PartieOuvrage	
Climat	
Commentaire	
TABLE Sequences
Nom	FR-60KN
TABLE Etapes
Numero	2
DansRapport	True
TypeDrop	Force
ValeurDrop	60,0
TABLE Etapes
Numero	3
DansRapport	True
TypeDrop	Force
ValeurDrop	60,0
TABLE Plateformes
Type	Bâtiment
Couche	Terrassement
Materiau	Grave naturelle
GTR	B1
Etat	Humide
ClassDeflection	D3
SeuilDeflection	44,00
TABLE Machines
Serial	HVY-102B
Attribution	CG Martinique           
MAC	60-96-08-63-3E-F8-17-4A
LicStart	22/09/2018
LicEnd	22/09/2050
CertStart	22/09/2018
CertEnd	22/09/2020
TABLE ParamsAcqu
NbSamples	1500
FreqAcqu	30000,00
PreTrig	0,01
TABLE Calibrations
Infos	Default values calibration
Date	20/06/2018
DPlaque	0,300
PositionCapteurs	-300,000	-200,000	0,000	200,000	300,000	600,000	900,000	1200,000	1500,000	1800,000	2100,000
IndexD0	2
TABLE Voies
VoieAcqu	0
ChannelAdc	15
Distance	0
Nom	DZWY
Type	LoadCell
Gain	4,103E-008
V0	0,000E+000
TABLE Voies
VoieAcqu	1
ChannelAdc	1
Distance	-300
Nom	FG-133
Type	Geophone
Gain	2,985E+001
V0	0,000E+000
TABLE Voies
VoieAcqu	2
ChannelAdc	2
Distance	-200
Nom	FG-135
Type	Geophone
Gain	3,053E+001
V0	0,000E+000
TABLE Voies
VoieAcqu	3
ChannelAdc	0
Distance	0
Nom	FG-150
Type	Geophone
Gain	3,087E+001
V0	0,000E+000
TABLE Voies
VoieAcqu	4
ChannelAdc	3
Distance	200
Nom	FG-136
Type	Geophone
Gain	3,138E+001
V0	0,000E+000
TABLE Voies
VoieAcqu	5
ChannelAdc	4
Distance	300
Nom	FG-137
Type	Geophone
Gain	3,136E+001
V0	0,000E+000
TABLE Voies
VoieAcqu	6
ChannelAdc	5
Distance	600
Nom	FG-139
Type	Geophone
Gain	3,063E+001
V0	0,000E+000
TABLE Voies
VoieAcqu	7
ChannelAdc	8
Distance	900
Nom	FG-140
Type	Geophone
Gain	3,045E+001
V0	0,000E+000
TABLE Voies
VoieAcqu	8
ChannelAdc	9
Distance	1200
Nom	FG-141
Type	Geophone
Gain	3,102E+001
V0	0,000E+000
TABLE Voies
VoieAcqu	9
ChannelAdc	10
Distance	1500
Nom	FG-142
Type	Geophone
Gain	3,080E+001
V0	0,000E+000
TABLE Voies
VoieAcqu	10
ChannelAdc	13
Distance	1800
Nom	FG-143
Type	Geophone
Gain	3,083E+001
V0	0,000E+000
TABLE Voies
VoieAcqu	11
ChannelAdc	14
Distance	2100
Nom	FG-144
Type	Geophone
Gain	3,092E+001
V0	0,000E+000
TABLE Sensors
Nom	AirTemp
Type	AirTemp
Gain	3,850E-001
V0	1,000E+002
TABLE Sensors
Nom	SurfTemp
Type	SurfTemp
Gain	1,000E+000
V0	0,000E+000
TABLE Sensors
Nom	DMI
Type	Dmi
Gain	1,800E+002
V0	0,000E+000
TABLE ResultatsPV
Points_Nombre	80
PointsOK_Nombre	80
PointsOK_Max	0,0
PointsOK_Min	0,0
PointsOK_Moyenne	0,0
PointsOK_Std	0,0
PointsPass_Nombre	44
PointsFailNombre	36
TABLE ArrayResult
Latitude	48,719620	48,719687	48,719771	48,719834	48,719835	48,719778	48,719691	48,719593	48,719512	48,719382	48,719475	48,719569	48,719670	48,719717	48,719578	48,719292	48,719186	48,719282	48,719330	48,719443	48,719501	48,719636	48,719486	48,719401	48,719335	48,719246	48,719166	48,719218	48,719297	48,719380	48,719354	48,719285	48,719207	48,718960	48,719001	48,719040	48,719081	48,719150	48,719206	48,719258	48,719320	48,719383	48,719439	48,719503	48,719530	48,719473	48,719415	48,719360	48,719310	48,719257	48,719200	48,719144	48,719116	48,718997	48,719062	48,719158	48,719207	48,719273	48,719314	48,719377	48,719427	48,719493	48,719545	48,719613	48,719549	48,719481	48,719451	48,719408	48,719456	48,719528	48,719592	48,719640	48,719713	48,719760	48,719837	48,719790	48,719769	48,719712	48,719886	48,719885
Longitude	2,343552	2,343322	2,343106	2,342884	2,342669	2,342900	2,343133	2,343403	2,343630	2,343647	2,343332	2,343078	2,342811	2,342662	2,342722	2,343563	2,343385	2,343136	2,343004	2,342711	2,342518	2,342434	2,342349	2,342547	2,342795	2,343035	2,342964	2,342756	2,342548	2,342349	2,342237	2,342409	2,342643	2,344038	2,344256	2,344440	2,344688	2,345009	2,345320	2,345639	2,345931	2,346269	2,346593	2,346884	2,346698	2,346390	2,346027	2,345711	2,345424	2,345138	2,344856	2,344528	2,344285	2,344089	2,344485	2,344136	2,344387	2,344638	2,344911	2,345204	2,345462	2,345801	2,346108	2,346443	2,345564	2,345171	2,344917	2,344615	2,344404	2,344716	2,344974	2,345239	2,345596	2,345880	2,345803	2,345580	2,345302	2,345047	2,345471	2,345550
Chainage	170	188	206	223	304	322	342	364	382	437	462	484	506	518	582	652	733	754	799	824	840	93	135	153	171	192	249	264	282	299	356	370	390	621	638	656	674	724	747	771	795	821	846	868	949	972	1000	1024	1047	1068	1090	1116	1134	1172	1201	1292	1311	1338	1359	1382	1402	1427	1451	1477	1591	1620	1639	1662	1696	1720	1740	1760	1787	1810	1880	1897	1917	1938	2059	2065
Tair	3,7	3,7	3,7	3,9	3,7	3,9	3,9	3,9	4,1	3,9	3,9	4,1	3,9	4,1	4,3	4,5	4,3	4,5	4,3	4,3	4,5	6,1	6,3	6,5	6,5	6,3	6,3	6,3	6,3	6,3	6,5	6,5	6,7	6,9	7,1	7,3	7,1	7,1	7,1	7,1	7,1	7,1	6,9	6,9	6,7	6,5	6,3	6,3	6,5	6,3	6,3	6,1	6,3	6,5	7,1	7,3	7,3	7,3	7,3	7,5	7,5	7,3	7,3	7,1	6,7	6,7	6,7	6,7	6,5	6,7	6,9	6,9	7,1	7,1	7,1	6,9	6,7	6,7	6,7	6,9
Tsurf	5,9	5,9	5,4	5,9	5,6	4,5	5,2	5,1	5,8	5,8	6,1	5,1	6,3	5,9	5,3	5,6	5,9	7,1	7,3	6,3	7,2	6,8	10,5	9,4	9,5	8,7	8,7	8,5	8,5	7,6	8,9	8,5	9,0	5,6	7,5	7,7	7,3	7,6	7,3	7,5	7,2	7,3	7,2	6,2	5,3	6,2	6,6	5,6	6,2	6,3	6,1	6,6	6,3	5,8	7,2	5,6	7,3	6,7	7,2	6,6	8,6	5,8	7,0	4,8	6,3	6,3	5,1	4,9	5,7	5,2	5,4	4,7	6,8	5,8	4,9	4,5	3,0	5,4	6,3	6,8
Tman	0,0	0,0	0,0	0,0	0,0	0,0	0,0	0,0	0,0	0,0	0,0	0,0	0,0	0,0	0,0	0,0	0,0	0,0	0,0	0,0	0,0	0,0	0,0	0,0	0,0	0,0	0,0	0,0	0,0	0,0	0,0	0,0	0,0	0,0	0,0	0,0	0,0	0,0	0,0	0,0	0,0	0,0	0,0	0,0	0,0	0,0	0,0	0,0	0,0	0,0	0,0	0,0	0,0	0,0	0,0	0,0	0,0	0,0	0,0	0,0	0,0	0,0	0,0	0,0	0,0	0,0	0,0	0,0	0,0	0,0	0,0	0,0	0,0	0,0	0,0	0,0	0,0	0,0	0,0	0,0
Forcemax	59,1	58,9	60,2	59,8	58,9	59,5	59,7	58,8	58,6	58,8	59,4	59,3	59,9	60,2	59,6	58,8	58,9	59,3	59,8	59,6	59,5	60,4	58,8	59,1	59,4	59,5	59,4	59,3	59,1	61,0	59,2	59,5	59,9	57,5	59,7	55,8	58,9	60,8	58,8	59,2	58,9	60,1	59,5	58,3	57,8	58,8	58,1	58,0	59,3	58,2	59,3	58,7	56,7	57,7	56,4	41,1	57,6	58,4	59,1	58,0	58,9	59,0	59,1	55,6	56,4	56,0	57,9	58,0	57,9	58,1	57,6	56,7	57,4	57,3	57,2	57,1	56,6	57,0	57,1	57,3
D_0300	9,9	9,9	9,3	16,0	7,1	4,1	10,7	11,5	7,8	15,4	9,8	6,7	9,5	5,6	10,6	14,9	17,5	9,8	15,2	15,2	10,2	19,7	24,9	10,8	8,2	11,0	8,4	7,3	11,6	11,9	24,3	10,4	10,5	41,9	26,9	82,0	37,5	14,1	34,1	33,3	27,7	20,3	23,1	23,1	23,3	17,3	35,2	33,9	23,8	33,3	24,1	28,5	46,5	41,1	66,9	26,6	31,5	26,4	14,6	34,8	23,7	19,9	30,4	60,4	39,9	11,8	11,4	18,8	14,4	7,0	20,3	37,1	16,8	20,7	13,9	13,1	15,3	6,5	13,4	16,0
D_0200	12,1	11,8	12,1	19,8	9,4	4,8	13,8	13,9	8,9	17,2	10,5	8,0	10,5	6,5	12,2	16,5	19,9	11,4	17,4	19,5	13,9	22,7	39,6	12,3	9,8	12,3	10,2	9,3	11,3	13,6	26,6	12,8	12,0	66,0	31,3	128,0	49,6	16,5	44,9	42,9	40,7	23,7	26,8	25,6	26,7	19,7	61,1	45,0	30,8	43,8	28,9	35,5	71,5	54,2	111,6	50,7	49,5	33,0	17,1	43,2	29,7	25,6	39,3	70,8	60,9	13,5	13,0	22,0	18,2	8,1	24,1	49,2	26,1	29,5	26,2	19,1	26,9	4,5	21,6	22,5
D0000	23,8	22,3	28,3	31,1	22,7	34,2	25,1	27,3	16,6	28,4	14,7	11,7	13,2	9,0	24,3	44,5	22,9	13,9	26,5	33,8	22,2	32,3	73,8	19,2	87,5	22,0	13,6	24,5	20,1	22,9	34,7	22,6	16,9	108,6	44,6	162,2	74,0	28,7	82,8	68,3	83,3	33,5	36,3	39,5	36,6	38,5	109,5	75,3	46,5	69,4	46,0	54,9	129,4	98,8	159,3	88,5	109,6	45,0	24,8	57,6	52,5	45,5	60,5	91,3	132,6	21,4	23,2	31,4	29,1	11,6	37,3	88,1	61,1	57,9	147,2	42,7	69,5	69,1	141,7	46,8
D0200	11,8	11,4	11,2	18,5	8,5	3,7	12,8	13,7	8,5	16,6	10,8	7,5	10,3	6,3	11,8	16,1	19,1	10,5	16,7	19,9	12,7	20,9	35,3	12,7	10,1	11,6	9,6	9,1	10,0	13,4	23,2	12,4	11,6	61,0	29,9	124,1	44,8	15,3	44,1	39,7	37,4	23,3	26,1	25,0	26,2	17,8	58,6	43,5	29,9	41,7	29,2	32,8	72,1	56,8	90,6	40,7	46,2	31,7	16,3	40,5	29,3	25,2	38,2	70,2	62,6	12,9	10,9	21,1	17,6	7,9	23,5	47,5	25,3	29,1	12,2	19,3	34,1	4,5	17,7	20,1
D0300	9,7	9,5	8,8	15,4	6,7	3,9	10,8	11,0	7,5	14,7	9,7	6,6	9,3	5,6	10,4	14,6	16,6	9,1	14,6	15,5	9,7	16,8	21,2	11,2	8,1	11,6	8,3	7,3	9,1	11,6	20,8	10,3	10,1	38,9	25,2	80,9	34,3	13,6	34,2	30,1	26,5	20,0	22,3	22,7	23,0	16,4	35,1	33,3	23,7	32,1	24,5	26,7	47,1	42,1	53,3	24,2	29,5	26,2	14,0	33,5	22,9	19,6	30,3	59,3	39,8	11,5	12,3	18,0	14,7	6,7	19,9	35,5	15,8	21,0	16,2	13,1	15,4	13,6	12,3	14,2
D0600	7,7	7,3	6,9	11,3	4,4	3,0	7,8	8,2	5,9	10,9	7,7	4,8	6,8	4,1	6,8	10,9	11,6	6,8	10,2	7,7	5,9	10,5	10,6	8,2	5,4	8,1	5,7	5,0	5,8	8,3	15,1	7,1	6,9	20,2	17,1	30,3	20,9	10,6	18,6	17,1	14,6	13,8	15,3	16,4	16,1	12,1	16,2	20,2	14,9	18,4	17,4	16,4	19,9	20,9	23,8	12,6	16,2	16,9	10,7	21,0	14,5	12,7	18,1	40,0	18,9	8,6	9,5	12,6	10,6	5,2	13,4	19,8	7,2	10,7	95,8	6,7	6,0	4,1	7,3	8,1
D0900	6,7	6,1	5,8	8,6	3,7	2,6	6,1	6,3	4,7	8,2	6,1	3,5	5,2	3,3	4,5	8,2	8,1	5,2	7,2	4,0	4,0	7,3	7,8	5,3	3,8	6,6	4,3	3,7	3,7	6,2	11,7	5,3	4,9	13,2	12,2	16,3	14,2	8,5	11,0	10,6	9,9	10,2	11,1	11,9	11,6	9,2	10,8	13,4	10,3	12,0	12,8	11,5	11,6	12,0	14,2	8,4	10,6	11,8	8,6	13,4	10,3	9,6	11,8	25,6	12,3	7,0	7,9	9,4	8,9	4,7	9,7	13,1	4,3	7,0	4,4	4,3	3,7	3,5	5,1	5,9
D1200	5,5	4,9	4,9	6,6	3,0	2,1	4,7	4,9	3,9	6,2	4,9	2,4	3,6	2,6	2,9	6,2	5,6	3,9	4,9	2,3	3,1	5,4	5,4	3,5	2,8	5,0	3,1	2,8	2,5	4,7	8,6	4,3	3,3	9,3	8,6	10,1	9,4	6,5	6,7	6,9	7,1	7,3	7,9	14,0	8,3	7,0	7,6	9,0	7,2	8,1	9,2	8,2	7,9	7,5	9,5	5,8	7,5	8,5	6,7	8,6	7,4	7,2	8,0	15,9	8,6	5,4	6,5	7,0	7,0	4,0	7,1	9,3	3,1	4,9	3,6	3,1	2,6	3,0	3,8	4,4
D1500	4,6	4,1	4,2	5,2	2,5	1,8	3,7	3,8	3,3	4,7	4,0	1,8	2,8	2,1	2,1	7,1	4,3	3,1	3,5	1,7	2,5	4,3	4,2	2,7	2,2	3,9	2,4	2,3	1,9	3,7	6,7	3,5	2,5	7,0	6,3	7,5	6,9	5,1	4,5	4,8	5,5	5,4	6,0	5,9	6,2	5,4	5,8	6,4	5,4	6,1	6,8	6,2	6,0	5,8	7,2	4,5	5,9	6,3	5,4	6,0	5,7	5,6	5,8	10,0	6,7	4,4	5,5	5,3	5,6	3,5	5,3	6,9	2,5	4,1	2,9	2,5	2,2	2,7	3,2	3,6
D1800	3,9	3,4	3,5	4,1	2,2	1,5	3,0	3,1	2,9	3,7	3,3	1,4	2,1	1,9	1,6	4,0	3,5	2,5	2,5	1,5	2,2	3,6	3,5	2,3	1,8	3,2	2,0	1,9	1,6	3,0	5,3	2,8	1,9	5,4	4,9	5,8	5,4	3,9	3,3	3,6	4,5	4,2	4,7	4,4	4,8	4,3	4,7	4,8	4,3	4,9	5,1	4,8	5,0	4,6	5,7	3,3	4,8	4,7	4,3	4,5	4,5	4,5	4,5	6,5	5,5	3,7	4,6	4,3	4,6	3,1	4,2	5,5	2,1	3,4	2,6	2,1	1,9	2,5	2,7	3,0
D2100	3,2	2,9	3,0	3,3	1,9	1,3	2,5	2,6	2,5	3,0	2,8	1,1	1,7	1,7	1,4	3,4	2,9	2,1	2,0	1,3	2,0	3,0	2,9	1,8	1,6	2,7	1,7	1,6	1,4	2,6	4,3	2,4	1,5	4,3	3,8	4,7	4,3	3,0	2,6	2,9	3,7	3,2	3,8	3,5	3,8	3,5	3,9	3,9	3,4	4,0	3,9	3,8	4,2	3,7	4,6	2,8	4,0	3,7	3,5	3,6	3,5	3,5	3,6	4,9	4,7	3,1	3,9	3,4	3,7	2,8	3,6	4,5	1,8	2,9	2,2	1,9	1,7	2,3	2,3	2,6
TABLE ReportPoints
Numero	1
Latitude	48,719620
Longitude	2,343552
DOP	1,8
Chainage	170
Tair	3,7
Tsurf	5,9
Tman	0,0
Commentaire	
Date	12/12/2018 11:40
TABLE Drops
Numero	2
PulseTime	26,2
ForceMax	59,0
D_0300	9,9
D_0200	12,1
D0000	23,4
D0200	11,7
D0300	9,7
D0600	7,7
D0900	6,7
D1200	5,5
D1500	4,6
D1800	3,9
D2100	3,2
TABLE Drops
Numero	3
PulseTime	26,2
ForceMax	59,1
D_0300	9,9
D_0200	12,1
D0000	23,8
D0200	11,8
D0300	9,7
D0600	7,7
D0900	6,7
D1200	5,5
D1500	4,6
D1800	3,9
D2100	3,2
TABLE ReportPoints
Numero	2
Latitude	48,719687
Longitude	2,343322
DOP	1,8
Chainage	188
Tair	3,7
Tsurf	5,9
Tman	0,0
Commentaire	
Date	12/12/2018 11:41
TABLE Drops
Numero	2
PulseTime	26,2
ForceMax	58,8
D_0300	9,9
D_0200	11,8
D0000	23,2
D0200	11,3
D0300	9,5
D0600	7,2
D0900	6,1
D1200	4,9
D1500	4,1
D1800	3,4
D2100	2,9
TABLE Drops
Numero	3
PulseTime	26,1
ForceMax	58,9
D_0300	9,9
D_0200	11,8
D0000	22,3
D0200	11,4
D0300	9,5
D0600	7,3
D0900	6,1
D1200	4,9
D1500	4,1
D1800	3,4
D2100	2,9
TABLE ReportPoints
Numero	3
Latitude	48,719771
Longitude	2,343106
DOP	1,8
Chainage	206
Tair	3,7
Tsurf	5,4
Tman	0,0
Commentaire	
Date	12/12/2018 11:42
TABLE Drops
Numero	2
PulseTime	25,8
ForceMax	60,2
D_0300	9,2
D_0200	12,1
D0000	28,3
D0200	11,1
D0300	8,8
D0600	6,8
D0900	5,9
D1200	4,8
D1500	4,1
D1800	3,5
D2100	3,0
TABLE Drops
Numero	3
PulseTime	25,8
ForceMax	60,2
D_0300	9,3
D_0200	12,1
D0000	28,3
D0200	11,2
D0300	8,8
D0600	6,9
D0900	5,8
D1200	4,9
D1500	4,2
D1800	3,5
D2100	3,0
TABLE ReportPoints
Numero	4
Latitude	48,719834
Longitude	2,342884
DOP	1,8
Chainage	223
Tair	3,9
Tsurf	5,9
Tman	0,0
Commentaire	
Date	12/12/2018 11:43
TABLE Drops
Numero	2
PulseTime	26,0
ForceMax	59,7
D_0300	15,9
D_0200	19,6
D0000	30,8
D0200	18,4
D0300	15,3
D0600	11,2
D0900	8,5
D1200	6,5
D1500	5,2
D1800	4,1
D2100	3,3
TABLE Drops
Numero	3
PulseTime	26,0
ForceMax	59,8
D_0300	16,0
D_0200	19,8
D0000	31,1
D0200	18,5
D0300	15,4
D0600	11,3
D0900	8,6
D1200	6,6
D1500	5,2
D1800	4,1
D2100	3,3
TABLE ReportPoints
Numero	5
Latitude	48,719835
Longitude	2,342669
DOP	1,8
Chainage	304
Tair	3,7
Tsurf	5,6
Tman	0,0
Commentaire	
Date	12/12/2018 11:46
TABLE Drops
Numero	2
PulseTime	26,3
ForceMax	58,6
D_0300	7,0
D_0200	9,2
D0000	17,3
D0200	9,0
D0300	6,6
D0600	4,5
D0900	3,6
D1200	3,0
D1500	2,5
D1800	2,1
D2100	1,9
TABLE Drops
Numero	3
PulseTime	26,2
ForceMax	58,9
D_0300	7,1
D_0200	9,4
D0000	22,7
D0200	8,5
D0300	6,7
D0600	4,4
D0900	3,7
D1200	3,0
D1500	2,5
D1800	2,2
D2100	1,9
TABLE ReportPoints
Numero	6
Latitude	48,719778
Longitude	2,342900
DOP	1,8
Chainage	322
Tair	3,9
Tsurf	4,5
Tman	0,0
Commentaire	
Date	12/12/2018 11:48
TABLE Drops
Numero	2
PulseTime	26,0
ForceMax	59,4
D_0300	4,1
D_0200	4,8
D0000	38,1
D0200	3,8
D0300	3,9
D0600	3,0
D0900	2,6
D1200	2,1
D1500	1,8
D1800	1,5
D2100	1,3
TABLE Drops
Numero	3
PulseTime	26,0
ForceMax	59,5
D_0300	4,1
D_0200	4,8
D0000	34,2
D0200	3,7
D0300	3,9
D0600	3,0
D0900	2,6
D1200	2,1
D1500	1,8
D1800	1,5
D2100	1,3
TABLE ReportPoints
Numero	7
Latitude	48,719691
Longitude	2,343133
DOP	1,5
Chainage	342
Tair	3,9
Tsurf	5,2
Tman	0,0
Commentaire	
Date	12/12/2018 11:50
TABLE Drops
Numero	2
PulseTime	26,0
ForceMax	59,6
D_0300	10,6
D_0200	13,6
D0000	24,9
D0200	12,7
D0300	10,7
D0600	7,7
D0900	6,1
D1200	4,7
D1500	3,7
D1800	3,0
D2100	2,5
TABLE Drops
Numero	3
PulseTime	26,0
ForceMax	59,7
D_0300	10,7
D_0200	13,8
D0000	25,1
D0200	12,8
D0300	10,8
D0600	7,8
D0900	6,1
D1200	4,7
D1500	3,7
D1800	3,0
D2100	2,5
TABLE ReportPoints
Numero	8
Latitude	48,719593
Longitude	2,343403
DOP	1,5
Chainage	364
Tair	3,9
Tsurf	5,1
Tman	0,0
Commentaire	
Date	12/12/2018 11:51
TABLE Drops
Numero	2
PulseTime	26,3
ForceMax	58,9
D_0300	11,5
D_0200	13,9
D0000	23,9
D0200	13,6
D0300	11,0
D0600	8,1
D0900	6,3
D1200	4,9
D1500	3,8
D1800	3,1
D2100	2,6
TABLE Drops
Numero	3
PulseTime	26,3
ForceMax	58,8
D_0300	11,5
D_0200	13,9
D0000	27,3
D0200	13,7
D0300	11,0
D0600	8,2
D0900	6,3
D1200	4,9
D1500	3,8
D1800	3,1
D2100	2,6
TABLE ReportPoints
Numero	9
Latitude	48,719512
Longitude	2,343630
DOP	1,5
Chainage	382
Tair	4,1
Tsurf	5,8
Tman	0,0
Commentaire	
Date	12/12/2018 11:52
TABLE Drops
Numero	2
PulseTime	26,4
ForceMax	58,4
D_0300	7,7
D_0200	8,8
D0000	34,7
D0200	8,7
D0300	7,5
D0600	5,9
D0900	4,7
D1200	3,9
D1500	3,3
D1800	2,9
D2100	2,5
TABLE Drops
Numero	3
PulseTime	26,4
ForceMax	58,6
D_0300	7,8
D_0200	8,9
D0000	16,6
D0200	8,5
D0300	7,5
D0600	5,9
D0900	4,7
D1200	3,9
D1500	3,3
D1800	2,9
D2100	2,5
TABLE ReportPoints
Numero	10
Latitude	48,719382
Longitude	2,343647
DOP	1,8
Chainage	437
Tair	3,9
Tsurf	5,8
Tman	0,0
Commentaire	
Date	12/12/2018 11:54
TABLE Drops
Numero	2
PulseTime	26,4
ForceMax	58,4
D_0300	15,3
D_0200	17,0
D0000	27,1
D0200	16,4
D0300	14,5
D0600	10,7
D0900	8,2
D1200	6,1
D1500	4,6
D1800	3,6
D2100	2,9
TABLE Drops
Numero	3
PulseTime	26,3
ForceMax	58,8
D_0300	15,4
D_0200	17,2
D0000	28,4
D0200	16,6
D0300	14,7
D0600	10,9
D0900	8,2
D1200	6,2
D1500	4,7
D1800	3,7
D2100	3,0
TABLE ReportPoints
Numero	11
Latitude	48,719475
Longitude	2,343332
DOP	1,8
Chainage	462
Tair	3,9
Tsurf	6,1
Tman	0,0
Commentaire	
Date	12/12/2018 11:55
TABLE Drops
Numero	2
PulseTime	26,1
ForceMax	59,1
D_0300	9,8
D_0200	10,2
D0000	14,5
D0200	10,8
D0300	9,7
D0600	7,6
D0900	6,1
D1200	4,8
D1500	3,9
D1800	3,2
D2100	2,8
TABLE Drops
Numero	3
PulseTime	26,1
ForceMax	59,4
D_0300	9,8
D_0200	10,5
D0000	14,7
D0200	10,8
D0300	9,7
D0600	7,7
D0900	6,1
D1200	4,9
D1500	4,0
D1800	3,3
D2100	2,8
TABLE ReportPoints
Numero	12
Latitude	48,719569
Longitude	2,343078
DOP	1,8
Chainage	484
Tair	4,1
Tsurf	5,1
Tman	0,0
Commentaire	
Date	12/12/2018 11:55
TABLE Drops
Numero	2
PulseTime	26,3
ForceMax	58,9
D_0300	6,8
D_0200	7,9
D0000	11,8
D0200	7,4
D0300	6,5
D0600	4,7
D0900	3,4
D1200	2,4
D1500	1,8
D1800	1,4
D2100	1,1
TABLE Drops
Numero	3
PulseTime	26,2
ForceMax	59,3
D_0300	6,7
D_0200	8,0
D0000	11,7
D0200	7,5
D0300	6,6
D0600	4,8
D0900	3,5
D1200	2,4
D1500	1,8
D1800	1,4
D2100	1,1
TABLE ReportPoints
Numero	13
Latitude	48,719670
Longitude	2,342811
DOP	1,8
Chainage	506
Tair	3,9
Tsurf	6,3
Tman	0,0
Commentaire	
Date	12/12/2018 11:56
TABLE Drops
Numero	2
PulseTime	26,1
ForceMax	59,7
D_0300	9,5
D_0200	10,4
D0000	13,2
D0200	10,2
D0300	9,2
D0600	6,8
D0900	5,1
D1200	3,6
D1500	2,7
D1800	2,1
D2100	1,7
TABLE Drops
Numero	3
PulseTime	26,1
ForceMax	59,9
D_0300	9,5
D_0200	10,5
D0000	13,2
D0200	10,3
D0300	9,3
D0600	6,8
D0900	5,2
D1200	3,6
D1500	2,8
D1800	2,1
D2100	1,7
TABLE ReportPoints
Numero	14
Latitude	48,719717
Longitude	2,342662
DOP	1,8
Chainage	518
Tair	4,1
Tsurf	5,9
Tman	0,0
Commentaire	
Date	12/12/2018 11:57
TABLE Drops
Numero	2
PulseTime	25,9
ForceMax	60,0
D_0300	5,6
D_0200	6,4
D0000	9,0
D0200	6,3
D0300	5,6
D0600	4,1
D0900	3,3
D1200	2,6
D1500	2,1
D1800	1,9
D2100	1,6
TABLE Drops
Numero	3
PulseTime	25,9
ForceMax	60,2
D_0300	5,6
D_0200	6,5
D0000	9,0
D0200	6,3
D0300	5,6
D0600	4,1
D0900	3,3
D1200	2,6
D1500	2,1
D1800	1,9
D2100	1,7
TABLE ReportPoints
Numero	15
Latitude	48,719578
Longitude	2,342722
DOP	1,8
Chainage	582
Tair	4,3
Tsurf	5,3
Tman	0,0
Commentaire	
Date	12/12/2018 11:59
TABLE Drops
Numero	2
PulseTime	26,2
ForceMax	59,5
D_0300	10,5
D_0200	12,1
D0000	25,5
D0200	12,0
D0300	10,3
D0600	6,8
D0900	4,5
D1200	2,9
D1500	2,1
D1800	1,7
D2100	1,4
TABLE Drops
Numero	3
PulseTime	26,1
ForceMax	59,6
D_0300	10,6
D_0200	12,2
D0000	24,3
D0200	11,8
D0300	10,4
D0600	6,8
D0900	4,5
D1200	2,9
D1500	2,1
D1800	1,6
D2100	1,4
TABLE ReportPoints
Numero	17
Latitude	48,719292
Longitude	2,343563
DOP	1,5
Chainage	652
Tair	4,5
Tsurf	5,6
Tman	0,0
Commentaire	
Date	12/12/2018 12:02
TABLE Drops
Numero	2
PulseTime	26,6
ForceMax	58,2
D_0300	14,6
D_0200	16,2
D0000	59,2
D0200	15,8
D0300	14,3
D0600	10,7
D0900	8,1
D1200	6,1
D1500	5,9
D1800	3,9
D2100	3,3
TABLE Drops
Numero	3
PulseTime	26,5
ForceMax	58,8
D_0300	14,9
D_0200	16,5
D0000	44,5
D0200	16,1
D0300	14,6
D0600	10,9
D0900	8,2
D1200	6,2
D1500	7,1
D1800	4,0
D2100	3,4
TABLE ReportPoints
Numero	18
Latitude	48,719186
Longitude	2,343385
DOP	1,5
Chainage	733
Tair	4,3
Tsurf	5,9
Tman	0,0
Commentaire	
Date	12/12/2018 12:04
TABLE Drops
Numero	2
PulseTime	26,4
ForceMax	58,8
D_0300	17,4
D_0200	19,7
D0000	24,7
D0200	19,0
D0300	16,6
D0600	11,5
D0900	8,2
D1200	5,6
D1500	4,3
D1800	3,5
D2100	2,9
TABLE Drops
Numero	3
PulseTime	26,4
ForceMax	58,9
D_0300	17,5
D_0200	19,9
D0000	22,9
D0200	19,1
D0300	16,6
D0600	11,6
D0900	8,1
D1200	5,6
D1500	4,3
D1800	3,5
D2100	2,9
TABLE ReportPoints
Numero	19
Latitude	48,719282
Longitude	2,343136
DOP	1,5
Chainage	754
Tair	4,5
Tsurf	7,1
Tman	0,0
Commentaire	
Date	12/12/2018 12:06
TABLE Drops
Numero	2
PulseTime	26,2
ForceMax	59,1
D_0300	9,8
D_0200	11,3
D0000	13,8
D0200	10,5
D0300	9,1
D0600	6,8
D0900	5,1
D1200	3,9
D1500	3,1
D1800	2,5
D2100	2,1
TABLE Drops
Numero	3
PulseTime	26,2
ForceMax	59,3
D_0300	9,8
D_0200	11,4
D0000	13,9
D0200	10,5
D0300	9,1
D0600	6,8
D0900	5,2
D1200	3,9
D1500	3,1
D1800	2,5
D2100	2,1
TABLE ReportPoints
Numero	20
Latitude	48,719330
Longitude	2,343004
DOP	1,5
Chainage	799
Tair	4,3
Tsurf	7,3
Tman	0,0
Commentaire	
Date	12/12/2018 12:07
TABLE Drops
Numero	2
PulseTime	26,2
ForceMax	59,7
D_0300	15,2
D_0200	17,4
D0000	26,4
D0200	16,7
D0300	14,6
D0600	10,3
D0900	7,8
D1200	5,0
D1500	3,5
D1800	2,6
D2100	2,1
TABLE Drops
Numero	3
PulseTime	26,2
ForceMax	59,8
D_0300	15,2
D_0200	17,4
D0000	26,5
D0200	16,7
D0300	14,6
D0600	10,2
D0900	7,2
D1200	4,9
D1500	3,5
D1800	2,5
D2100	2,0
TABLE ReportPoints
Numero	21
Latitude	48,719443
Longitude	2,342711
DOP	1,5
Chainage	824
Tair	4,3
Tsurf	6,3
Tman	0,0
Commentaire	
Date	12/12/2018 12:08
TABLE Drops
Numero	2
PulseTime	26,3
ForceMax	59,2
D_0300	16,7
D_0200	19,2
D0000	33,2
D0200	19,5
D0300	15,4
D0600	7,7
D0900	4,1
D1200	2,3
D1500	1,7
D1800	1,5
D2100	1,3
TABLE Drops
Numero	3
PulseTime	26,3
ForceMax	59,6
D_0300	15,2
D_0200	19,5
D0000	33,8
D0200	19,9
D0300	15,5
D0600	7,7
D0900	4,0
D1200	2,3
D1500	1,7
D1800	1,5
D2100	1,3
TABLE ReportPoints
Numero	22
Latitude	48,719501
Longitude	2,342518
DOP	1,5
Chainage	840
Tair	4,5
Tsurf	7,2
Tman	0,0
Commentaire	
Date	12/12/2018 12:10
TABLE Drops
Numero	2
PulseTime	26,2
ForceMax	59,3
D_0300	10,2
D_0200	13,6
D0000	21,7
D0200	12,6
D0300	9,6
D0600	5,9
D0900	4,0
D1200	3,1
D1500	2,6
D1800	2,2
D2100	2,0
TABLE Drops
Numero	3
PulseTime	26,2
ForceMax	59,5
D_0300	10,2
D_0200	13,9
D0000	22,2
D0200	12,7
D0300	9,7
D0600	5,9
D0900	4,0
D1200	3,1
D1500	2,5
D1800	2,2
D2100	2,0
TABLE ReportPoints
Numero	23
Latitude	48,719636
Longitude	2,342434
DOP	1,8
Chainage	93
Tair	6,1
Tsurf	6,8
Tman	0,0
Commentaire	
Date	12/12/2018 13:59
TABLE Drops
Numero	2
PulseTime	25,4
ForceMax	60,3
D_0300	19,5
D_0200	22,4
D0000	31,4
D0200	20,6
D0300	16,6
D0600	10,4
D0900	7,3
D1200	5,3
D1500	4,3
D1800	3,5
D2100	2,9
TABLE Drops
Numero	3
PulseTime	25,4
ForceMax	60,4
D_0300	19,7
D_0200	22,7
D0000	32,3
D0200	20,9
D0300	16,8
D0600	10,5
D0900	7,3
D1200	5,4
D1500	4,3
D1800	3,6
D2100	3,0
TABLE ReportPoints
Numero	24
Latitude	48,719486
Longitude	2,342349
DOP	1,8
Chainage	135
Tair	6,3
Tsurf	10,5
Tman	0,0
Commentaire	
Date	12/12/2018 14:00
TABLE Drops
Numero	2
PulseTime	26,3
ForceMax	58,3
D_0300	24,7
D_0200	39,6
D0000	74,1
D0200	35,3
D0300	21,3
D0600	10,6
D0900	7,6
D1200	5,5
D1500	4,2
D1800	3,5
D2100	2,9
TABLE Drops
Numero	3
PulseTime	26,2
ForceMax	58,8
D_0300	24,9
D_0200	39,6
D0000	73,8
D0200	35,3
D0300	21,2
D0600	10,6
D0900	7,8
D1200	5,4
D1500	4,2
D1800	3,5
D2100	2,9
TABLE ReportPoints
Numero	25
Latitude	48,719401
Longitude	2,342547
DOP	1,8
Chainage	153
Tair	6,5
Tsurf	9,4
Tman	0,0
Commentaire	
Date	12/12/2018 14:02
TABLE Drops
Numero	2
PulseTime	26,0
ForceMax	58,8
D_0300	10,7
D_0200	12,3
D0000	18,9
D0200	12,5
D0300	11,1
D0600	8,1
D0900	5,2
D1200	3,5
D1500	2,7
D1800	2,2
D2100	1,9
TABLE Drops
Numero	3
PulseTime	25,9
ForceMax	59,1
D_0300	10,8
D_0200	12,3
D0000	19,2
D0200	12,7
D0300	11,2
D0600	8,2
D0900	5,3
D1200	3,5
D1500	2,7
D1800	2,3
D2100	1,8
TABLE ReportPoints
Numero	26
Latitude	48,719335
Longitude	2,342795
DOP	1,8
Chainage	171
Tair	6,5
Tsurf	9,5
Tman	0,0
Commentaire	
Date	12/12/2018 14:03
TABLE Drops
Numero	2
PulseTime	25,9
ForceMax	59,2
D_0300	8,1
D_0200	9,7
D0000	83,0
D0200	10,0
D0300	8,0
D0600	5,4
D0900	3,8
D1200	2,7
D1500	2,1
D1800	1,7
D2100	1,5
TABLE Drops
Numero	3
PulseTime	25,8
ForceMax	59,4
D_0300	8,2
D_0200	9,8
D0000	87,5
D0200	10,1
D0300	8,1
D0600	5,4
D0900	3,8
D1200	2,8
D1500	2,2
D1800	1,8
D2100	1,6
TABLE ReportPoints
Numero	27
Latitude	48,719246
Longitude	2,343035
DOP	1,8
Chainage	192
Tair	6,3
Tsurf	8,7
Tman	0,0
Commentaire	
Date	12/12/2018 14:04
TABLE Drops
Numero	2
PulseTime	26,0
ForceMax	59,2
D_0300	10,9
D_0200	12,2
D0000	22,3
D0200	11,5
D0300	11,4
D0600	8,1
D0900	6,5
D1200	5,0
D1500	3,9
D1800	3,2
D2100	2,7
TABLE Drops
Numero	3
PulseTime	26,0
ForceMax	59,5
D_0300	11,0
D_0200	12,3
D0000	22,0
D0200	11,6
D0300	11,6
D0600	8,1
D0900	6,6
D1200	5,0
D1500	3,9
D1800	3,2
D2100	2,7
TABLE ReportPoints
Numero	28
Latitude	48,719166
Longitude	2,342964
DOP	1,5
Chainage	249
Tair	6,3
Tsurf	8,7
Tman	0,0
Commentaire	
Date	12/12/2018 14:06
TABLE Drops
Numero	2
PulseTime	25,8
ForceMax	59,4
D_0300	8,4
D_0200	9,8
D0000	13,4
D0200	9,6
D0300	8,3
D0600	5,8
D0900	4,2
D1200	3,1
D1500	2,4
D1800	2,0
D2100	1,8
TABLE Drops
Numero	3
PulseTime	25,7
ForceMax	59,4
D_0300	8,4
D_0200	10,2
D0000	13,6
D0200	9,6
D0300	8,3
D0600	5,7
D0900	4,3
D1200	3,1
D1500	2,4
D1800	2,0
D2100	1,7
TABLE ReportPoints
Numero	29
Latitude	48,719218
Longitude	2,342756
DOP	1,5
Chainage	264
Tair	6,3
Tsurf	8,5
Tman	0,0
Commentaire	
Date	12/12/2018 14:07
TABLE Drops
Numero	2
PulseTime	25,9
ForceMax	59,4
D_0300	7,3
D_0200	9,3
D0000	24,5
D0200	9,2
D0300	7,3
D0600	5,0
D0900	3,8
D1200	2,8
D1500	2,3
D1800	1,9
D2100	1,6
TABLE Drops
Numero	3
PulseTime	25,9
ForceMax	59,3
D_0300	7,3
D_0200	9,3
D0000	24,5
D0200	9,1
D0300	7,3
D0600	5,0
D0900	3,7
D1200	2,8
D1500	2,3
D1800	1,9
D2100	1,6
TABLE ReportPoints
Numero	30
Latitude	48,719297
Longitude	2,342548
DOP	1,5
Chainage	282
Tair	6,3
Tsurf	8,5
Tman	0,0
Commentaire	
Date	12/12/2018 14:08
TABLE Drops
Numero	2
PulseTime	26,2
ForceMax	58,5
D_0300	10,1
D_0200	10,9
D0000	19,3
D0200	10,1
D0300	8,9
D0600	5,7
D0900	3,7
D1200	2,5
D1500	1,9
D1800	1,6
D2100	1,4
TABLE Drops
Numero	3
PulseTime	26,1
ForceMax	59,1
D_0300	11,6
D_0200	11,3
D0000	20,1
D0200	10,0
D0300	9,1
D0600	5,8
D0900	3,7
D1200	2,5
D1500	1,9
D1800	1,6
D2100	1,4
TABLE ReportPoints
Numero	31
Latitude	48,719380
Longitude	2,342349
DOP	1,5
Chainage	299
Tair	6,3
Tsurf	7,6
Tman	0,0
Commentaire	
Date	12/12/2018 14:08
TABLE Drops
Numero	2
PulseTime	25,4
ForceMax	60,9
D_0300	11,8
D_0200	13,5
D0000	23,2
D0200	13,3
D0300	11,5
D0600	8,2
D0900	6,3
D1200	4,7
D1500	3,7
D1800	3,0
D2100	2,5
TABLE Drops
Numero	3
PulseTime	25,4
ForceMax	61,0
D_0300	11,9
D_0200	13,6
D0000	22,9
D0200	13,4
D0300	11,6
D0600	8,3
D0900	6,2
D1200	4,7
D1500	3,7
D1800	3,0
D2100	2,6
TABLE ReportPoints
Numero	32
Latitude	48,719354
Longitude	2,342237
DOP	1,5
Chainage	356
Tair	6,5
Tsurf	8,9
Tman	0,0
Commentaire	
Date	12/12/2018 14:10
TABLE Drops
Numero	2
PulseTime	26,1
ForceMax	59,2
D_0300	24,2
D_0200	26,4
D0000	35,4
D0200	23,1
D0300	20,7
D0600	15,0
D0900	11,7
D1200	8,6
D1500	6,7
D1800	5,3
D2100	4,3
TABLE Drops
Numero	3
PulseTime	26,1
ForceMax	59,2
D_0300	24,3
D_0200	26,6
D0000	34,7
D0200	23,2
D0300	20,8
D0600	15,1
D0900	11,7
D1200	8,6
D1500	6,7
D1800	5,3
D2100	4,3
TABLE ReportPoints
Numero	33
Latitude	48,719285
Longitude	2,342409
DOP	1,5
Chainage	370
Tair	6,5
Tsurf	8,5
Tman	0,0
Commentaire	
Date	12/12/2018 14:11
TABLE Drops
Numero	2
PulseTime	26,1
ForceMax	59,3
D_0300	10,4
D_0200	12,7
D0000	27,1
D0200	12,3
D0300	10,2
D0600	7,1
D0900	5,3
D1200	4,3
D1500	3,4
D1800	2,8
D2100	2,4
TABLE Drops
Numero	3
PulseTime	26,0
ForceMax	59,5
D_0300	10,4
D_0200	12,8
D0000	22,6
D0200	12,4
D0300	10,3
D0600	7,1
D0900	5,3
D1200	4,3
D1500	3,5
D1800	2,8
D2100	2,4
TABLE ReportPoints
Numero	34
Latitude	48,719207
Longitude	2,342643
DOP	1,5
Chainage	390
Tair	6,7
Tsurf	9,0
Tman	0,0
Commentaire	
Date	12/12/2018 14:12
TABLE Drops
Numero	2
PulseTime	26,0
ForceMax	59,6
D_0300	10,4
D_0200	11,9
D0000	16,7
D0200	11,6
D0300	10,0
D0600	6,9
D0900	4,8
D1200	3,3
D1500	2,5
D1800	1,8
D2100	1,5
TABLE Drops
Numero	3
PulseTime	26,0
ForceMax	59,9
D_0300	10,5
D_0200	12,0
D0000	16,9
D0200	11,6
D0300	10,1
D0600	6,9
D0900	4,9
D1200	3,3
D1500	2,5
D1800	1,9
D2100	1,5
TABLE ReportPoints
Numero	35
Latitude	48,718960
Longitude	2,344038
DOP	1,5
Chainage	621
Tair	6,9
Tsurf	5,6
Tman	0,0
Commentaire	
Date	12/12/2018 14:15
TABLE Drops
Numero	2
PulseTime	27,3
ForceMax	57,0
D_0300	41,0
D_0200	64,2
D0000	108,2
D0200	59,8
D0300	38,0
D0600	19,9
D0900	12,9
D1200	9,2
D1500	6,9
D1800	5,3
D2100	4,2
TABLE Drops
Numero	3
PulseTime	27,2
ForceMax	57,5
D_0300	41,9
D_0200	66,0
D0000	108,6
D0200	61,0
D0300	38,9
D0600	20,2
D0900	13,2
D1200	9,3
D1500	7,0
D1800	5,4
D2100	4,3
TABLE ReportPoints
Numero	36
Latitude	48,719001
Longitude	2,344256
DOP	1,5
Chainage	638
Tair	7,1
Tsurf	7,5
Tman	0,0
Commentaire	
Date	12/12/2018 14:16
TABLE Drops
Numero	2
PulseTime	26,2
ForceMax	59,4
D_0300	26,5
D_0200	31,0
D0000	44,1
D0200	29,6
D0300	25,0
D0600	17,0
D0900	12,1
D1200	8,6
D1500	6,3
D1800	4,8
D2100	3,8
TABLE Drops
Numero	3
PulseTime	26,2
ForceMax	59,7
D_0300	26,9
D_0200	31,3
D0000	44,6
D0200	29,9
D0300	25,2
D0600	17,1
D0900	12,2
D1200	8,6
D1500	6,3
D1800	4,9
D2100	3,8
TABLE ReportPoints
Numero	37
Latitude	48,719040
Longitude	2,344440
DOP	1,5
Chainage	656
Tair	7,3
Tsurf	7,7
Tman	0,0
Commentaire	
Date	12/12/2018 14:17
TABLE Drops
Numero	2
PulseTime	28,3
ForceMax	56,0
D_0300	80,7
D_0200	125,6
D0000	161,3
D0200	123,2
D0300	79,5
D0600	29,9
D0900	16,1
D1200	10,0
D1500	7,4
D1800	5,8
D2100	4,7
TABLE Drops
Numero	3
PulseTime	28,3
ForceMax	55,8
D_0300	82,0
D_0200	128,0
D0000	162,2
D0200	124,1
D0300	80,9
D0600	30,3
D0900	16,3
D1200	10,1
D1500	7,5
D1800	5,8
D2100	4,7
TABLE ReportPoints
Numero	38
Latitude	48,719081
Longitude	2,344688
DOP	1,5
Chainage	674
Tair	7,1
Tsurf	7,3
Tman	0,0
Commentaire	
Date	12/12/2018 14:19
TABLE Drops
Numero	2
PulseTime	26,7
ForceMax	58,9
D_0300	37,1
D_0200	49,0
D0000	72,2
D0200	44,3
D0300	34,1
D0600	20,7
D0900	14,1
D1200	9,3
D1500	6,9
D1800	5,3
D2100	4,3
TABLE Drops
Numero	3
PulseTime	26,7
ForceMax	58,9
D_0300	37,5
D_0200	49,6
D0000	74,0
D0200	44,8
D0300	34,3
D0600	20,9
D0900	14,2
D1200	9,4
D1500	6,9
D1800	5,4
D2100	4,3
TABLE ReportPoints
Numero	39
Latitude	48,719150
Longitude	2,345009
DOP	1,5
Chainage	724
Tair	7,1
Tsurf	7,6
Tman	0,0
Commentaire	
Date	12/12/2018 14:21
TABLE Drops
Numero	2
PulseTime	25,7
ForceMax	60,7
D_0300	14,0
D_0200	16,3
D0000	29,3
D0200	15,3
D0300	13,4
D0600	10,6
D0900	8,4
D1200	6,5
D1500	5,1
D1800	3,9
D2100	3,0
TABLE Drops
Numero	3
PulseTime	25,7
ForceMax	60,8
D_0300	14,1
D_0200	16,5
D0000	28,7
D0200	15,3
D0300	13,6
D0600	10,6
D0900	8,5
D1200	6,5
D1500	5,1
D1800	3,9
D2100	3,0
TABLE ReportPoints
Numero	40
Latitude	48,719206
Longitude	2,345320
DOP	1,5
Chainage	747
Tair	7,1
Tsurf	7,3
Tman	0,0
Commentaire	
Date	12/12/2018 14:22
TABLE Drops
Numero	2
PulseTime	26,7
ForceMax	59,2
D_0300	33,9
D_0200	44,3
D0000	77,3
D0200	43,8
D0300	34,0
D0600	18,6
D0900	11,0
D1200	6,7
D1500	4,5
D1800	3,3
D2100	2,6
TABLE Drops
Numero	3
PulseTime	26,7
ForceMax	58,8
D_0300	34,1
D_0200	44,9
D0000	82,8
D0200	44,1
D0300	34,2
D0600	18,6
D0900	11,0
D1200	6,7
D1500	4,5
D1800	3,3
D2100	2,6
TABLE ReportPoints
Numero	41
Latitude	48,719258
Longitude	2,345639
DOP	1,8
Chainage	771
Tair	7,1
Tsurf	7,5
Tman	0,0
Commentaire	
Date	12/12/2018 14:23
TABLE Drops
Numero	2
PulseTime	26,7
ForceMax	58,8
D_0300	32,6
D_0200	42,1
D0000	67,3
D0200	39,1
D0300	29,6
D0600	16,9
D0900	10,5
D1200	6,8
D1500	4,7
D1800	3,5
D2100	2,8
TABLE Drops
Numero	3
PulseTime	26,7
ForceMax	59,2
D_0300	33,3
D_0200	42,9
D0000	68,3
D0200	39,7
D0300	30,1
D0600	17,1
D0900	10,6
D1200	6,9
D1500	4,8
D1800	3,6
D2100	2,9
TABLE ReportPoints
Numero	42
Latitude	48,719320
Longitude	2,345931
DOP	1,5
Chainage	795
Tair	7,1
Tsurf	7,2
Tman	0,0
Commentaire	
Date	12/12/2018 14:24
TABLE Drops
Numero	2
PulseTime	26,8
ForceMax	58,8
D_0300	27,6
D_0200	40,3
D0000	82,7
D0200	37,2
D0300	26,3
D0600	14,5
D0900	9,8
D1200	7,1
D1500	5,4
D1800	4,4
D2100	3,6
TABLE Drops
Numero	3
PulseTime	26,7
ForceMax	58,9
D_0300	27,7
D_0200	40,7
D0000	83,3
D0200	37,4
D0300	26,5
D0600	14,6
D0900	9,9
D1200	7,1
D1500	5,5
D1800	4,5
D2100	3,7
TABLE ReportPoints
Numero	43
Latitude	48,719383
Longitude	2,346269
DOP	1,5
Chainage	821
Tair	7,1
Tsurf	7,3
Tman	0,0
Commentaire	
Date	12/12/2018 14:25
TABLE Drops
Numero	2
PulseTime	26,2
ForceMax	60,0
D_0300	20,4
D_0200	23,8
D0000	33,3
D0200	23,3
D0300	20,1
D0600	14,0
D0900	10,4
D1200	7,5
D1500	5,7
D1800	4,4
D2100	3,5
TABLE Drops
Numero	3
PulseTime	26,2
ForceMax	60,1
D_0300	20,3
D_0200	23,7
D0000	33,5
D0200	23,3
D0300	20,0
D0600	13,8
D0900	10,2
D1200	7,3
D1500	5,4
D1800	4,2
D2100	3,2
TABLE ReportPoints
Numero	44
Latitude	48,719439
Longitude	2,346593
DOP	1,5
Chainage	846
Tair	6,9
Tsurf	7,2
Tman	0,0
Commentaire	
Date	12/12/2018 14:26
TABLE Drops
Numero	2
PulseTime	26,4
ForceMax	59,5
D_0300	23,1
D_0200	26,8
D0000	35,9
D0200	26,0
D0300	22,3
D0600	15,4
D0900	11,0
D1200	8,0
D1500	6,1
D1800	4,8
D2100	3,9
TABLE Drops
Numero	3
PulseTime	26,4
ForceMax	59,5
D_0300	23,1
D_0200	26,8
D0000	36,3
D0200	26,1
D0300	22,3
D0600	15,3
D0900	11,1
D1200	7,9
D1500	6,0
D1800	4,7
D2100	3,8
TABLE ReportPoints
Numero	45
Latitude	48,719503
Longitude	2,346884
DOP	1,5
Chainage	868
Tair	6,9
Tsurf	6,2
Tman	0,0
Commentaire	
Date	12/12/2018 14:27
TABLE Drops
Numero	2
PulseTime	27,0
ForceMax	57,9
D_0300	22,9
D_0200	25,2
D0000	40,2
D0200	24,7
D0300	22,3
D0600	16,4
D0900	11,6
D1200	12,7
D1500	5,8
D1800	4,3
D2100	3,4
TABLE Drops
Numero	3
PulseTime	26,9
ForceMax	58,3
D_0300	23,1
D_0200	25,6
D0000	39,5
D0200	25,0
D0300	22,7
D0600	16,4
D0900	11,9
D1200	14,0
D1500	5,9
D1800	4,4
D2100	3,5
TABLE ReportPoints
Numero	46
Latitude	48,719530
Longitude	2,346698
DOP	1,5
Chainage	949
Tair	6,7
Tsurf	5,3
Tman	0,0
Commentaire	
Date	12/12/2018 14:29
TABLE Drops
Numero	2
PulseTime	27,0
ForceMax	57,8
D_0300	22,6
D_0200	25,9
D0000	36,6
D0200	25,4
D0300	22,4
D0600	15,6
D0900	11,0
D1200	7,6
D1500	5,4
D1800	4,1
D2100	3,1
TABLE Drops
Numero	3
PulseTime	26,9
ForceMax	57,8
D_0300	23,3
D_0200	26,7
D0000	36,6
D0200	26,2
D0300	23,0
D0600	16,1
D0900	11,6
D1200	8,3
D1500	6,2
D1800	4,8
D2100	3,8
TABLE ReportPoints
Numero	47
Latitude	48,719473
Longitude	2,346390
DOP	1,5
Chainage	972
Tair	6,5
Tsurf	6,2
Tman	0,0
Commentaire	
Date	12/12/2018 14:30
TABLE Drops
Numero	2
PulseTime	26,6
ForceMax	59,0
D_0300	17,3
D_0200	19,5
D0000	39,7
D0200	17,7
D0300	16,4
D0600	12,0
D0900	9,1
D1200	7,0
D1500	5,4
D1800	4,3
D2100	3,5
TABLE Drops
Numero	3
PulseTime	26,5
ForceMax	58,8
D_0300	17,3
D_0200	19,7
D0000	38,5
D0200	17,8
D0300	16,4
D0600	12,1
D0900	9,2
D1200	7,0
D1500	5,4
D1800	4,3
D2100	3,5
TABLE ReportPoints
Numero	48
Latitude	48,719415
Longitude	2,346027
DOP	1,5
Chainage	1000
Tair	6,3
Tsurf	6,6
Tman	0,0
Commentaire	
Date	12/12/2018 14:31
TABLE Drops
Numero	2
PulseTime	27,3
ForceMax	58,1
D_0300	34,8
D_0200	60,3
D0000	109,0
D0200	58,6
D0300	35,1
D0600	16,3
D0900	10,6
D1200	7,6
D1500	5,8
D1800	4,7
D2100	3,9
TABLE Drops
Numero	3
PulseTime	27,3
ForceMax	58,1
D_0300	35,2
D_0200	61,1
D0000	109,5
D0200	58,6
D0300	35,1
D0600	16,2
D0900	10,8
D1200	7,6
D1500	5,8
D1800	4,7
D2100	3,9
TABLE ReportPoints
Numero	49
Latitude	48,719360
Longitude	2,345711
DOP	1,5
Chainage	1024
Tair	6,3
Tsurf	5,6
Tman	0,0
Commentaire	
Date	12/12/2018 14:32
TABLE Drops
Numero	2
PulseTime	27,0
ForceMax	58,3
D_0300	33,9
D_0200	44,8
D0000	72,7
D0200	43,4
D0300	33,3
D0600	20,3
D0900	13,5
D1200	9,1
D1500	6,5
D1800	4,9
D2100	3,9
TABLE Drops
Numero	3
PulseTime	27,1
ForceMax	58,0
D_0300	33,9
D_0200	45,0
D0000	75,3
D0200	43,5
D0300	33,3
D0600	20,2
D0900	13,4
D1200	9,0
D1500	6,4
D1800	4,8
D2100	3,9
TABLE ReportPoints
Numero	50
Latitude	48,719310
Longitude	2,345424
DOP	1,5
Chainage	1047
Tair	6,5
Tsurf	6,2
Tman	0,0
Commentaire	
Date	12/12/2018 14:35
TABLE Drops
Numero	2
PulseTime	26,5
ForceMax	59,2
D_0300	23,7
D_0200	30,7
D0000	46,0
D0200	29,8
D0300	23,7
D0600	15,0
D0900	10,2
D1200	7,2
D1500	5,5
D1800	4,6
D2100	3,5
TABLE Drops
Numero	3
PulseTime	26,5
ForceMax	59,3
D_0300	23,8
D_0200	30,8
D0000	46,5
D0200	29,9
D0300	23,7
D0600	14,9
D0900	10,3
D1200	7,2
D1500	5,4
D1800	4,3
D2100	3,4
TABLE ReportPoints
Numero	51
Latitude	48,719257
Longitude	2,345138
DOP	1,8
Chainage	1068
Tair	6,3
Tsurf	6,3
Tman	0,0
Commentaire	
Date	12/12/2018 14:36
TABLE Drops
Numero	2
PulseTime	27,1
ForceMax	58,1
D_0300	32,9
D_0200	43,0
D0000	67,5
D0200	40,9
D0300	31,7
D0600	18,3
D0900	12,0
D1200	8,1
D1500	6,2
D1800	5,0
D2100	4,0
TABLE Drops
Numero	3
PulseTime	27,1
ForceMax	58,2
D_0300	33,3
D_0200	43,8
D0000	69,4
D0200	41,7
D0300	32,1
D0600	18,4
D0900	12,0
D1200	8,1
D1500	6,1
D1800	4,9
D2100	4,0
TABLE ReportPoints
Numero	52
Latitude	48,719200
Longitude	2,344856
DOP	1,8
Chainage	1090
Tair	6,3
Tsurf	6,1
Tman	0,0
Commentaire	
Date	12/12/2018 14:37
TABLE Drops
Numero	2
PulseTime	26,5
ForceMax	59,3
D_0300	24,1
D_0200	28,7
D0000	45,3
D0200	29,0
D0300	24,4
D0600	17,2
D0900	12,8
D1200	9,2
D1500	6,8
D1800	5,1
D2100	4,0
TABLE Drops
Numero	3
PulseTime	26,5
ForceMax	59,3
D_0300	24,1
D_0200	28,9
D0000	46,0
D0200	29,2
D0300	24,5
D0600	17,4
D0900	12,8
D1200	9,2
D1500	6,8
D1800	5,1
D2100	3,9
TABLE ReportPoints
Numero	53
Latitude	48,719144
Longitude	2,344528
DOP	1,8
Chainage	1116
Tair	6,1
Tsurf	6,6
Tman	0,0
Commentaire	
Date	12/12/2018 14:38
TABLE Drops
Numero	2
PulseTime	26,9
ForceMax	58,6
D_0300	28,2
D_0200	35,1
D0000	53,5
D0200	32,5
D0300	26,4
D0600	16,4
D0900	11,5
D1200	8,2
D1500	6,3
D1800	4,9
D2100	3,8
TABLE Drops
Numero	3
PulseTime	26,9
ForceMax	58,7
D_0300	28,5
D_0200	35,5
D0000	54,9
D0200	32,8
D0300	26,7
D0600	16,4
D0900	11,5
D1200	8,2
D1500	6,2
D1800	4,8
D2100	3,8
TABLE ReportPoints
Numero	54
Latitude	48,719116
Longitude	2,344285
DOP	1,8
Chainage	1134
Tair	6,3
Tsurf	6,3
Tman	0,0
Commentaire	
Date	12/12/2018 14:39
TABLE Drops
Numero	2
PulseTime	27,9
ForceMax	56,6
D_0300	46,0
D_0200	70,7
D0000	129,8
D0200	71,9
D0300	46,7
D0600	19,8
D0900	11,5
D1200	7,9
D1500	6,0
D1800	5,1
D2100	4,2
TABLE Drops
Numero	3
PulseTime	27,9
ForceMax	56,7
D_0300	46,5
D_0200	71,5
D0000	129,4
D0200	72,1
D0300	47,1
D0600	19,9
D0900	11,6
D1200	7,9
D1500	6,0
D1800	5,0
D2100	4,2
TABLE ReportPoints
Numero	55
Latitude	48,718997
Longitude	2,344089
DOP	1,8
Chainage	1172
Tair	6,5
Tsurf	5,8
Tman	0,0
Commentaire	
Date	12/12/2018 14:40
TABLE Drops
Numero	2
PulseTime	27,5
ForceMax	57,7
D_0300	40,8
D_0200	53,7
D0000	97,8
D0200	56,3
D0300	41,7
D0600	20,6
D0900	11,9
D1200	7,4
D1500	5,7
D1800	4,5
D2100	3,6
TABLE Drops
Numero	3
PulseTime	27,4
ForceMax	57,7
D_0300	41,1
D_0200	54,2
D0000	98,8
D0200	56,8
D0300	42,1
D0600	20,9
D0900	12,0
D1200	7,5
D1500	5,8
D1800	4,6
D2100	3,7
TABLE ReportPoints
Numero	56
Latitude	48,719062
Longitude	2,344485
DOP	1,8
Chainage	1201
Tair	7,1
Tsurf	7,2
Tman	0,0
Commentaire	
Date	12/12/2018 14:42
TABLE Drops
Numero	2
PulseTime	28,2
ForceMax	56,3
D_0300	66,6
D_0200	112,1
D0000	160,8
D0200	90,5
D0300	52,9
D0600	23,6
D0900	14,1
D1200	9,4
D1500	7,1
D1800	5,7
D2100	4,5
TABLE Drops
Numero	3
PulseTime	28,2
ForceMax	56,4
D_0300	66,9
D_0200	111,6
D0000	159,3
D0200	90,6
D0300	53,3
D0600	23,8
D0900	14,2
D1200	9,5
D1500	7,2
D1800	5,7
D2100	4,6
TABLE ReportPoints
Numero	57
Latitude	48,719158
Longitude	2,344136
DOP	1,8
Chainage	1292
Tair	7,3
Tsurf	5,6
Tman	0,0
Commentaire	
Date	12/12/2018 14:44
TABLE Drops
Numero	2
PulseTime	27,6
ForceMax	40,8
D_0300	25,6
D_0200	48,1
D0000	96,4
D0200	39,7
D0300	23,6
D0600	12,4
D0900	8,2
D1200	5,8
D1500	4,4
D1800	3,2
D2100	2,4
TABLE Drops
Numero	3
PulseTime	27,3
ForceMax	41,1
D_0300	26,6
D_0200	50,7
D0000	88,5
D0200	40,7
D0300	24,2
D0600	12,6
D0900	8,4
D1200	5,8
D1500	4,5
D1800	3,3
D2100	2,8
TABLE ReportPoints
Numero	58
Latitude	48,719207
Longitude	2,344387
DOP	1,8
Chainage	1311
Tair	7,3
Tsurf	7,3
Tman	0,0
Commentaire	
Date	12/12/2018 14:45
TABLE Drops
Numero	2
PulseTime	27,6
ForceMax	57,1
D_0300	30,8
D_0200	48,0
D0000	113,1
D0200	44,6
D0300	28,8
D0600	15,9
D0900	10,5
D1200	7,4
D1500	5,8
D1800	4,7
D2100	3,9
TABLE Drops
Numero	3
PulseTime	27,6
ForceMax	57,6
D_0300	31,5
D_0200	49,5
D0000	109,6
D0200	46,2
D0300	29,5
D0600	16,2
D0900	10,6
D1200	7,5
D1500	5,9
D1800	4,8
D2100	4,0
TABLE ReportPoints
Numero	59
Latitude	48,719273
Longitude	2,344638
DOP	1,8
Chainage	1338
Tair	7,3
Tsurf	6,7
Tman	0,0
Commentaire	
Date	12/12/2018 14:46
TABLE Drops
Numero	2
PulseTime	27,1
ForceMax	57,9
D_0300	26,0
D_0200	32,8
D0000	44,0
D0200	31,1
D0300	25,8
D0600	16,7
D0900	11,6
D1200	8,4
D1500	6,2
D1800	4,7
D2100	3,6
TABLE Drops
Numero	3
PulseTime	27,1
ForceMax	58,4
D_0300	26,4
D_0200	33,0
D0000	45,0
D0200	31,7
D0300	26,2
D0600	16,9
D0900	11,8
D1200	8,5
D1500	6,3
D1800	4,7
D2100	3,7
TABLE ReportPoints
Numero	60
Latitude	48,719314
Longitude	2,344911
DOP	1,8
Chainage	1359
Tair	7,3
Tsurf	7,2
Tman	0,0
Commentaire	
Date	12/12/2018 14:46
TABLE Drops
Numero	2
PulseTime	26,8
ForceMax	58,7
D_0300	14,5
D_0200	16,9
D0000	24,4
D0200	16,2
D0300	13,9
D0600	10,6
D0900	8,5
D1200	6,7
D1500	5,4
D1800	4,3
D2100	3,5
TABLE Drops
Numero	3
PulseTime	26,8
ForceMax	59,1
D_0300	14,6
D_0200	17,1
D0000	24,8
D0200	16,3
D0300	14,0
D0600	10,7
D0900	8,6
D1200	6,7
D1500	5,4
D1800	4,3
D2100	3,5
TABLE ReportPoints
Numero	61
Latitude	48,719377
Longitude	2,345204
DOP	1,8
Chainage	1382
Tair	7,5
Tsurf	6,6
Tman	0,0
Commentaire	
Date	12/12/2018 14:47
TABLE Drops
Numero	2
PulseTime	27,3
ForceMax	58,2
D_0300	34,4
D_0200	42,9
D0000	57,0
D0200	40,1
D0300	33,2
D0600	21,0
D0900	13,4
D1200	8,6
D1500	6,0
D1800	4,5
D2100	3,5
TABLE Drops
Numero	3
PulseTime	27,3
ForceMax	58,0
D_0300	34,8
D_0200	43,2
D0000	57,6
D0200	40,5
D0300	33,5
D0600	21,0
D0900	13,4
D1200	8,6
D1500	6,0
D1800	4,5
D2100	3,6
TABLE ReportPoints
Numero	62
Latitude	48,719427
Longitude	2,345462
DOP	1,8
Chainage	1402
Tair	7,5
Tsurf	8,6
Tman	0,0
Commentaire	
Date	12/12/2018 14:48
TABLE Drops
Numero	2
PulseTime	26,6
ForceMax	59,0
D_0300	23,6
D_0200	29,4
D0000	52,1
D0200	29,1
D0300	22,9
D0600	14,7
D0900	10,7
D1200	7,6
D1500	5,9
D1800	4,7
D2100	3,7
TABLE Drops
Numero	3
PulseTime	26,7
ForceMax	58,9
D_0300	23,7
D_0200	29,7
D0000	52,5
D0200	29,3
D0300	22,9
D0600	14,5
D0900	10,3
D1200	7,4
D1500	5,7
D1800	4,5
D2100	3,5
TABLE ReportPoints
Numero	63
Latitude	48,719493
Longitude	2,345801
DOP	1,8
Chainage	1427
Tair	7,3
Tsurf	5,8
Tman	0,0
Commentaire	
Date	12/12/2018 14:49
TABLE Drops
Numero	2
PulseTime	26,8
ForceMax	59,0
D_0300	19,8
D_0200	25,4
D0000	44,8
D0200	25,0
D0300	19,5
D0600	12,7
D0900	9,6
D1200	7,2
D1500	5,6
D1800	4,4
D2100	3,5
TABLE Drops
Numero	3
PulseTime	26,8
ForceMax	59,0
D_0300	19,9
D_0200	25,6
D0000	45,5
D0200	25,2
D0300	19,6
D0600	12,7
D0900	9,6
D1200	7,2
D1500	5,6
D1800	4,5
D2100	3,5
TABLE ReportPoints
Numero	64
Latitude	48,719545
Longitude	2,346108
DOP	1,8
Chainage	1451
Tair	7,3
Tsurf	7,0
Tman	0,0
Commentaire	
Date	12/12/2018 14:49
TABLE Drops
Numero	2
PulseTime	26,8
ForceMax	59,1
D_0300	30,1
D_0200	38,7
D0000	59,8
D0200	37,6
D0300	29,9
D0600	17,9
D0900	11,8
D1200	7,9
D1500	5,8
D1800	4,6
D2100	3,6
TABLE Drops
Numero	3
PulseTime	26,8
ForceMax	59,1
D_0300	30,4
D_0200	39,3
D0000	60,5
D0200	38,2
D0300	30,3
D0600	18,1
D0900	11,8
D1200	8,0
D1500	5,8
D1800	4,5
D2100	3,6
TABLE ReportPoints
Numero	65
Latitude	48,719613
Longitude	2,346443
DOP	1,8
Chainage	1477
Tair	7,1
Tsurf	4,8
Tman	0,0
Commentaire	
Date	12/12/2018 14:50
TABLE Drops
Numero	2
PulseTime	28,1
ForceMax	55,6
D_0300	58,3
D_0200	68,4
D0000	88,3
D0200	67,9
D0300	57,4
D0600	39,3
D0900	25,3
D1200	15,6
D1500	9,8
D1800	6,5
D2100	4,9
TABLE Drops
Numero	3
PulseTime	28,0
ForceMax	55,6
D_0300	60,4
D_0200	70,8
D0000	91,3
D0200	70,2
D0300	59,3
D0600	40,0
D0900	25,6
D1200	15,9
D1500	10,0
D1800	6,5
D2100	4,9
TABLE ReportPoints
Numero	67
Latitude	48,719549
Longitude	2,345564
DOP	1,8
Chainage	1591
Tair	6,7
Tsurf	6,3
Tman	0,0
Commentaire	
Date	12/12/2018 14:54
TABLE Drops
Numero	2
PulseTime	28,1
ForceMax	56,2
D_0300	39,4
D_0200	60,0
D0000	131,4
D0200	61,7
D0300	39,3
D0600	18,7
D0900	12,2
D1200	8,5
D1500	6,7
D1800	5,5
D2100	4,6
TABLE Drops
Numero	3
PulseTime	28,1
ForceMax	56,4
D_0300	39,9
D_0200	60,9
D0000	132,6
D0200	62,6
D0300	39,8
D0600	18,9
D0900	12,3
D1200	8,6
D1500	6,7
D1800	5,5
D2100	4,7
TABLE ReportPoints
Numero	68
Latitude	48,719481
Longitude	2,345171
DOP	1,8
Chainage	1620
Tair	6,7
Tsurf	6,3
Tman	0,0
Commentaire	
Date	12/12/2018 14:56
TABLE Drops
Numero	2
PulseTime	26,9
ForceMax	56,8
D_0300	11,9
D_0200	13,7
D0000	22,1
D0200	13,0
D0300	11,6
D0600	8,7
D0900	7,1
D1200	5,5
D1500	4,5
D1800	3,8
D2100	3,1
TABLE Drops
Numero	3
PulseTime	26,9
ForceMax	56,0
D_0300	11,8
D_0200	13,5
D0000	21,4
D0200	12,9
D0300	11,5
D0600	8,6
D0900	7,0
D1200	5,4
D1500	4,4
D1800	3,7
D2100	3,1
TABLE ReportPoints
Numero	69
Latitude	48,719451
Longitude	2,344917
DOP	1,8
Chainage	1639
Tair	6,7
Tsurf	5,1
Tman	0,0
Commentaire	
Date	12/12/2018 14:57
TABLE Drops
Numero	2
PulseTime	27,2
ForceMax	57,5
D_0300	11,3
D_0200	12,9
D0000	23,9
D0200	11,9
D0300	12,1
D0600	8,8
D0900	8,0
D1200	6,4
D1500	5,4
D1800	4,6
D2100	3,8
TABLE Drops
Numero	3
PulseTime	27,1
ForceMax	57,9
D_0300	11,4
D_0200	13,0
D0000	23,2
D0200	10,9
D0300	12,3
D0600	9,5
D0900	7,9
D1200	6,5
D1500	5,5
D1800	4,6
D2100	3,9
TABLE ReportPoints
Numero	70
Latitude	48,719408
Longitude	2,344615
DOP	1,8
Chainage	1662
Tair	6,7
Tsurf	4,9
Tman	0,0
Commentaire	
Date	12/12/2018 14:58
TABLE Drops
Numero	2
PulseTime	27,2
ForceMax	57,4
D_0300	18,6
D_0200	21,7
D0000	30,5
D0200	20,8
D0300	17,8
D0600	12,5
D0900	9,3
D1200	6,9
D1500	5,3
D1800	4,2
D2100	3,4
TABLE Drops
Numero	3
PulseTime	27,1
ForceMax	58,0
D_0300	18,8
D_0200	22,0
D0000	31,4
D0200	21,1
D0300	18,0
D0600	12,6
D0900	9,4
D1200	7,0
D1500	5,3
D1800	4,3
D2100	3,4
TABLE ReportPoints
Numero	71
Latitude	48,719456
Longitude	2,344404
DOP	1,8
Chainage	1696
Tair	6,5
Tsurf	5,7
Tman	0,0
Commentaire	
Date	12/12/2018 14:59
TABLE Drops
Numero	2
PulseTime	27,2
ForceMax	58,0
D_0300	14,4
D_0200	18,1
D0000	28,3
D0200	17,9
D0300	14,7
D0600	10,6
D0900	8,9
D1200	7,0
D1500	5,7
D1800	4,6
D2100	3,7
TABLE Drops
Numero	3
PulseTime	27,2
ForceMax	57,9
D_0300	14,4
D_0200	18,2
D0000	29,1
D0200	17,6
D0300	14,7
D0600	10,6
D0900	8,9
D1200	7,0
D1500	5,6
D1800	4,6
D2100	3,7
TABLE ReportPoints
Numero	72
Latitude	48,719528
Longitude	2,344716
DOP	1,8
Chainage	1720
Tair	6,7
Tsurf	5,2
Tman	0,0
Commentaire	
Date	12/12/2018 14:59
TABLE Drops
Numero	2
PulseTime	27,2
ForceMax	57,8
D_0300	6,9
D_0200	8,1
D0000	12,3
D0200	7,8
D0300	6,7
D0600	5,2
D0900	4,7
D1200	4,0
D1500	3,5
D1800	3,1
D2100	2,8
TABLE Drops
Numero	3
PulseTime	27,1
ForceMax	58,1
D_0300	7,0
D_0200	8,1
D0000	11,6
D0200	7,9
D0300	6,7
D0600	5,2
D0900	4,7
D1200	4,0
D1500	3,5
D1800	3,1
D2100	2,8
TABLE ReportPoints
Numero	73
Latitude	48,719592
Longitude	2,344974
DOP	1,8
Chainage	1740
Tair	6,9
Tsurf	5,4
Tman	0,0
Commentaire	
Date	12/12/2018 15:00
TABLE Drops
Numero	2
PulseTime	27,4
ForceMax	57,6
D_0300	20,3
D_0200	23,9
D0000	35,3
D0200	23,4
D0300	19,9
D0600	13,4
D0900	9,8
D1200	7,1
D1500	5,4
D1800	4,2
D2100	3,7
TABLE Drops
Numero	3
PulseTime	27,4
ForceMax	57,6
D_0300	20,3
D_0200	24,1
D0000	37,3
D0200	23,5
D0300	19,9
D0600	13,4
D0900	9,7
D1200	7,1
D1500	5,3
D1800	4,2
D2100	3,6
TABLE ReportPoints
Numero	74
Latitude	48,719640
Longitude	2,345239
DOP	1,8
Chainage	1760
Tair	6,9
Tsurf	4,7
Tman	0,0
Commentaire	
Date	12/12/2018 15:01
TABLE Drops
Numero	2
PulseTime	28,1
ForceMax	56,4
D_0300	36,4
D_0200	47,9
D0000	84,8
D0200	46,4
D0300	34,8
D0600	19,5
D0900	13,0
D1200	9,2
D1500	6,8
D1800	5,4
D2100	4,4
TABLE Drops
Numero	3
PulseTime	28,0
ForceMax	56,7
D_0300	37,1
D_0200	49,2
D0000	88,1
D0200	47,5
D0300	35,5
D0600	19,8
D0900	13,1
D1200	9,3
D1500	6,9
D1800	5,5
D2100	4,5
TABLE ReportPoints
Numero	75
Latitude	48,719713
Longitude	2,345596
DOP	1,8
Chainage	1787
Tair	7,1
Tsurf	6,8
Tman	0,0
Commentaire	
Date	12/12/2018 15:02
TABLE Drops
Numero	2
PulseTime	27,6
ForceMax	57,7
D_0300	16,8
D_0200	25,7
D0000	62,1
D0200	25,6
D0300	15,8
D0600	7,2
D0900	4,3
D1200	3,1
D1500	2,5
D1800	2,1
D2100	1,8
TABLE Drops
Numero	3
PulseTime	27,7
ForceMax	57,4
D_0300	16,8
D_0200	26,1
D0000	61,1
D0200	25,3
D0300	15,8
D0600	7,2
D0900	4,3
D1200	3,1
D1500	2,5
D1800	2,1
D2100	1,8
TABLE ReportPoints
Numero	76
Latitude	48,719760
Longitude	2,345880
DOP	1,8
Chainage	1810
Tair	7,1
Tsurf	5,8
Tman	0,0
Commentaire	
Date	12/12/2018 15:03
TABLE Drops
Numero	2
PulseTime	27,6
ForceMax	57,2
D_0300	20,4
D_0200	29,1
D0000	55,7
D0200	29,1
D0300	20,8
D0600	10,6
D0900	7,0
D1200	4,9
D1500	4,0
D1800	3,4
D2100	2,9
TABLE Drops
Numero	3
PulseTime	27,6
ForceMax	57,3
D_0300	20,7
D_0200	29,5
D0000	57,9
D0200	29,1
D0300	21,0
D0600	10,7
D0900	7,0
D1200	4,9
D1500	4,1
D1800	3,4
D2100	2,9
TABLE ReportPoints
Numero	77
Latitude	48,719837
Longitude	2,345803
DOP	1,8
Chainage	1880
Tair	7,1
Tsurf	4,9
Tman	0,0
Commentaire	
Date	12/12/2018 15:04
TABLE Drops
Numero	2
PulseTime	27,7
ForceMax	56,9
D_0300	14,1
D_0200	28,4
D0000	80,8
D0200	11,6
D0300	16,1
D0600	7,6
D0900	4,7
D1200	3,5
D1500	2,9
D1800	2,6
D2100	2,3
TABLE Drops
Numero	3
PulseTime	27,6
ForceMax	57,2
D_0300	13,9
D_0200	26,2
D0000	147,2
D0200	12,2
D0300	16,2
D0600	95,8
D0900	4,4
D1200	3,6
D1500	2,9
D1800	2,6
D2100	2,2
TABLE ReportPoints
Numero	78
Latitude	48,719790
Longitude	2,345580
DOP	1,8
Chainage	1897
Tair	6,9
Tsurf	4,5
Tman	0,0
Commentaire	
Date	12/12/2018 15:05
TABLE Drops
Numero	2
PulseTime	27,7
ForceMax	56,5
D_0300	13,0
D_0200	18,5
D0000	40,8
D0200	18,8
D0300	12,8
D0600	6,6
D0900	4,3
D1200	3,1
D1500	2,5
D1800	2,1
D2100	1,9
TABLE Drops
Numero	3
PulseTime	27,5
ForceMax	57,1
D_0300	13,1
D_0200	19,1
D0000	42,7
D0200	19,3
D0300	13,1
D0600	6,7
D0900	4,3
D1200	3,1
D1500	2,5
D1800	2,1
D2100	1,9
TABLE ReportPoints
Numero	79
Latitude	48,719769
Longitude	2,345302
DOP	1,8
Chainage	1917
Tair	6,7
Tsurf	3,0
Tman	0,0
Commentaire	
Date	12/12/2018 15:05
TABLE Drops
Numero	2
PulseTime	28,0
ForceMax	56,3
D_0300	15,2
D_0200	26,4
D0000	67,9
D0200	33,5
D0300	13,5
D0600	5,9
D0900	3,6
D1200	2,7
D1500	2,3
D1800	2,0
D2100	1,7
TABLE Drops
Numero	3
PulseTime	27,9
ForceMax	56,6
D_0300	15,3
D_0200	26,9
D0000	69,5
D0200	34,1
D0300	15,4
D0600	6,0
D0900	3,7
D1200	2,6
D1500	2,2
D1800	1,9
D2100	1,7
TABLE ReportPoints
Numero	80
Latitude	48,719712
Longitude	2,345047
DOP	1,8
Chainage	1938
Tair	6,7
Tsurf	5,4
Tman	0,0
Commentaire	
Date	12/12/2018 15:06
TABLE Drops
Numero	2
PulseTime	27,7
ForceMax	56,4
D_0300	5,8
D_0200	3,7
D0000	67,1
D0200	4,2
D0300	11,5
D0600	4,0
D0900	3,6
D1200	2,9
D1500	2,7
D1800	2,5
D2100	2,2
TABLE Drops
Numero	3
PulseTime	27,6
ForceMax	57,0
D_0300	6,5
D_0200	4,5
D0000	69,1
D0200	4,5
D0300	13,6
D0600	4,1
D0900	3,5
D1200	3,0
D1500	2,7
D1800	2,5
D2100	2,3
TABLE ReportPoints
Numero	81
Latitude	48,719886
Longitude	2,345471
DOP	1,8
Chainage	2059
Tair	6,7
Tsurf	6,3
Tman	0,0
Commentaire	
Date	12/12/2018 15:08
TABLE Drops
Numero	2
PulseTime	27,6
ForceMax	56,6
D_0300	13,2
D_0200	20,9
D0000	146,3
D0200	17,2
D0300	12,0
D0600	7,2
D0900	5,1
D1200	3,8
D1500	3,2
D1800	2,7
D2100	2,3
TABLE Drops
Numero	3
PulseTime	27,5
ForceMax	57,1
D_0300	13,4
D_0200	21,6
D0000	141,7
D0200	17,7
D0300	12,3
D0600	7,3
D0900	5,1
D1200	3,8
D1500	3,2
D1800	2,7
D2100	2,3
TABLE ReportPoints
Numero	82
Latitude	48,719885
Longitude	2,345550
DOP	1,8
Chainage	2065
Tair	6,9
Tsurf	6,8
Tman	0,0
Commentaire	
Date	12/12/2018 15:08
TABLE Drops
Numero	2
PulseTime	27,6
ForceMax	57,0
D_0300	15,8
D_0200	22,1
D0000	45,7
D0200	19,4
D0300	14,0
D0600	8,0
D0900	5,8
D1200	4,4
D1500	3,6
D1800	3,0
D2100	2,5
TABLE Drops
Numero	3
PulseTime	27,5
ForceMax	57,3
D_0300	16,0
D_0200	22,5
D0000	46,8
D0200	20,1
D0300	14,2
D0600	8,1
D0900	5,9
D1200	4,4
D1500	3,6
D1800	3,0
D2100	2,6
