<?xml version="1.0" encoding="UTF-8" standalone="no"?>
<!DOCTYPE svg PUBLIC "-//W3C//DTD SVG 1.1//EN" "http://www.w3.org/Graphics/SVG/1.1/DTD/svg11.dtd">
<svg width="100%" height="100%" viewBox="0 0 417 417" version="1.1" xmlns="http://www.w3.org/2000/svg" xmlns:xlink="http://www.w3.org/1999/xlink" xml:space="preserve" xmlns:serif="http://www.serif.com/" style="fill-rule:evenodd;clip-rule:evenodd;stroke-linecap:round;stroke-linejoin:round;stroke-miterlimit:1.5;">
    <g transform="matrix(1.203,0,0,1.22567,-35.5836,-63.0049)">
        <ellipse cx="202.757" cy="221.379" rx="159.324" ry="156.376" style="fill:none;stroke:currentColor;stroke-width:27.45px;"/>
    </g>
    <g transform="matrix(1,0,0,1,13.2579,-42.3744)" fill="currentColor">
        <g transform="matrix(150,0,0,150,58.8062,304.054)">
            <path d="M0.279,-0.729C0.329,-0.729 0.372,-0.721 0.408,-0.704C0.445,-0.688 0.473,-0.666 0.492,-0.638C0.511,-0.611 0.521,-0.58 0.521,-0.547C0.521,-0.503 0.508,-0.467 0.483,-0.438C0.457,-0.41 0.422,-0.389 0.376,-0.376C0.488,-0.361 0.544,-0.302 0.544,-0.2C0.544,-0.16 0.532,-0.123 0.51,-0.09C0.488,-0.057 0.456,-0.031 0.414,-0.012C0.373,0.008 0.324,0.017 0.269,0.017C0.216,0.017 0.169,0.008 0.127,-0.01C0.085,-0.028 0.049,-0.055 0.018,-0.089L0.11,-0.174C0.149,-0.129 0.198,-0.107 0.258,-0.107C0.294,-0.107 0.323,-0.116 0.345,-0.134C0.366,-0.152 0.377,-0.178 0.377,-0.211C0.377,-0.248 0.367,-0.275 0.347,-0.292C0.326,-0.309 0.296,-0.317 0.257,-0.317L0.192,-0.317L0.211,-0.429L0.257,-0.429C0.289,-0.429 0.315,-0.437 0.335,-0.453C0.354,-0.469 0.364,-0.492 0.364,-0.522C0.364,-0.548 0.355,-0.569 0.336,-0.585C0.317,-0.6 0.292,-0.608 0.261,-0.608C0.234,-0.608 0.209,-0.603 0.186,-0.593C0.163,-0.582 0.141,-0.567 0.119,-0.547L0.036,-0.633C0.102,-0.697 0.183,-0.729 0.279,-0.729Z" style="fill-rule:nonzero;"/>
        </g>
        <g transform="matrix(150,0,0,150,151.114,304.054)">
            <path d="M0.544,-0.541C0.544,-0.508 0.535,-0.479 0.518,-0.455C0.501,-0.431 0.472,-0.409 0.434,-0.387C0.526,-0.34 0.572,-0.276 0.572,-0.193C0.572,-0.155 0.562,-0.12 0.541,-0.088C0.521,-0.056 0.49,-0.031 0.45,-0.012C0.41,0.008 0.361,0.017 0.305,0.017C0.249,0.017 0.201,0.008 0.162,-0.011C0.123,-0.029 0.093,-0.054 0.073,-0.085C0.054,-0.117 0.044,-0.151 0.044,-0.189C0.044,-0.228 0.055,-0.263 0.078,-0.294C0.101,-0.324 0.133,-0.348 0.174,-0.366C0.149,-0.382 0.129,-0.398 0.114,-0.413C0.1,-0.428 0.089,-0.445 0.082,-0.464C0.075,-0.483 0.071,-0.506 0.071,-0.532C0.071,-0.572 0.082,-0.606 0.102,-0.636C0.123,-0.666 0.151,-0.689 0.187,-0.705C0.223,-0.721 0.264,-0.729 0.309,-0.729C0.355,-0.729 0.396,-0.721 0.431,-0.706C0.467,-0.69 0.495,-0.668 0.514,-0.64C0.534,-0.612 0.544,-0.578 0.544,-0.541ZM0.226,-0.532C0.226,-0.508 0.234,-0.487 0.25,-0.471C0.266,-0.455 0.293,-0.44 0.329,-0.426C0.351,-0.443 0.367,-0.459 0.376,-0.475C0.385,-0.492 0.39,-0.51 0.39,-0.531C0.39,-0.558 0.383,-0.579 0.369,-0.595C0.355,-0.611 0.335,-0.618 0.309,-0.618C0.282,-0.618 0.262,-0.611 0.247,-0.596C0.233,-0.582 0.226,-0.56 0.226,-0.532ZM0.41,-0.194C0.41,-0.217 0.405,-0.236 0.396,-0.251C0.387,-0.265 0.373,-0.278 0.354,-0.288C0.336,-0.299 0.309,-0.31 0.274,-0.323C0.252,-0.309 0.236,-0.291 0.224,-0.271C0.212,-0.25 0.206,-0.226 0.206,-0.198C0.206,-0.168 0.214,-0.144 0.232,-0.126C0.25,-0.108 0.275,-0.098 0.309,-0.098C0.342,-0.098 0.367,-0.107 0.384,-0.125C0.401,-0.143 0.41,-0.166 0.41,-0.194Z" style="fill-rule:nonzero;"/>
        </g>
        <g transform="matrix(150,0,0,150,243.422,304.054)">
            <path d="M0.496,-0.271L0.568,-0.271L0.568,-0.149L0.496,-0.149L0.496,-0L0.341,-0L0.34,-0.149L0.046,-0.149L0.046,-0.257L0.243,-0.729L0.381,-0.678L0.213,-0.271L0.341,-0.271L0.359,-0.442L0.496,-0.442L0.496,-0.271Z" style="fill-rule:nonzero;"/>
        </g>
    </g>
    <g transform="matrix(0.707107,-0.707107,1.05857,1.05857,-21.7047,25.5269)" fill="currentColor">
        <path d="M50.26,26.21C50.26,19.993 42.704,14.946 33.398,14.946C24.091,14.946 16.535,19.993 16.535,26.21L16.535,363.793C16.535,370.009 24.091,375.056 33.398,375.056C42.704,375.056 50.26,370.009 50.26,363.793L50.26,26.21Z"/>
    </g>
    <g transform="matrix(0.707107,-0.707107,1.05857,1.05857,-21.7047,25.5269)" fill="currentColor">
        <path d="M50.26,26.21C50.26,19.993 42.704,14.946 33.398,14.946C24.091,14.946 16.535,19.993 16.535,26.21L16.535,363.793C16.535,370.009 24.091,375.056 33.398,375.056C42.704,375.056 50.26,370.009 50.26,363.793L50.26,26.21Z"/>
    </g>
</svg>
