<?xml version="1.0" encoding="UTF-8" standalone="no"?>
<!DOCTYPE svg PUBLIC "-//W3C//DTD SVG 1.1//EN" "http://www.w3.org/Graphics/SVG/1.1/DTD/svg11.dtd">
<svg width="100%" height="100%" viewBox="0 0 417 417" version="1.1" xmlns="http://www.w3.org/2000/svg" xmlns:xlink="http://www.w3.org/1999/xlink" xml:space="preserve" xmlns:serif="http://www.serif.com/" style="fill-rule:evenodd;clip-rule:evenodd;stroke-linecap:round;stroke-linejoin:round;stroke-miterlimit:1.5;">
    <g transform="matrix(1.203,0,0,1.22567,-35.5836,-63.0049)">
        <ellipse cx="202.757" cy="221.379" rx="159.324" ry="156.376" style="fill:none;stroke:currentColor;stroke-width:27.45px;"/>
    </g>
    <g transform="matrix(0.707107,-0.707107,1.05857,1.05857,-21.7047,25.5269)" fill="currentColor">
        <path d="M50.26,26.21C50.26,19.993 42.704,14.946 33.398,14.946C24.091,14.946 16.535,19.993 16.535,26.21L16.535,363.793C16.535,370.009 24.091,375.056 33.398,375.056C42.704,375.056 50.26,370.009 50.26,363.793L50.26,26.21Z"/>
    </g>
    <g transform="matrix(341.667,0,0,341.667,101.015,328.968)" fill="currentColor">
        <path d="M0.383,-0.706L0.383,-0.07L0.531,-0.07L0.531,-0L0.123,-0L0.123,-0.07L0.297,-0.07L0.297,-0.613L0.135,-0.514L0.097,-0.576L0.308,-0.706L0.383,-0.706Z" style="fill-rule:nonzero;"/>
    </g>
</svg>
