// Jest Snapshot v1, https://goo.gl/fbAQLP

exports[`Timer should render 1`] = `
ShallowWrapper {
  Symbol(enzyme.__root__): [Circular],
  Symbol(enzyme.__unrendered__): <Timer />,
  Symbol(enzyme.__renderer__): Object {
    "batchedUpdates": [Function],
    "checkPropTypes": [Function],
    "getNode": [Function],
    "render": [Function],
    "simulateError": [Function],
    "simulateEvent": [Function],
    "unmount": [Function],
  },
  Symbol(enzyme.__node__): Object {
    "instance": null,
    "key": undefined,
    "nodeType": "host",
    "props": Object {
      "children": Array [
        <TimerTime
          minutes={25}
          seconds={0}
        />,
        <TimerControls />,
        <TimerInputs
          handleSetTimerValue={[Function]}
          minutes={25}
          timerInputs={
            Array [
              Object {
                "category": "work",
                "id": "Pomodoro",
                "time": 25,
              },
              Object {
                "category": "work",
                "id": "Task",
                "time": 10,
              },
              Object {
                "category": "work",
                "id": "Minute",
                "time": 1,
              },
              Object {
                "category": "break",
                "id": "Short",
                "time": 5,
              },
              Object {
                "category": "break",
                "id": "Long",
                "time": 10,
              },
              Object {
                "category": "break",
                "id": "Nap",
                "time": 25,
              },
            ]
          }
        />,
      ],
      "className": "timer-components",
    },
    "ref": null,
    "rendered": Array [
      Object {
        "instance": null,
        "key": undefined,
        "nodeType": "function",
        "props": Object {
          "minutes": 25,
          "seconds": 0,
        },
        "ref": null,
        "rendered": null,
        "type": [Function],
      },
      Object {
        "instance": null,
        "key": undefined,
        "nodeType": "class",
        "props": Object {},
        "ref": null,
        "rendered": null,
        "type": [Function],
      },
      Object {
        "instance": null,
        "key": undefined,
        "nodeType": "class",
        "props": Object {
          "handleSetTimerValue": [Function],
          "minutes": 25,
          "timerInputs": Array [
            Object {
              "category": "work",
              "id": "Pomodoro",
              "time": 25,
            },
            Object {
              "category": "work",
              "id": "Task",
              "time": 10,
            },
            Object {
              "category": "work",
              "id": "Minute",
              "time": 1,
            },
            Object {
              "category": "break",
              "id": "Short",
              "time": 5,
            },
            Object {
              "category": "break",
              "id": "Long",
              "time": 10,
            },
            Object {
              "category": "break",
              "id": "Nap",
              "time": 25,
            },
          ],
        },
        "ref": null,
        "rendered": null,
        "type": [Function],
      },
    ],
    "type": "div",
  },
  Symbol(enzyme.__nodes__): Array [
    Object {
      "instance": null,
      "key": undefined,
      "nodeType": "host",
      "props": Object {
        "children": Array [
          <TimerTime
            minutes={25}
            seconds={0}
          />,
          <TimerControls />,
          <TimerInputs
            handleSetTimerValue={[Function]}
            minutes={25}
            timerInputs={
              Array [
                Object {
                  "category": "work",
                  "id": "Pomodoro",
                  "time": 25,
                },
                Object {
                  "category": "work",
                  "id": "Task",
                  "time": 10,
                },
                Object {
                  "category": "work",
                  "id": "Minute",
                  "time": 1,
                },
                Object {
                  "category": "break",
                  "id": "Short",
                  "time": 5,
                },
                Object {
                  "category": "break",
                  "id": "Long",
                  "time": 10,
                },
                Object {
                  "category": "break",
                  "id": "Nap",
                  "time": 25,
                },
              ]
            }
          />,
        ],
        "className": "timer-components",
      },
      "ref": null,
      "rendered": Array [
        Object {
          "instance": null,
          "key": undefined,
          "nodeType": "function",
          "props": Object {
            "minutes": 25,
            "seconds": 0,
          },
          "ref": null,
          "rendered": null,
          "type": [Function],
        },
        Object {
          "instance": null,
          "key": undefined,
          "nodeType": "class",
          "props": Object {},
          "ref": null,
          "rendered": null,
          "type": [Function],
        },
        Object {
          "instance": null,
          "key": undefined,
          "nodeType": "class",
          "props": Object {
            "handleSetTimerValue": [Function],
            "minutes": 25,
            "timerInputs": Array [
              Object {
                "category": "work",
                "id": "Pomodoro",
                "time": 25,
              },
              Object {
                "category": "work",
                "id": "Task",
                "time": 10,
              },
              Object {
                "category": "work",
                "id": "Minute",
                "time": 1,
              },
              Object {
                "category": "break",
                "id": "Short",
                "time": 5,
              },
              Object {
                "category": "break",
                "id": "Long",
                "time": 10,
              },
              Object {
                "category": "break",
                "id": "Nap",
                "time": 25,
              },
            ],
          },
          "ref": null,
          "rendered": null,
          "type": [Function],
        },
      ],
      "type": "div",
    },
  ],
  Symbol(enzyme.__options__): Object {
    "adapter": ReactSixteenAdapter {
      "options": Object {
        "enableComponentDidUpdateOnSetState": true,
        "legacyContextMode": "parent",
        "lifecycles": Object {
          "componentDidUpdate": Object {
            "onSetState": true,
          },
          "getChildContext": Object {
            "calledByRenderer": false,
          },
          "getDerivedStateFromError": true,
          "getDerivedStateFromProps": Object {
            "hasShouldComponentUpdateBug": false,
          },
          "getSnapshotBeforeUpdate": true,
          "setState": Object {
            "skipsComponentDidUpdateOnNullish": true,
          },
        },
      },
    },
  },
  Symbol(enzyme.__childContext__): null,
}
`;
