
BLOCKED FILE ALERT

A file has been blocked due to the 'Blocked for exchange' rule.
Context: 'data_diperiodic.bin'
Disallowed due to 
Ticket Number: '0a38-5afd-e0d8-0001'

----------------------------------------

BLOCKED FILE ALERT

A file has been blocked due to the 'Blocked for exchange' rule.
Context: 'data_images.bin'
Disallowed due to 
Ticket Number: '0a38-5afd-e0d8-0001'

----------------------------------------

BLOCKED FILE ALERT

A file has been blocked due to the 'Blocked for exchange' rule.
Context: 'data_irreps.bin'
Disallowed due to 
Ticket Number: '0a38-5afd-e0d8-0001'

----------------------------------------

BLOCKED FILE ALERT

A file has been blocked due to the 'Blocked for exchange' rule.
Context: 'data_isotropy.bin'
Disallowed due to 
Ticket Number: '0a38-5afd-e0d8-0001'

----------------------------------------

BLOCKED FILE ALERT

A file has been blocked due to the 'Blocked for exchange' rule.
Context: 'data_little.bin'
Disallowed due to 
Ticket Number: '0a38-5afd-e0d8-0001'

----------------------------------------

BLOCKED FILE ALERT

A file has been blocked due to the 'Blocked for exchange' rule.
Context: 'data_magnetic.bin'
Disallowed due to 
Ticket Number: '0a38-5afd-e0d8-0001'

----------------------------------------

BLOCKED FILE ALERT

A file has been blocked due to the 'Blocked for exchange' rule.
Context: 'data_space.bin'
Disallowed due to 
Ticket Number: '0a38-5afd-e0d8-0001'

----------------------------------------

BLOCKED FILE ALERT

A file has been blocked due to the 'Blocked for exchange' rule.
Context: 'data_wyckoff.bin'
Disallowed due to 
Ticket Number: '0a38-5afd-e0d8-0001'
See your system administrator for further information. Copyright 1999-2013 McAfee, Inc.All Rights Reserved.http://www.mcafee.com