{
  "max_history": 3,
  "lookup": {
    "eJyLzivNydFRgJDVxTn5JfF++bnxyTmZqXkl8QZWCoZ6BrWxAA9YDWA=": 0,
    "eJyLzivNydFRqC7OyS+J98vPjU/OyUzNK4k3sFIw1DOoBcpk5pWABDyBVFFeakl8cn5eWmY6WFpHoaAotSw+MbkkMz8vPiezGKgSKoHDvFgA3RonPw==": 9,
    "eJyLri7OyS+J98vPjU/OyUzNK4k3sFIw1DOo1VGozswrAQl4AqmivNSS+OT8vLTMdLC0jkJBUWpZfGJySWZ+XnxOZjFQJVSCEvNKS4BS8YnF2fEFGfl5qfH+wfgNjQUAgZ5C/g==": 0,
    "eJyLrs7MK0nNK4n3BFJFeakl8cn5eWmZ6VYKhnoGOgoFRall8YnJJZn5efE5mcVAlVCJ4pz8kni//Nz45JxMkHYDsHitjgIR5pWWAKXiE4uz4wsy8vNS4/2DyTQ0PjEvpSg/M4VMx8YCANIZWT8=": 11,
    "eJyLrs7MK0nNK4n3BFJFeakl8cn5eWmZ6VYKhnoGOgoFRall8aUlQKn4xOLs+IKM/LzUeP9gqGxxTn5JvF9+bnxyTibIDAOweK2OAg5D4xPzUoryM1OQDU9MLsnMz4vPySwG6qCiuRBHg+WLctEU4DA/FgALCV/U": 0,
    "eJyLrs7MK0nNK4n3BFJFeakl8cn5eWmZ6fGJeSlF+ZkpVgqGegY6CgVFqWXxicklmfl58TmZxUAdUIninPySeL/83PjknEyQMQZg8VodBRLMLS0BKoHIF+WiKSBovh9Q3j+YTGfGAgATPFoI": 18,
    "eJyLrs7MK0nNK4n3BFJFeakl8cn5eWmZ6fGJeSlF+ZkpVgqGegY6CgVFqWXxpSVAJRD5olw0BcU5+SXxfvm58ck5mSDjDMDitToKMPP9gPL+wcjGJSaXZObnxedkFgMVkG8MxFV5yOI4TIkFAGU6UlU=": 0,
    "eJyLrs7MK0nNK4n3yy+J9w+2UjDUM9BRKChKLYtPTC7JzM+Lz8ksBiqAShTn5IOU5sYn52SCdBmAxWt1FHAbU1pSkloUn4csTtAUTyBVlJdaEp+cn5eWmR6flJOYnJ2UWlRUSaYDYwGLn1BA": 13,
    "eJyLrs7MK0nNK4n3yy+J9w+2UjDUM9BRKChKLYsvLSlJLYrPQxYvzskHqcyNT87JBGkyAIvX6ijATPEEUkV5qSXxyfl5aZnp8Uk5icnZSalFRZXIJicml2Tm58XnZBYDNVHXaIijwUqKcjHV4LAlFgAK0l1B": 0,
    "eJyLrs7MK0nNK4n3BFJFeakl8cn5eWmZ6fFJOYnJ2UmpRUWVVgqGegY6CgVFqWXxicklmfl58TmZxUBNUIninPySeL/83PjknEyQSQZg8VodBdKMLi0BqoIoKcrFVEPQlsjU4vjENJBmMh0cCwBRn1+b": 16,
    "eJyLrs7MK0nNK4n3BFJFeakl8cn5eWmZ6fFJOYnJ2UmpRUWVVgqGegY6CgVFqWXxpSVAVRAlRbmYaopz8kvi/fJz45NzMkGGGoDFa3UUYLZEphbHJ6aBNCObmphckpmfF5+TWQxURJlREAcWp5aUZOalFxPtwlgAoiBeGg==": 0,
    "eJydjkEKwkAQBL+yDwiSXD36AO8iYdgMkzBksyvTEyWIfzcGzyK5dncVfX1qdslOFwHFvlebjqE51FW4mdwpsmvJlBTr6FsgFadzmYiTfsh6y19V+K2a3cUI4q55AHUp8tiJ2fKv9mTlgZUlzMwC7PzZvgEnJ1WK": 17,
    "eJytzkEKwkAMBdCrzAGK1K1LD+BeRMI0ZEpwmkiSKkW8u1UruHLl9ufn8Q83liAJ2JNDLoVt2KT1qm3S2egCYwQZOEWw9A5dzXjqyGxaSl41YKcDYOWn0r7ye5M+7Nb06vMv+IhI7t94xmAVqOxz9R/gsvZ9AFQp3P92jw9XJFsd": 0,
    "eJyLrs7MK0nNK4l3KsovL87MS48vLk1OTi0utlIw1DPQUSgoSi2LT0wuyczPi8/JLAYqhUoU5+SXxPvl58Yn52SC9BuAxWt1FIgxsLSkJLUIJhGfnJ+XlplOrLnu+fkpSZWpZLovFgDf6VTJ": 4,
    "eJyLrs7MK0nNK4l3KsovL87MS48vLk1OTi0utlIw1DPQUSgoSi2LLy0pSS2CScQn5+elZaZD5Ytz8kvi/fJz45NzMkHGGIDFa3UUYOa65+enJFWmIhuXmFySmZ8Xn5NZDFRBgTkQZ6WjSOAwJxYAtWRQ/w==": 1,
    "eJyLzivNydFRqC7OyS+J98vPjU/OyUzNK4k3sFIw1DOoBcpk5pWABIITc0pLEksy8/OKwVI6CgVFqWXxickgoficzGKgKqgEDrNiATcEJbg=": 5,
    "eJyLri7OyS+J98vPjU/OyUzNK4k3sFIw1DOo1VGozswrAQkEJ+aUliSWZObnFYOldBQKilLL4hOTQULxOZnFQFVQCXLNKi0pSS2KTyzOjs9LzE3Fb1gsAE2RPnY=": 0,
    "eJyLrs7MK0nNK4kPTswpLUksyczPK7ZSMNQz0FEoKEoti09MBgnF52QWA1VBJYpz8kvi/fJz45NzMkFaDcDitToKBMwqLSlJLYpPLM6Oz0vMTSVoGJCXWVKJJAfVAbXED2EGqS6NBQDHxFUT": 3,
    "eJyLrs7MK0nNK4kPTswpLUksyczPK7ZSMNQz0FEoKEotiy8tKUktik8szo7PS8xNhcoU5+SXxPvl58Yn52SC9BqAxWt1FKqBvMySSiQ5qA6oJX4IM8CmJyaDLIzPySwGSlPbcIjTi0H+wm90LACOTFmG": 0,
    "eJyLrk7NK8ksqYz3y8+NT87JBPKsFAz1DHQUMvNKgJx4v8TcVKhIQVFqWXxicklmfl58TmYxUBoqUZyTX4JkQLwBWLxWR4FUw0tLSlKL4osTc0pLCBoNNcITSBXlpZbEJ+fnpWWmk+nUWAAma1qn": 9,
    "eJyLrk7NK8ksqYz3y8+NT87JBPKsFAz1DHQUMvNKgJx4v8TcVKhIQVFqWXxpSUlqUXxxYk4pTGFxTn4JkvZ4A7B4rY5CNdQITyBVlJdaEp+cn5eWmY5sWmJySWZ+XnxOZjFQJRXMg7gusTg7viAjPy813j8Yv6GxAOBhWOs=": 0,
    "eJyLrs7MK0nNK4n3BFJFeakl8cn5eWmZ6VYKhnoGOgoFRall8YnJJZn5efE5mcVAlVCJ4pz8kni//Nz45JxMkHYDsHitjgIR5pWWAKXiE4uz4wsy8vNS4/2DyTQ0vjwzLyW/vJhMx8YCANvqWWk=": 12,
    "eJyLrs7MK0nNK4n3BFJFeakl8cn5eWmZ6VYKhnoGOgoFRall8aUlQKn4xOLs+IKM/LzUeP9gqGxxTn5JvF9+bnxyTibIDAOweK2OAg5D48sz81Lyy4uRDU9MLsnMz4vPySwG6qCiuRBHg+WLctEU4DA/FgA1cmBS": 0,
    "eJyLrs7MK0nNK4n3BFJFeakl8cn5eWmZ6fHlmXkp+eXFVgqGegY6CgVFqWXxicklmfl58TmZxUAdUIninPySeL/83PjknEyQMQZg8VodBRLMLS0BKoHIF+WiKSBofmRqcXxiGkgnmU6NBQDsLVxZ": 15,
    "eJyLrs7MK0nNK4n3BFJFeakl8cn5eWmZ6fHlmXkp+eXFVgqGegY6CgVFqWXxpSVAJRD5olw0BcU5+SXxfvm58ck5mSDjDMDitToKMPMjU4vjE9NAOpGNTEwuyczPi8/JLAYqoswoiOuKU0tKMvPSi4lzXiwAS31a2A==": 0,
    "eJydjkEKg0AQBL+yDxAx1zzCexAZZB3DwDoTdjp6EP+uhpxFvHZ1F90somAFvdipGwbJ4zM8yqoIn8wTdRFiSkl8L/2BJwPVNlJMciyrX74W4Vz1BTiTMyD6dppFe5v9qrPeeTRVjuD+5sN2Aw83UxQ=": 20,
    "eJylzkEKg1AMBNCr/ANIsdsewr0UCfKNEvgm8jPVhfTutbZCF+2q25nhMddVFKygmp3avpc8XsL5VBZhyjzTDeBMzoDo4LSIdrb4e+HJQJWNFJM8iXLP70U4zGrro6lyBHefbBshppTEt93f2uukfql/mM0Dhw9W3A==": 0,
    "eJyLrs7MK0nNK4n3yy+JT87Py0tNLklNsVIw1DPQUSgoSi2LT0wuyczPi8/JLAaqg0oU5+SDdOTGJ+dkgjQbgMVrdRQImlZaUpJaFJ+HRZqgme75+SlJlalkui0WABQrUZ4=": 4,
    "eJyLrs7MK0nNK4n3yy+JT87Py0tNLklNsVIw1DPQUSgoSi2LLy0pSS2Kz8MiXZyTD9KXG5+ckwkywgAsXqujADPTPT8/JakyFdm0xOSSzPy8+JzMYqAKCsyBuCodRQKHObEAHEhPNA==": 1,
    "eJyLrs7MK0nNK4mPTC2OT0xLyyzKtVIw1DPQUSgoSi2LT0wuyczPi8/JLAYqgkoU5+SXxPvl58Yn52SCdBqAxWt1FPAbVVpSkloUX5xaUpKZl14cX56Zl5JfXkysmU5FQMVAjfHFpcnJqcXFZDoyFgAhmVR0": 17,
    "eJytzkEKwkAMheGrzAGK1K1LD+BeRB4lZkpgmpFJahfSuzvaFly5cpv8+cjlKeqsjjMbuhilDIew37VNuBd+YHTnAmN30d4wid7yZGthKTtOeQAleRPtZz43YTOPpcb1EDYSsdm33JFLViSxmv4DXF9dFqCsUfrf7vUFP21aBw==": 0,
    "eJyLrs7MK0nNK4n3BFJFeakl8cn5eWmZ6VYKhnoGOgoFRall8YnJJZn5efE5mcVAlVCJ4pz8kni//Nz45JxMkHYDsHitjgIR5pWWAKXiE4uz4wsy8vNS4/2DyTQ0PiknMTk7KbWoqJJM98YCAO6RWn8=": 13,
    "eJyLrs7MK0nNK4n3BFJFeakl8cn5eWmZ6VYKhnoGOgoFRall8aUlQKn4xOLs+IKM/LzUeP9gqGxxTn5JvF9+bnxyTibIDAOweK2OAg5D45NyEpOzk1KLiiqRzU9MLsnMz4vPySwGaqKu0RCng5UU5WKqwWFLLACydWOU": 0,
    "eJydjkEKgCAQRa/iASRq2yHqABGDyBADOoaOQUR3T8JFu6jl+w8efzqQhWSHIXiwjgr1qmtarYilAAzGY13WiBsYKxQYHKWiq0guyCMA7b2fWn2NZxGMkIzL8pquiTEaXhB8YNx//pwvCX5ZbA==": 6,
    "eJyljk0KwjAQha+SAxRptz1EPYCUx7QMOphMSjIRSvHuBq3QlRuX7+/jXTZWE1sxxIDZS1W9605t40StCgwUeHeWxA8UM07I5Mu3mH20wxzt2382btsR50R6ZYSovB5RNJtEhZdca//CPr8o37HcagYtYeL0mzq+ABh5WFw=": 0,
    "eJyLrs7MK0nNK4n3L0rMS0+Nz83PS620UjDUM9BRKChKLYtPTC7JzM+Lz8ksBiqDShTn5JfE++XnxifnZIL0GoDFa3UUCBlWWlKSWhSfWJwdX5ABlIvPK81NSi0iaCqQl1lSCdOTD1UPtSsAVZRER0PFYUbDLI0FAFOfYUo=": 8,
    "eJyLrs7MK0nNK4n3L0rMS0+Nz83PS620UjDUM9BRKChKLYsvLSlJLYpPLM6OL8gAysXnleYmpRZBVRTn5JfE++XnxifnZIIMMQCL1+ooVAN5mSWVMD35UPVQuwJQRcH2JCaXZObnxedkFgOV4DUeKg4zmhJLIZ7LzyXHvlgARelsYg==": 4,
    "eJyLrk7NK8ksqYwvyMjPS43Py7dSMNQz0FHIzCsBSsQHoIoWFKWWxScml2Tm58XnZBYDlUAlinPyS+L98nPjk3MyQfoMkMVhRkNFa3UUSLe0tKQktSg+P5e+9qXn56ckVaaSY2ksAI/SdcA=": 0,
    "eJyLrk7NK8ksqYwvyMjPS43Py7dSMNQz0FHIzCsBSsQHoIoWFKWWxZeWlKQWxefnQsWKc/JL4v3yc+OTczJBWgyQxWGmQkVrdRTItS89Pz8lqTKVTEuhxrujGAI2PTG5JDM/Lz4nsxioghzTYwEheW3M": 4,
    "eJyLrk7NK8ksqYwvyMjPS43Py7dSMNQz0FHIzCsBSsQHoIoWFKWWxZeWlKQWxafn56ckVaZCJYpz8kvi/fJz45NzMkH6DJDFYUZDRWt1FKqhxrujGAI2PTG5JDM/Lz4nsxioguqmU+z2WADOqWfl": 1,
    "eJyLrs7MK0nNK4n3BFJFeakl8cn5eWmZ6fGJeSlF+ZkpVgqGegY6CgVFqWXxicklmfl58TmZxUAdUIninPySeL/83PjknEyQMQZg8VodBRLMLS0BKoHIF+WiKSBofmRqcXxiGkgnmU6NBQCc2lvb": 14,
    "eJyLrs7MK0nNK4n3BFJFeakl8cn5eWmZ6fGJeSlF+ZkpVgqGegY6CgVFqWXxpSVAJRD5olw0BcU5+SXxfvm58ck5mSDjDMDitToKMPMjU4vjE9NAOpGNTEwuyczPi8/JLAYqoswoiOuKU0tKMvPSi4lzXiwAAMJaWg==": 0,
    "eJydjkEKhDAQBL+SB4i4132EdxEZJBllIM4sSa8X8e/GZc8iXru6i+43UbCCOs40TpOk5e1edVO5T+KVRg8xpSi5lP4gRwO1tpCPci6bX75X7lr1BThRZkB0LgUNySTcdbaFe1NlDw4PHw4H/KVS6g==": 20,
    "eJylzkEKg0AMheGrzAGk6NZDuC8iQWZiCYyJzDy7Kb17p9aCC7vqNu/nI/1DFKygK2cap0nS3LrmUlduSXynFeBEmQHRWwk0JJOwFzkaqLOZfJQ3UW/3Z+W+Zld2b6rsweHIjh5iSlFy6f7WPk/qyfzDHF5mxFay": 0,
    "eJyLzivNydFRqC7OyS+J98vPjU/OyUzNK4k3sFIw1DOoBcpk5pWABDyBVFFeakl8cn5eWmZ6fGJeSlF+ZgpYmY5CQVFqWXxicklmfl58TmYxUAdUAoe5sQBIOip/": 11,
    "eJyLri7OyS+J98vPjU/OyUzNK4k3sFIw1DOo1VGozswrAQl4AqmivNSS+OT8vLTM9PjEvJSi/MwUsDIdhYKi1LL4xOSSzPy8+JzMYqAOqAQ1zC0tASqByBfloinAYX4sAEVlSvM=": 0,
    "eJydjkEKg0AMRa8yB5Ci2y57gO5FJMgYS2BMJIl1Id7dUVyX4vb//x6/WYkd2aFGg24YSMdnqB5lESbFL3TRSRgSWR5dhSVxeMsIMdFBlme+FeG3anZHBUN34k8ecK9C/b/Ol8piGQSbY0SzmyfbHQ6YVEo=": 17,
    "eJytzjEKwlAMgOGrvAMUqaujB3AXkVDSvBJ4TSRJdZDe3adtwcnJNfnzkcuTJUgCzuTQ5cw2HtJ+1zbpZnSHKYIMnCJYhhpIb8r9WnjRgJOOgIXfRPuZz03azKPpw+sh+IRI7t9yh8EqUNhr+g9wfXVZAKpkHn671xcd/Fnd": 0,
    "eJyLrs7MK0nNK4n3BFJFeakl8cn5eWmZ6fHlmXkp+eXFVgqGegY6CgVFqWXxicklmfl58TmZxUAdUIninPySeL/83PjknEyQMQZg8VodBRLMLS0BKoHIF+WiKSBovh9Q3j+YTGfGAgBgl1qG": 18,
    "eJyLrs7MK0nNK4n3BFJFeakl8cn5eWmZ6fHlmXkp+eXFVgqGegY6CgVFqWXxpSVAJRD5olw0BcU5+SXxfvm58ck5mSDjDMDitToKMPP9gPL+wcjGJSaXZObnxedkFgMVkG8MxFV5yOI4TIkFAKRWUqk=": 0,
    "eJyLrk7NK8ksqYz3y8+NT87JBPKsFAz1DHQUMvNKgJx4v8TcVKhIQVFqWXxicklmfl58TmYxUBoqUZyTX4JkQLwBWLxWR4FUw0tLSlKL4osTc0pLCBoNNSIYpDgR5KZiMp0ZCwCyl1kg": 5,
    "eJyLrk7NK8ksqYz3y8+NT87JBPKsFAz1DHQUMvNKgJx4v8TcVKhIQVFqWXxpSUlqUXxxYk4pTGFxTn4JkvZ4A7B4rY5CNdSIYJDixJLM/LxiZJMSk0FC8TmZxUBVFJoFcVVicXZ8HsK9OAyLBQClKVRj": 0,
    "eJyLrs7MK0nNK4n3yy+J9w+2UjDUM9BRKChKLYtPTC7JzM+Lz8ksBiqAShTn5IOU5sYn52SCdBmAxWt1FHAbU1pSkloUn4csTtAUTyBVlJdaEp+cn5eWmR5fnpmXkl9eTKbrYgGXtU8q": 12,
    "eJyLrs7MK0nNK4n3yy+J9w+2UjDUM9BRKChKLYsvLSlJLYrPQxYvzskHqcyNT87JBGkyAIvX6ijATPEEUkV5qSXxyfl5aZnp8eWZeSn55cXIxiYml2Tm58XnZBYDdVDRXIhzwfJFuWgKcJgfCwDGq1n/": 0,
    "eJyLzivNydFRqC7OyS+J98vPjU/OyUzNK4k3sFIw1DOoBcpk5pWABDyBVFFeakl8cn5eWmZ6fHlmXkp+eTFYmY5CQVFqWXxicklmfl58TmYxUAdUAoe5sQBSCyqp": 12,
    "eJyLri7OyS+J98vPjU/OyUzNK4k3sFIw1DOo1VGozswrAQl4AqmivNSS+OT8vLTM9PjyzLyU/PJisDIdhYKi1LL4xOSSzPy8+JzMYqAOqAQ1zC0tASqByBfloinAYX4sAG/OS3E=": 0,
    "eJyLrs7MK0nNK4l3z89PSapMtVIw1DPQUSgoSi2LT0wuyczPi8/JLAaqgEoU5+SXxPvl58Yn52SCtBmAxWt1FPCYU1pSkloUn44iQY45UPcUpRaXJBaV4DcoFgAeZkqm": 0,
    "eJyLrs7MK0nNK4l3z89PSapMtVIw1DPQUSgoSi2LLy0pSS2KT0eRKM7JL4n3y8+NT87JBGkzAIvX6ijgMScxuSQzPy++KLW4JLGohFiDghNzSksSQTqLsRiWk1kMVIXfrFgAdmZMdA==": 5,
    "eJyLrs7MK0nNK4l3z89PSapMtVIw1DPQUSgoSi2LT0wuyczPiy9KLS5JLCqByhTn5JfE++XnxifnZIL0GYDFa3UUYAYFJ+aUliSCdBZjMSwnsxioikKzSktKUoviE4uz4/MSc1PxGxYLADZdTpg=": 0,
    "eJyLzivNydFRqC7OyS+J98vPjU/OyUzNK4k3sFIw1DOoBcpk5pWABNzz81OSKlPBwjoKBUWpZfGJySWZ+XnxOZnFQBVQCRzmxAIAhxMj6g==": 4,
    "eJyLri7OyS+J98vPjU/OyUzNK4k3sFIw1DOo1VGozswrAQm45+enJFWmgoV1FAqKUsviE5NLMvPz4nMyi4EqoBLkmFNaUpJaFJ+OIoHDnFgA03o6hA==": 1,
    "eJyLrk7NK8ksqYz3y8+NT87JBPKsFAz1DHQUMvNKgJx4v8TcVKhIQVFqWXxicklmfl58TmYxUBoqUZyTX4JkQLwBWLxWR4FUw0tLSlKL4osTc0pLCBoNNcI9Pz8lqZJcJ8YCADUGV1I=": 4,
    "eJyLrk7NK8ksqYz3y8+NT87JBPKsFAz1DHQUMvNKgJx4v8TcVKhIQVFqWXxpSUlqUXxxYk4pTGFxTn4JkvZ4A7B4rY5CNdQI9/z8lKRKFFMSk0sy8/PiczKLgSooMAfimnQUCRzmxAIAZb1QcQ==": 1,
    "eJyLrs7MK0nNK4l3z89PSapMtVIw1DPQUSgoSi2LLy0pSS2KT0eRKM7JL4n3y8+NT87JBGkzAIvX6ijgMScxuSQzPy++KLW4JLGohFiDPIFUUV5qSXxyfl5aZnp8Uk5icnZSalFRJRazczKLgZrwGx0LAFz2Uns=": 13,
    "eJyLrs7MK0nNK4l3z89PSapMtVIw1DPQUSgoSi2LT0wuyczPiy9KLS5JLCqByhTn5JfE++XnxifnZIL0GYDFa3UUYAZ5AqmivNSS+OT8vLTM9PiknMTk7KTUoqJKLGbnZBYDNVHX6NISoCqIkqJcTDU4bIkFAJ8iXtU=": 0,
    "eJydjkEKwlAMRK/yD1Ck3fYQ3YtI+I2pBH/zSzIKIt7dWlyLuJ0385jDQw1ioL0E5WlSn/vU7domLS43ygytRkVjLX1AlAoa6kxc9L1st/zZpO+qKyBOIYDaOWgsmS+juN9/1Q4r52omDDn9efL4AhGDVCo=": 20,
    "eJylzs0KwkAMBOBX2QcoUq8+RO8iErYxleA2K8koSPHdrX/gQU9eZ4aP2UxqEAOtJSgPg/q4SstF26Sjy5lOgDiFAGr7oL5kPvTifnmNolRQV0fionelfeTXJr3Zbu65mglDdp9yZmg1Khrz7m/t+dO+1D/M7Q2XLFfy": 0,
    "eJyLrs7MK0nNK4n3BFJFeakl8cn5eWmZ6VYKhnoGOgoFRall8YnJJZn5efE5mcVAlVCJ4pz8kni//Nz45JxMkHYDsHitjgIR5pWWAKXiE4uz4wsy8vNS4/2DCRoK5GWWVMYn5qUU5WemQJVjtwlNEYk+gIpDzUAVhLkW5q5YALybbhc=": 11,
    "eJyLrs7MK0nNK4n3BFJFeakl8cn5eWmZ6VYKhnoGOgoFRall8aUlQKn4xOLs+IKM/LzUeP9gqGxxTn5JvF9+bnxyTibIDAOweK2OQjWQl1lSGZ+Yl1KUn5kCVY7dJjRFYBsTk0sy8/PiczKLgTrwWgYVh5qBKghzLfXcBQkJsHxRLpoCyt0XCwCFzYmE": 0,
    "eJyLrk7NK8ksqYxPzEspys9MsVIw1DPQUcjMKwGKx3sCqaK81JL45Py8tMx0NEUFRall8YnJJZn5efE5mcVAHVCJ4pz8kni//Nz45JxMkDEGyOJQM1AFCzLy81Lj/YOhorU6CpS6q7QEqAQiX5SLpoAq7oM6JTK1OD4xDWQJ7UMlFgAPFpNR": 14,
    "eJy9j0EKwkAMRa8yByhSt97AjS5ciUgYpmkNTJMyiQUp3t0pnUXtWlwFXh75+bcJ2che4LlJQs3B7Xd15YgtczjmkRgNgnBL3UYaEo7wtKws+9RvBI1icJIeQqT5XL3mRf2Gw0MY4Xwp9F25qbxyRQXfziHrdB+MhCGSZulvqUtnRTPiTn9e+v4B2nSKvg==": 0,
    "eJyLrs7MK0nNK4mPTC2OT0xLyyzKtVIw1DPQUSgoSi2LT0wuyczPi8/JLAYqgkoU5+SXxPvl58Yn52SCdBogiyfmpRTlZ6agChZk5OelxvsHQ0VrdRTw21paUpJaFF+cWlKSmZdeDDOTBtY7FeWXFwPtiC8uTU5OLS6mvddjAc4PfZw=": 17,
    "eJy9kEEKwkAMRa8yByhSty49gC5ciUgoaaYGpkmZpLoQ7+6II9S9uP15/PfJ6c7iJA5HMuhi5DxuwnrVNmHKdIXZnTIYubMMBZA+K/eVsKQOOx0BE78q2mVe0e9wuqgQ7A81fTTho99mvVlxgM2IZLYc0aGzCiS2gv7ZXR/wPgCqRB5+NuH8BHqlgy8=": 0,
    "eJyLrs7MK0nNK4l3KsovL87MS48vLk1OTi0utlIw1DPQUSgoSi2LT0wuyczPi8/JLAYqhUoU5+SXxPvl58Yn52SC9BsgiyfmpRTlZ6agChZk5OelxvsHQ0VrdRSIsbu0pCS1CCYRn5yfl5aZTgMnuOfnpyRVptLe17EAH3x+Gw==": 4,
    "eJy9j7EKwkAMQH/lPqBIXR1d3HRwFAk1F8/AmZRLWhHx31VsoZ0F1/dCXnJ4sDiJw7rozVgSWIdIZquwXNRVaAv10LlTGQWgypnT4C2rw1avgJk/a+opbyQW5TiH7UWFYLcf6LMK4wkb1Xi607TcoLMKZLb3xH+S32fTTPyePL4ATxR6UQ==": 1,
    "eJyLrs7MK0nNK4l3z89PSapMtVIw1DPQUSgoSi2LT0wuyczPi8/JLAaqgEoU5+SXxPvl58Yn52SCtBkgiyfmpRTlZ6agChZk5OelxvsHQ0VrdRTwWFlaUpJaFJ+OIkFjK6G+LEotLkksKqGanbEAe5lz+A==": 0,
    "eJyLrs7MK0nNK4l3z89PSapMtVIw1DPQUSgoSi2LLy0pSS2KT0eRKM7JL4n3y8+NT87JBGkzQBZPzEspys9MQRUsyMjPS433D4aK1uoo4LEyMbkkMz8vvii1uCSxqIQGdnoCqaK81JL45Py8tMz0+PLMvJT88mIsbsjJLAbqoJoTYgGjTHq3": 12,
    "eJyLrs7MK0nNK4l3z89PSapMtVIw1DPQUSgoSi2LT0wuyczPiy9KLS5JLCqByhTn5JfE++XnxifnZIL0GSCLJ+alFOVnpqAKFmTk56XG+wdDRWt1FGB2egKporzUkvjk/Ly0zPT48sy8lPzyYixuyMksBuoYGCeUlgCVQOSLctEUUO6UWAAfTYTl": 0,
    "eJyLrs7MK0nNK4n3BFJFeakl8cn5eWmZ6fHlmXkp+eXFVgqGegY6CgVFqWXxicklmfl58TmZxUAdUIninPySeL/83PjknEyQMQbI4ol5KUX5mSmoggUZ+Xmp8f7BUNFaHQUSnFBaAlQCkS/KRVNATadEphbHJ6aBLKF9AMQCAL6Ehas=": 15,
    "eJy9j0EKwkAMRa8yByhSt97AjS5ciUgYZtIamCZlEu1CvLtT2kJ1La4CL4/8/MuT2JAN9mVkRoMg3FALA3GUQXduu6kr12d8wN2KMu1z9yVoEoODdBASjefqNfccs1D8hP1NGOF4mumrcssrZ1TwzRiyTvfBSBgSaZH+ljp1VjQjbvXnpa9vXRyEKg==": 0,
    "eJy1jzEOwjAMRa+SA1SorIwcAAYmhJAVJS5YSu3KdumAuHtTqQMsbF3f9/9Pvr2JHdnhigax60j7Q9jv2iYMii+IyUkYClk9WgMr4nCSHlKhpdl+88hZhfIvHJ7CCOfLSj9N+G8d3VHB0J34YTARZ5lsA/1R6251gI0podn2r99n7yx9xg==": 17,
    "eJy9kEEKwkAMRa/SAxSpW5ceQBeuRCQMM5kamCZlkrYL8e6OOELdi9uXz3+fXO7EhmxwRgUXI+Vh12w3XduMGWeYzDCDohlxr7AQB1m0JjSJwUEG8IleFd2aOw5ZKHzD8SaMcDxV+mibj36fS29xgE7eo+p6hPNGwpBIS/TP7vqA9wG8cKT+ZxOuT7FAg1k=": 0,
    "eJyLrs7MK0nNK4n3BFJFeakl8cn5eWmZ6fFJOYnJ2UmpRUWVVgqGegY6CgVFqWXxicklmfl58TmZxUBNUIninPySeL/83PjknEyQSQZg8VodBdKMLi0BqoIoKcrFVEPQFj+gvH8wmY6NBQC48l3I": 18,
    "eJyLrs7MK0nNK4n3BFJFeakl8cn5eWmZ6fFJOYnJ2UmpRUWVVgqGegY6CgVFqWXxpSVAVRAlRbmYaopz8kvi/fJz45NzMkGGGoDFa3UUYLb4AeX9g5FNTEwuyczPi8/JLAYqIN8YiMPykMVxmBILALdYVNU=": 0,
    "eJyLzivNydFRqC7OyS+J98vPjU/OyUzNK4k3sFIw1DOoBcpk5pWABIJSk3MScxNLMvPzwFI6CgVFqWXxickgkficzGKgKqgEDrNiAS1DJZA=": 6,
    "eJyLri7OyS+J98vPjU/OyUzNK4k3sFIw1DOo1VGozswrAQkEpSbnJOYmlmTm54GldBQKilLL4hOTQSLxOZnFQFVQCXLNKi0pSS2KTyzOji/IyM9Ljc8rzU1KLcJvaCwASepBhw==": 0,
    "eJyLrs7MK0nNK4kPSk3OScxNLMnMz7NSMNQz0FEoKEoti09MBonE52QWA1VBJYpz8kvi/fJz45NzMkFaDcDitToKBMwqLSlJLYpPLM6OL8jIz0uNzyvNTUotImgokJdZUgnTkw9VD7UqAFWURDdDxWFGwyyNBQBfu2Bi": 7,
    "eJyLrs7MK0nNK4kPSk3OScxNLMnMz7NSMNQz0FEoKEotiy8tKUktik8szo4vyMjPS43PK81NSi2CqijOyS+J98vPjU/OyQSZYQAWr9VRqAbyMksqYXryoeqhVgWgioLtSUwG2Ryfk1kMVILXeKg4zGhKLIV4rgjD5yRZHAsAwUBvoQ==": 4,
    "eJyLrk7NK8ksqYwvyMjPS43Py7dSMNQz0FHIzCsBSsQHoIoWFKWWxZeWlKQWxRelJuck5iaWZObnQSWLc/JL4v3yc+OTczJBeg2QxWHGQ0VrdRTItTg9Pz8lqTKVXpYmJoO8CPRucUliUQk5tsYCAO47eek=": 0,
    "eJydjUEKwjAQRa+SAxRpt97AjbiXMsRkrAPpTJmMQine3QgRKrixqw/v8/87L8hGNsN0E0Zg2btu1zaO2EoBp286KT7gboYKg0i8zFiLnMTgKCOERO9du+af60qfjftf6oORMChm82obrfX/UEIZDYLwlQbwHFUo/tAlymWxxda/AMwKdtQ=": 11,
    "eJy1jU0KwkAMha8yByhSt97ATXEvEoZptIFpUjJRkNK7O8UpWOnGhasH73s/5xHZyJ4wdMIILAe339WVI7YM4LR2B8UH+GAkDIrJvFohKYpBIz2ESHOx/vSX7eJOlRvL/jGLMhoE4SvdwHOrQu3GXaSUG39/u1uOvLn2X4GfXi8vQ/54ug==": 0,
    "eJyLrs7MK0nNK4n3BFJFeakl8cn5eWmZ6fGJeSlF+ZkpVgqGegY6CgVFqWXxicklmfl58TmZxUAdUIninPySeL/83PjknEyQMQbI4gUZ+Xmp8Xn5UNFaHQUSbCstASqByBfloikg09bI1OL4xDSQeVT1ViwAt2RxjA==": 14,
    "eJy1j0EKwkAMRa8yByhSt97AjXsR+QzTtAamSZlEN9K7O6UKxa24Cvw8/uNfnixO4jjWU4QcSaXnAVG6otwdwn7XNmEq9MDdK7L+y/gFWFbHSUekzEtdu82nmwpB9J3OTfhYz2SI/dK3FcXkrILMVqF/CNYlRu4sg/0y5foCuB5wCw==": 0,
    "eJytjz0KwkAQha+yBwgSW0sPYC8ij7CZxIHNTJiZaCHe3RVSWKXR9v19vMuTJUgCZ3J0w8A2HdJ+1zZpNrqjy8EqKOw1tBpeNHDSCbnwp9l+6/NNhSC6qq8mbQOWCDI4RbCMNSC9Kfe/kY6mD69z8CVncv/roesbLN5p+w==": 17,
    "eJy1j0EKwkAMRa8yByhSty49gHsRCSXN1MA0KZNUF8W7O9IpdC24/f/xH/+2sDiJw5UMuhg5j6dwPLRNmDI9YXanDEbuLEMBpM/KfSUsqcNFR8DE34l2n08PFQLRmr6bsJnOWV9W5sBmRDLb+zp0VoHEVtD/aeqttQBUiTz8Yrt/AJSgb44=": 0,
    "eJyLrs7MK0nNK4l3KsovL87MS48vLk1OTi0utlIw1DPQUSgoSi2LT0wuyczPi8/JLAYqhUoU5+SXxPvl58Yn52SC9Bsgixdk5OelxuflQ0VrdRSIsaa0pCS1CCYRn5yfl5aZTplt7vn5KUmVqVT1SywAPShqeg==": 4,
    "eJyLrs7MK0nNK4l3KsovL87MS48vLk1OTi0utlIw1DPQUSgoSi2LLy0pSS2CScQn5+elZaZD5Ytz8kvi/fJz45NzMkHGGCCLF2Tk56XG5+VDRWt1FGC2uefnpyRVpiJbkphckpmfF5+TWQxUQXXTIV5IR5EgyfRYADfaZrA=": 1,
    "eJyLrs7MK0nNK4l3z89PSapMtVIw1DPQUSgoSi2LLy0pSS2KT0eRKM7JL4n3y8+NT87JBGkzAIvX6ijgMScxuSQzPy++KLW4JLGohFiDPIFUUV5qSXxyfl5aZjoWA3Myi4Eq8ZsXCwC3e037": 9,
    "eJyLrs7MK0nNK4l3z89PSapMtVIw1DPQUSgoSi2LT0wuyczPiy9KLS5JLCqByhTn5JfE++XnxifnZIL0GYDFa3UUYAZ5AqmivNSS+OT8vLTMdCwG5mQWA1VSwbzSEqBUfGJxdnxBRn5earx/MH5DYwEsEVMg": 0,
    "eJyLrs7MK0nNK4l3z89PSapMtVIw1DPQUSgoSi2LLy0pSS2KT0eRKM7JL4n3y8+NT87JBGkzQBZPzEspys9MQRUsyMjPS433D4aK1uoo4LEyMbkkMz8vvii1uCSxqIQGdgYn5pSWJIIsKcZib05mMVAV1ayNBQCYLnXG": 5,
    "eJy9zUEKwkAMheGrzAGK1K0XcFcXXYqE2AkYnCYlSYUi3r0WKii4FLd/8viOd5YgCdir5vNEu7Td1FUajG6AXbAKGHmgxXrxogGN9tAVXnb1e0fJppw/43BRITi0a31U6WW2WMbABfEvbmF/fv2PHSPIAP0Kgj39zD3NVSp36g==": 0,
    "eJyLrs7MK0nNK4kPTswpLUksyczPK7ZSMNQz0FEoKEoti09MBgnF52QWA1VBJYpz8kvi/fJz45NzMkFaDZDFE/NSivIzU1AFCzLy81Lj/YOhorU6CgSsLS0pSS2KTyzOjs9LzE2lpr1AjZkllUjGQNVD3eOHsI6G/o8FAEiufmU=": 3,
    "eJzFkMEKwkAMRH9lP6BIvfoR9dCjSAhtwOA2KZtUkOK/220XrHfB60xm8pjLzOIkDi3GydFZxU7heKirMCZ6wOROCdDuIDhQcSyqQ6MDdJFztt7rKH1S7r/F8aZCcG6L+qrCvATZn7uacl94ms+7FQS7zAaRbbH/yLENYnmtn1Fc32Hwgtg=": 0,
    "eJyLrk7NK8ksqYz3y8+NT87JBPKsFAz1DHQUMvNKgJx4v8TcVKhIQVFqWXxicklmfl58TmYxUBoqUZyTX4JkQLwBsnhiXkpRfmYKqmBBRn5earx/MFS0VkeBVHeUlpSkFsUXJ+aUllDTFVDbPIFUUV5qSXxyfl5aZjrtAyAWAFn4g/k=": 9,
    "eJy9j0EKwkAMRa8yByhSt97ATV24FAlhGjU4TcpMKkjx7g44LeNeXIX/+J9HTjOJsT2h0wF84Jx2brtpG8diOUCHAxUyRnrAZEYREoZpKaagVs2hrTlKH5X7bzjeVAgOx0JfjZuLbZ9PFDLwKhe+1mL0xioQOOXmf9WfnzHd1/nP/Oc3AtCCPQ==": 0,
    "eJyLrs7MK0nNK4n3BFJFeakl8cn5eWmZ6VYKhnoGOgoFRall8YnJJZn5efE5mcVAlVCJ4pz8kni//Nz45JxMkHYDZPHEvJSi/MwUVMGCjPy81Hj/YKhorY4CEVaXlgCl4hOLs+HaaW8/TDvtgyAWAO9vgpE=": 11,
    "eJyLrs7MK0nNK4n3BFJFeakl8cn5eWmZ6VYKhnoGOgoFRall8aUlQKn4xOLs+IKM/LzUeP9gqGxxTn5JvF9+bnxyTibIDANk8cS8lKL8zBRUQZgBUNFaHQUc9sO0I7sjMbkkMz8vPiezGKhjYJwACQqwfFEumgLKnRILACWliSY=": 0,
    "eJyLrs7MK0nNK4n3BFJFeakl8cn5eWmZ6fGJeSlF+ZkpVgqGegY6CgVFqWXxicklmfl58TmZxUAdUIninPySeL/83PjknEyQMQbI4lAzUAULMvLzUuP9g6GitToKJDihtASoBCJflIumgJpO8QPK+gfT3vOxAPdyg1o=": 18,
    "eJyLrs7MK0nNK4n3BFJFeakl8cn5eWmZ6fGJeSlF+ZkpVgqGegY6CgVFqWXxpSVAJRD5olw0BcU5+SXxfvm58ck5mSDjDJDFoUpRBQsy8vNS4/2DoaK1Ogowp/gBZf2DkW1OTC7JzM+Lz8ksBiqgi40Qv+Yhi1NuYSwA5TN7pw==": 0,
    "eJyLrs7MK0nNK4n3yy+J9w+2UjDUM9BRKChKLYtPTC7JzM+Lz8ksBiqAShTn5IOU5sYn52SCdBkgiyfmpRTlZ6agChZk5OelAk2GitbqKOC2sbSkJLUoPg9ZnJoWegKporzUkvjk/Ly0zPT48sy8lPzyYtr7ORYA02Z4fA==": 12,
    "eJyLrs7MK0nNK4n3yy+J9w+2UjDUM9BRKChKLYsvLSlJLYrPQxYvzskHqcyNT87JBGkyQBZPzEspys9MQRUsyMjPSwUaABWt1VGAWegJpIryUkvik/Pz0jLT48sz81Lyy4uRXZCYXJKZnxefk1kM1DEwToAEAli+KBdNAeVOiQUAzX+DUQ==": 0,
    "eJyLrs7MK0nNK4n3BFJFeakl8cn5eWmZ6VYKhnoGOgoFRall8YnJJZn5efE5mcVAlVCJ4pz8kni//Nz45JxMkHYDZPHEvJSi/MwUVMGCjPy81Hj/YKhorY4CEVaXlgCl4hOLs+HaaW9/fFJOYnJ2UmpRUSXtQyEWAJRag9E=": 13,
    "eJyLrs7MK0nNK4n3BFJFeakl8cn5eWmZ6VYKhnoGOgoFRall8aUlQKn4xOLs+IKM/LzUeP9gqGxxTn5JvF9+bnxyTibIDANk8cS8lKL8zBRUQZgBUNFaHQUc9scn5SQmZyelFhVVIjslMbkkMz8vPiezGKhpwFwBCRCwkqJcTDWUOygWAHLJjOY=": 0,
    "eJyLrs7MK0nNK4n3BFJFeakl8cn5eWmZ6fFJOYnJ2UmpRUWVVgqGegY6CgVFqWXxicklmfl58TmZxUBNUIninPySeL/83PjknEyQSQbI4ol5KUX5mSmoggUZ+Xmp8f7BUNFaHQXSXFFaAlQFUVKUi6mGmg6KTC2OT0wD2UP7YIgFAL2HiO0=": 16,
    "eJy9j0EKwkAMRa8yByhSt97AjS5ciUiYTtManCYlEwUpvbtTqlBxravA45H//2kgNmSDbT7KaBCEG2qhij5cK1R9bNx6VRauV7zDzbI1K9p9OymKwU46CJGmp+WSe65VqP6E/UUYYX940bFw70JHTOCbKWdZwAcjYYiUsvS31Hl2QjPiNv1i9/kJTV+HbA==": 0,
    "eJy1j8EKwkAMRH9lP6BIvfoR9eBJRMJ2N22D26QkqSDiv1uhB7146/XNDDNzeRI7ssMZDWLXkY6HsN/VVZgU7xCTkzAUssW0ClbEoZERUqFPsv7mkbMK5V84DcIIx9NKX1X43zq7o4KhO3Fv0JaYbi2qPjZY0CxqEmZMjnn769c32Ah9fA==": 20,
    "eJy9j00KwkAMha8yByhStx6iLlyJSJhmUg1Ok5KJgoh3t2KFCu4Et997vJ/djcVJHLZUIHYdW78Ky0VdhcHoAmd3MijkznIo0OaIp5bMrpOpZHVotAfM/Eyp5zxKMuX0CYejCsF6M9F7Fd4LmlFFFSF0SvMREZ1VIHMZff8sfr2XL/Lv9fsHOjqBRA==": 0,
    "eJyLrs7MK0nNK4n3yy+JT87Py0tNLklNsVIw1DPQUSgoSi2LT0wuyczPi8/JLAaqg0oU5+SDdOTGJ+dkgjQbIIsn5qUU5WemoAoWZOTnpcb7B0NFa3UUCFpcWlKSWhSfh0Wamta75+enJFWm0t7HsQDQ53rw": 4,
    "eJyLrs7MK0nNK4n3yy+JT87Py0tNLklNsVIw1DPQUSgoSi2LLy0pSS2Kz8MiXZyTD9KXG5+ckwkywgBZPDEvpSg/MwVVsCAjPy813j8YKlqrowCz3j0/PyWpMhXZ4sTkksz8vPiczGKgCvpYCfFrOooE5VbGAgDOj3iG": 1,
    "eJyLrs7MK0nNK4l3z89PSapMtVIw1DPQUSgoSi2LLy0pSS2KT0eRKM7JL4n3y8+NT87JBGkzAIvX6ijgMScxuSQzPy++KLW4JLGohFiDglKTcxJzE0FasRiWk1kMVIXfrFgAbKVMTA==": 6,
    "eJyLrs7MK0nNK4l3z89PSapMtVIw1DPQUSgoSi2LT0wuyczPiy9KLS5JLCqByhTn5JfE++XnxifnZIL0GYDFa3UUYAYFpSbnJOYmgrRiMSwnsxioikKzSktKUoviE4uz4wsy8vNS4/NKc5NSi/AbGgsAs8ZRqQ==": 0,
    "eJydjUEKg0AMRa8yB5CiWw9RBJdFwtQGG5gmMvMtSOndqzCFCm7q9v3kvcuLFYKZxrspk1rtqlNZOFEsAzVbOkZ+0gRwpMHsdp05DykY6GwP6oOsf+Uv/6ozfRfu/6jvIaYUOcFHHKxmf+vDBL/60k4iSFqujhS6DxRVcg0=": 5,
    "eJy1jUEKwkAMRa8yByhStx5CCi5FQigBQ6dJmfwKUry7LYyg4Epw+37y3nkRg+JO09VNyPyQ9ru2SWpYB+o+6VTkRtxD3ahIgAvqEtlBRx+pz7o9tu/85a700aSl+k+cZ/Dmiy+JrLFe/aUwA1KIYyDjUX5JXJ57yGw9": 0,
    "eJytj8EKQFAQRX/lfYDE1kfYWErTpCmTZ0beUJJ/R71ip2R759x7mnpjMRKDCv1saKwSCpenWeLGiRbA9orAczipeAheDUodoPV8VbNnPnYqBKIx3RP3YpjNaAIMPQgO9FFxMmzroxH5qC7v5X++ag5MImrE": 3,
    "eJyLrs7MK0nNK4kPTswpLUksyczPK7ZSMNQz0FEoKEotiy8tKUktik8szo7PS8xNhcoU5+SXxPvl58Yn52SC9Bogixdk5OelxuflQ0VrdRSqgWoySyqRdEDVQ632Q5gMtjMxGeSM+JzMYqA0fayEeLMYFAbkWBgLAEUlbzc=": 0,
    "eJyLrk7NK8ksqYz3y8+NT87JBPKsFAz1DHQUMvNKgJx4v8TcVKhIQVFqWXxicklmfl58TmYxUBoqUZyTX4JkQLwBsnhBRn5eanxePlS0VkeBVCtLS0pSi+KLE3NKS8i0EGqwJ5AqykstiU/Oz0vLTKeqt2IBCe5wWA==": 9,
    "eJyLrk7NK8ksqYz3y8+NT87JBPKsFAz1DHQUMvNKgJx4v8TcVKhIQVFqWXxpSUlqUXxxYk4pTGFxTn4JkvZ4A2Txgoz8vNT4vHyoaK2OQjXUYE8gVZSXWhKfnJ+XlpmObEdicklmfl58TmYxUCXNbIH4JLE4G6rdP5gcq2IBN/lunA==": 0,
    "eJyLrs7MK0nNK4n3BFJFeakl8cn5eWmZ6VYKhnoGOgoFRall8YnJJZn5efE5mcVAlVCJ4pz8kni//Nz45JxMkHYDZPGCjPy81Pi8fKhorY4CEbaUlgCl4hOLs6Ha/YOpalV8eWZeSn55MVU9FgsANo9vGg==": 12,
    "eJyLrs7MK0nNK4n3BFJFeakl8cn5eWmZ6VYKhnoGOgoFRall8aUlQKn4xOLs+IKM/LzUeP9gqGxxTn5JvF9+bnxyTibIDANkcYjavHyoaK2OAg6r4ssz81Lyy4uRrUxMLsnMz4vPySwG6qC5bRAPguWLctEUkGRrLAAl6XYD": 0,
    "eJyLrs7MK0nNK4n3BFJFeakl8cn5eWmZ6fHlmXkp+eXFVgqGegY6CgVFqWXxicklmfl58TmZxUAdUIninPySeL/83PjknEyQMQbI4gUZ+Xmp8Xn5UNFaHQUSbCstASqByBfloikg01Y/oKx/MFW9FAsAMmtwNw==": 18,
    "eJyLrs7MK0nNK4n3BFJFeakl8cn5eWmZ6fHlmXkp+eXFVgqGegY6CgVFqWXxpSVAJRD5olw0BcU5+SXxfvm58ck5mSDjDJDFCzLy81Lj8/KhorU6CjBb/YCy/sHIliQml2Tm58XnZBYDFVDbcIgP8pDFSTI7FgCxW2ha": 0,
    "eJyLrs7MK0nNK4n3yy+J9w+2UjDUM9BRKChKLYtPTC7JzM+Lz8ksBiqAShTn5IOU5sYn52SCdBkgixdk5OelxuflQ0VrdRRwG15aUpJaBFSLJE6m2Z5AqigvtSQ+OT8vLTM9PjEvpSg/M4WqPokFAF8vZLE=": 11,
    "eJyLrs7MK0nNK4n3yy+J9w+2UjDUM9BRKChKLYsvLSlJLYrPQxYvzskHqcyNT87JBGkyQBYvyMjPSwWqh4rW6ijAzPYEUkV5qSXxyfl5aZnp8Yl5KUX5mSnIliUml2Tm58XnZBYDddDcNojXwPJFuWgKSLI1FgDcxW8y": 0,
    "eJyLrs7MK0nNK4l3z89PSapMtVIw1DPQUSgoSi2LLy0pSS2KT0eRKM7JL4n3y8+NT87JBGkzAIvX6ijgMScxuSQzPy++KLW4JLGohFiDPIFUUV5qSXxyfl5aZnp8Yl5KUX5mChaDczKLgTrwmxsLAFiKUTs=": 11,
    "eJyLrs7MK0nNK4l3z89PSapMtVIw1DPQUSgoSi2LT0wuyczPiy9KLS5JLCqByhTn5JfE++XnxifnZIL0GYDFa3UUYAZ5AqmivNSS+OT8vLTM9PjEvJSi/MwULAbnZBYDdVDR3NISoBKIfFEumgIc5scCACJtWxU=": 0,
    "eJyLrs7MK0nNK4n3yy+J9w+2UjDUM9BRKChKLYtPTC7JzM+Lz8ksBiqAShTn5IOU5sYn52SCdBmAxWt1FHAbU1pSkloUn4csTtAUTyBVlJdaEp+cn5eWmR6fmJdSlJ+ZQqbrYgGN5E8A": 11,
    "eJyLrs7MK0nNK4n3yy+J9w+2UjDUM9BRKChKLYsvLSlJLYrPQxYvzskHqcyNT87JBGkyAIvX6ijATPEEUkV5qSXxyfl5aZnp8Yl5KUX5mSnIxiYml2Tm58XnZBYDdVDRXIhzwfJFuWgKcJgfCwCcQlmB": 0,
    "eJyLrk7NK8ksqYwvyMjPS43Py7dSMNQz0FHIzCsBSsQHoIoWFKWWxZeWlKQWxafn56ckVaZCJYpz8kvi/fJz45NzMkH6DJDFYUZDRWt1FEi3NDG5JDM/L74otbgksaiETFuh5rujOB3Z+JzMYqAKckyPBQAoOXA/": 4,
    "eJyLrk7NK8ksqYwvyMjPS43Py7dSMNQz0FHIzCsBSsQHoIoWFKWWxScml2Tm58UXpRaXJBaVQGWKc/JL4v3yc+OTczJBGg2QxWFmQ0VrdRSqoea75+enJFWmYjE+J7MYqILqppeWlKQWxaejSJBkeiwARSJoSw==": 1,
    "eJydjUEKwkAMRa8yByhSt97ATXEvEuoYa2BMSuYrFPHuTmEEBTd2FXj/57/9gxWCicaLKZPaJqxXbRNEUQLafdPR+U43gJ0Gs9Nx4hrkZKDOrhSTzH/tJ39PV/pswv/SPkJMyTmjdyy01v1tOa4MiqZnGX5okuTSXGI5vADwfHOU": 9,
    "eJyLrk7NK8ksqYwvyMjPS43Py7dSMNQz0FHIzCsBSsQHoIoWFKWWxScml2Tm58UXpRaXJBaVQGWKc/JL4v3yc+OTczJBGg2QxWFmQ0VrdRSqoeZ7AqmivNSS+OT8vLTMdCzW5GQWA1XSzJbSEqBUfGJxNlS7fzA5VsUCAObhcMU=": 0,
    "eJyLrs7MK0nNK4n3BFJFeakl8cn5eWmZ6fHlmXkp+eXFVgqGegY6CgVFqWXxicklmfl58TmZxUAdUIninPySeL/83PjknEyQMQbI4gUZ+Xmp8Xn5UNFaHQUSbCstASqByBfloikg09bI1OL4xDSQeVT1ViwAIApyCg==": 15,
    "eJy1j0EKwkAMRa8yByhSt97AjfsiEsqY1sD0p0yiXYh3d0oVSrfiKvDz+I9/fgqc4XQsJ4OdoqKTnibBVSc7hP2ursKY+UF3L8jyz8MGsKROJx0oJpnr6nU+3hRM0E/6qsLX2rBR2819a1EbXRSUxAr0D8GyxNhd0NsvUy5vHCxwiQ==": 0,
    "eJytjz0OgkAQha+yByAGW0oPYG8IeSHrgJMsM2RngMJ4d9eEwopG2/f35bVPFidx3MjQDwPnqQnnU12FOdOKPjqrILGV0G5YUsdVJ8TEn2b9rc8PFYLorr6qcAxY3CnDyJ1lNGwsd93sN9Ill4kyB1tiJLO/HureRxdqJQ==": 17,
    "eJy1j0EKwkAQBL+yDwgSrx59gHcRacI6GweSmbAzMYfg311xhZwFr91NFX1ZWZzEcSZDlxLn8RD2u7YJU6YHZnfKMHJn6Q0Ly00Xqwsb1HHSEXHgN6Ld5tNdhSBa02cTvqZjLoiCg80xktnW10VnFQxsZfo/Tb31KRBVEve/2K4vwOVvuA==": 0,
    "eJyLrk7NK8ksqYz3y8+NT87JBPKsFAz1DHQUMvNKgJx4v8TcVKhIQVFqWXxicklmfl58TmYxUBoqUZyTX4JkQLwBsnhiXkpRfmYKqmBBRn5earx/MFS0VkeBVHeUlpSkFsUXJ+aUllDTFVDbgkHmJoJ8Wkx7z8cCADZHgnI=": 5,
    "eJy9kEEKwkAMRa8yByhStx6iLroUCaENGJwmZZIKUry7UxxxXAsu/+Mnj+S0kjj7HTqdYIic0yHsd20TWDwH6HCiQuZEN1jcKYFhXN5Fi+rVOLQ1RxmT8vgN54sKwbEv9NGEtdj6bS86q1gtxWFDENly63/a161oV5DPF373np+vbn21": 0,
    "eJyLrs7MK0nNK4n3BFJFeakl8cn5eWmZ6fFJOYnJ2UmpRUWVVgqGegY6CgVFqWXxicklmfl58TmZxUBNUIninPySeL/83PjknEyQSQbI4ol5KUX5mSmoggUZ+Xmp8f7BUNFaHQXSXFFaAlQFUVKUi6mGmg7yA8r6B9M+CGIBaDmHGg==": 18,
    "eJyLrs7MK0nNK4n3BFJFeakl8cn5eWmZ6fFJOYnJ2UmpRUWVVgqGegY6CgVFqWXxpSVAVRAlRbmYaopz8kvi/fJz45NzMkGGGiCLJ+alFOVnpqAKFmTk56XG+wdDRWt1FGAO8gPK+gcjW56YXJKZnxefk1kMVEAXGyHezUMWp9zCWAB5734n": 0,
    "eJyLrs7MK0nNK4n3yy+J9w+2UjDUM9BRKChKLYtPTC7JzM+Lz8ksBiqAShTn5IOU5sYn52SCdBkgiyfmpRTlZ6agChZk5OelAk2GitbqKOC2sbSkJLUoPg9ZnJoWegKporzUkvjk/Ly0zHSYdtr7ORYAwod4Ug==": 11,
    "eJyLrs7MK0nNK4n3yy+J9w+2UjDUM9BRKChKLYsvLSlJLYrPQxYvzskHqcyNT87JBGkyQBZPzEspys9MQRUsyMjPSwUaABWt1VGAWegJpIryUkvik/Pz0jLTYdqRXZCYXJKZnxefk1kM1DEwToAEAli+KBdNAeVOiQUAht6C0w==": 0,
    "eJyLrs7MK0nNK4n3BFJFeakl8cn5eWmZ6fGJeSlF+ZkpVgqGegY6CgVFqWXxicklmfl58TmZxUAdUIninPySeL/83PjknEyQMQbI4lAzUAULMvLzUuP9g6GitToKJDihtASoBCJflIumgJpOiUwtjk9MA1lC+wCIBQA9z4Ut": 14,
    "eJyLrs7MK0nNK4n3BFJFeakl8cn5eWmZ6fGJeSlF+ZkpVgqGegY6CgVFqWXxpSVAJRD5olw0BcU5+SXxfvm58ck5mSDjDJDFoUpRBQsy8vNS4/2DoaK1Ogowp0SmFscnpoEsQbY9MbkkMz8vPiezGKiIbrZC/FycWlKSmZdeTHVPxwIA4PCDrA==": 0,
    "eJyLrs7MK0nNK4l3z89PSapMtVIw1DPQUSgoSi2LT0wuyczPi8/JLAaqgEoU5+SXxPvl58Yn52SCtBkgixdk5OelxuflQ0VrdRTwmF5aUpJaFJ+OIkE906FuL0otLkksKiHH+FgA+UtgVw==": 0,
    "eJyLrs7MK0nNK4l3z89PSapMtVIw1DPQUSgoSi2LLy0pSS2KT0eRKM7JL4n3y8+NT87JBGkzQBYvyMjPS43Py4eK1uoo4DE9MbkkMz8vvii1uCSxqIQy4z2BVFFeakl8cn5eWmY6FmtyMouBKsmxJRYAU8VjrA==": 9,
    "eJyLrs7MK0nNK4l3z89PSapMtVIw1DPQUSgoSi2LT0wuyczPiy9KLS5JLCqByhTn5JfE++XnxifnZIL0GSCLF2Tk56XG5+VDRWt1FGDGewKporzUkvjk/Ly0zHQs1uRkFgNV0syW0hKgVHxicTZUu38wOVbFAgAFNWjR": 0,
    "eJyLrs7MK0nNK4l3z89PSapMtVIw1DPQUSgoSi2LLy0pSS2KT0eRKM7JL4n3y8+NT87JBGkzQBZPzEspys9MQRUsyMjPS433D4aK1uoo4LEyMbkkMz8vvii1uCSxqISadgI1ZpZUIhkDVQ91i19iLjaH5GQWA6Wp5o5YAGgLeuk=": 3,
    "eJyLrs7MK0nNK4l3z89PSapMtVIw1DPQUSgoSi2LT0wuyczPiy9KLS5JLCqByhTn5JfE++XnxifnZIL0GSCLJ+alFOVnpqAKFmTk56XG+wdDRWt1FKqBGjNLKpGMgaqHusUvMRebQ3Iyi4HSA+iO0pKS1KL44sScUuqFRiwAu1+BGg==": 0,
    "eJyLrk7NK8ksqYz3y8+NT87JBPKsFAz1DHQUMvNKgJx4v8TcVKhIQVFqWXxicklmfl58TmYxUBoqUZyTX4JkQLwBsnhiXkpRfmYKqmBBRn5earx/MFS0VkeBVHeUlpSkFsUXJ+aUllDTFVDb/IsS89JT43OB8pW0930sALVvgr4=": 6,
    "eJy9j8EKAjEMRH+lH7DIevUjdg8eRULcDRps0yVNhWXx3y1Yod7F47zMMJnTRmJsKwwxwOS5qIPb7/rOsVgRMGCgShalB2QzUkjo88eYfLQmDn3LUWaNPH/D5RaFYDxW+uzcVttGRbkShHJf21acjKOA51Rsf+x9r8V0r1nJ4UL6swfOL+AWga4=": 0,
    "eJy1kMEKwkAMRH9lP6BIvfoRVvAoEtY2aHA3KbtpoYj/7gopuCcven2ZmQxzehArskKXPF8RojAuO7fdtI0bE87geyVhCJSLzA45iMJeIvSB3t72k3sektBQw/FWcqE7Gn027tvfSRUT+Hw3L0/xgumXBYqRdFnjxdRW61DT/01RUZa13/kFotmKnA==": 8,
    "eJy1kEEKwjAQRa+SAxSpWw9hBZciQ2yHOpjMlGQqlOLdjW0Es1a3b/7/POY0EyuyQhMs9wheGKed2W7qygwB7zCqYgAbbzBc0w149BcMORGdKOzFQ+voNVJ/cstdEOpKuI40x0wflZlTkXR6z0tOZ61DSRcl2yoJg6OYIr8yKSjLN37ry8T/We38BGDSlbQ=": 4,
    "eJyLrk7NK8ksqYwvyMjPS43Py7dSMNQz0FHIzCsBSsQHoIoWFKWWxScml2Tm58XnZBYDlUAlinPyS+L98nPjk3MyQfoMkMUT81KK8jNTUAUh9vkHYxPNy4eK1uookO6+0pKS1KL4/NxB67T0/PyUpMpUGrsvFgBFfp8S": 0,
    "eJyLrk7NK8ksqYwvyMjPS43Py7dSMNQz0FHIzCsBSsQHoIoWFKWWxZeWlKQWxefnQsWKc/JL4v3yc+OTczJBWgyQxRPzUoryM1NQBSFW+QdjE83Lh4rW6iiQ67T0/PyUpMpU2rsP6hJ3FPvADklMLsnMz4vPySwGqqCxQ2IB+VmXHg==": 4,
    "eJyLrk7NK8ksqYwvyMjPS43Py7dSMNQz0FHIzCsBSsQHoIoWFKWWxZeWlKQWxafn56ckVaZCJYpz8kvi/fJz45NzMkH6DJDFE/NSivIzU1AFIfb5B2MTzcuHitbqKFRDXeKOYh/YIYnJJZn5efE5mcVAFQPpEHqGSCwAw4aRNw==": 1,
    "eJyLrs7MK0nNK4l3z89PSapMtVIw1DPQUSgoSi2LT0wuyczPi8/JLAaqgEoU5+SXxPvl58Yn52SCtBkgiyfmpRTlZ6agChZk5OelxvsHYxPNy4eK1uoo4HFIaUlJalF8OorEgDgEGiJFqcUliUUlNHZJLAAWBYmp": 0,
    "eJyLrs7MK0nNK4l3z89PSapMtVIw1DPQUSgoSi2LLy0pSS2KT0eRKM7JL4n3y8+NT87JBGkzQBZPzEspys9MQRUsyMjPS433D8YmmpcPFa3VUcDjkMTkksz8vPii1OKSxKISurnEE0gV5aWWxCfn56VlpmNxUU5mMVAljR0UCwDk4oz+": 9,
    "eJyLrs7MK0nNK4l3z89PSapMtVIw1DPQUSgoSi2LT0wuyczPiy9KLS5JLCqByhTn5JfE++XnxifnZIL0GSCLJ+alFOVnpqAKFmTk56XG+wdjE83Lh4rW6ijAXOIJpIryUkvik/Pz0jLTsbgoJ7MYqHIwOKi0BCgVn1icDTeUxq6KBQD7hpIj": 0,
    "eJyLrs7MK0nNK4n3BFJFeakl8cn5eWmZ6VYKhnoGOgoFRall8YnJJZn5efE5mcVAlVCJ4pz8kni//Nz45JxMkHYDZPHEvJSi/MwUVMGCjPy81Hj/YGyieflQ0VodBSIcVFoClIpPLM6GGzpQroovz8xLyS8vHqjgigUAGmuYbA==": 12,
    "eJyLrs7MK0nNK4n3BFJFeakl8cn5eWmZ6VYKhnoGOgoFRall8aUlQKn4xOLs+IKM/LzUeP9gqGxxTn5JvF9+bnxyTibIDANk8cS8lKL8zBRUQZgB2ETz8qGitToKOFwVX56Zl5JfXozsusTkksz8vPiczGKgjsHkMEiwgeWLctEU0MqBsQAcNZ9V": 0,
    "eJyLrs7MK0nNK4n3BFJFeakl8cn5eWmZ6fHlmXkp+eXFVgqGegY6CgVFqWXxicklmfl58TmZxUAdUIninPySeL/83PjknEyQMQbI4ol5KUX5mSmoggUZ+Xmp8f7B2ETz8qGitToKJDistASoBCJflIumgPYOjEwtjk9MA1k9UIEVCwCxyptc": 15,
    "eJzFkEEKwkAMRa8yByhSt97AjS5ciUgYZtIamCZlEtuFeHenVKGKa10FXj7J459uxIZssC0jMxoE4YZaGImjjLpx61VduT7jAFcrkXmfu4+AJjHYSQch0XSuXnLPMQvFd9hfhBH2h2+U5UnvlXsJHlHBN9PrpZMPRsKQSEvozy5zP4pmxK3+qKDzA+00mds=": 0,
    "eJzFkLEKwkAQRH/lPiBIbP2IWFiJyHLcbXThMhtuV1OI/26EFApiqe17MzDM4SZwhtOejWLfSx02Yb1qmzBWvlJMLgoqYnNoEVbUqdOBUpFns33lEbmq5Hc4nhVM290nCl3ovQnft1zcuZKxu+BkNAmyTvazUd1skwKcnPO/Pjo+AOpLkhc=": 20,
    "eJzFkMEKwjAQRH8lH1CkXv2IevAkIktItrqQzpZktYfiv1uxQoVexeubYXjMaRQYw+jIhXzbSu52brupK9dnvtPNjDMVNhNcCg2CqEOZGyWpUaMdhSSviXrJPWJWid+wvyqY9oc1Cp3po3IfqWZKgwIcjOPSywcTBSUpU+//Ou+bsBL/Sur8BCttld8=": 0,
    "eJyLrs7MK0nNK4n3yy+JT87Py0tNLklNsVIw1DPQUSgoSi2LT0wuyczPi8/JLAaqg0oU5+SDdOTGJ+dkgjQbIIsn5qUU5WemoAoWZOTnpcb7B2MTzcuHitbqKBB0TmlJSWoRUAumNO0d5Z6fn5JUmTpQoRMLACb/kKE=": 4,
    "eJyLrs7MK0nNK4n3yy+JT87Py0tNLklNsVIw1DPQUSgoSi2LLy0pSS2Kz8MiXZyTD9KXG5+ckwkywgBZPDEvpSg/MwVVsCAjPy813j8Ym2hePlS0VkcB5ij3/PyUpMpUZOckJpdk5ufF52QWA1UMpEMg4ZKOIkErh8QCAJoYjjc=": 1,
    "eJyLzivNydFRqC7OyS+J98vPjU/OyUzNK4k3sFIw1DOoBcoAeZkllUhyYBkdhcy8EpBCv8TcVKhIQVFqWXxicklmfl58TmYxUBoqgcPwWADC3irb": 3,
    "eJyLri7OyS+J98vPjU/OyUzNK4k3sFIw1DOo1VGoBvIySyqR5MAyOgqZeSUghX6JualQkYKi1LL4xOSSzPy8+JzMYqA0VIJqhpeWlKQWxRcn5pSW4Dc6FgDrgEem": 0,
    "eJyLrs7MK0nNK4l3z89PSapMtVIw1DPQUSgoSi2LLy0pSS2KT0eRKM7JL4n3y8+NT87JBGkzQBYvyMjPS43Py4eK1uoo4DE9MbkkMz8vvii1uCSxqIQy44NSk3MScxNBBmKxIiezGKiKHBtiAan+Yf0=": 6,
    "eJyLrs7MK0nNK4l3z89PSapMtVIw1DPQUSgoSi2LT0wuyczPiy9KLS5JLCqByhTn5JfE++XnxifnZIL0GSCLF2Tk56XG5+VDRWt1FGDGB6Um5yTmJoIMxGJFTmYxUBVNbCgtKUktik8szoZpLc1NSi0ix6pYACq6Z1o=": 0,
    "eJyLrs7MK0nNK4kPSk3OScxNLMnMz7NSMNQz0FEoKEoti09MBonE52QWA1VBJYpz8kvi/fJz45NzMkFaDZDFCzLy81Lj8/KhorU6CgRsKC0pSS2KTyzOhmktzU1KLSLTKqCazJJKuAxUNdQBAaii1PFfLADVTW7Y": 7,
    "eJyLrs7MK0nNK4kPSk3OScxNLMnMz7NSMNQz0FEoKEotiy8tKUktik8szo4vyMjPS43PK81NSi2CqijOyS+J98vPjU/OyQSZYYAsDlWfDxWt1VGoBqrJLKmEy0BVQx0QgCoKtj0xGeSe+JzMYqASelkK8XIRRniQZHEsAG1edtw=": 4,
    "eJyLrs7MK0nNK4l3z89PSapMtVIw1DPQUSgoSi2LLy0pSS2KT0eRKM7JL4n3y8+NT87JBGkzQBYvyMjPS43Py4eK1uoo4DE9MbkkMz8vvii1uCSxqIQy44MTc0pLEkHmFWOxIiezGKiKHBtiAbcvYiU=": 5,
    "eJyLrs7MK0nNK4l3z89PSapMtVIw1DPQUSgoSi2LT0wuyczPiy9KLS5JLCqByhTn5JfE++XnxifnZIL0GSCLF2Tk56XG5+VDRWt1FGDGByfmlJYkgswrxmJFTmYxUBVNbCgtKUktik8szo7PS8xNJceKWAD5fWRJ": 0,
    "eJyLrs7MK0nNK4n3BFJFeakl8cn5eWmZ6VYKhnoGOgoFRall8YnJJZn5efE5mcVAlVCJ4pz8kni//Nz45JxMkHYDZPGCjPy81Pi8fKhorY4CEbaUlgCl4hOLs6Ha/YOpalV8Yl5KUX5mClU9FgsAKSJu8A==": 11,
    "eJyLrs7MK0nNK4n3BFJFeakl8cn5eWmZ6VYKhnoGOgoFRall8aUlQKn4xOLs+IKM/LzUeP9gqGxxTn5JvF9+bnxyTibIDANkcYjavHyoaK2OAg6r4hPzUoryM1OQrUxMLsnMz4vPySwG6qC5bRAPguWLctEUkGRrLADtAXWF": 0,
    "eJyLrs7MK0nNK4n3BFJFeakl8cn5eWmZ6fGJeSlF+ZkpVgqGegY6CgVFqWXxicklmfl58TmZxUAdUIninPySeL/83PjknEyQMQbI4gUZ+Xmp8Xn5UNFaHQUSbCstASqByBfloikg01Y/oKx/MFW9FAsAy71vuQ==": 18,
    "eJyLrs7MK0nNK4n3BFJFeakl8cn5eWmZ6fGJeSlF+ZkpVgqGegY6CgVFqWXxpSVAJRD5olw0BcU5+SXxfvm58ck5mSDjDJDFCzLy81Lj8/KhorU6CjBb/YCy/sHIliQml2Tm58XnZBYDFVDbcIgP8pDFSTI7FgBcl2gG": 0,
    "eJyLrs7MK0nNK4n3yy+J9w+2UjDUM9BRKChKLYtPTC7JzM+Lz8ksBiqAShTn5IOU5sYn52SCdBkgixdk5OelxuflQ0VrdRRwG15aUpJaBFSLJE6m2Z5AqigvtSQ+OT8vLTM9vjwzLyW/vJiqPokFAGycZNs=": 12,
    "eJyLrs7MK0nNK4n3yy+J9w+2UjDUM9BRKChKLYsvLSlJLYrPQxYvzskHqcyNT87JBGkyQBYvyMjPSwWqh4rW6ijAzPYEUkV5qSXxyfl5aZnp8eWZeSn55cXIliUml2Tm58XnZBYDddDcNojXwPJFuWgKSLI1FgAVrW+w": 0,
    "eJyLrk7NK8ksqYz3y8+NT87JBPKsFAz1DHQUMvNKgJx4v8TcVKhIQVFqWXxicklmfl58TmYxUBoqUZyTX4JkQLwBWLxWR4FUw0tLSlKL4osTc0pLCBoNNSIoNTknMTcR5CgynRkLAKjWWPg=": 6,
    "eJyLrk7NK8ksqYz3y8+NT87JBPKsFAz1DHQUMvNKgJx4v8TcVKhIQVFqWXxpSUlqUXxxYk4pTGFxTn4JkvZ4A7B4rY5CNdSIoNTknMTcxJLM/DxkkxKTQSLxOZnFQFUUmgVxVWJxdnxBRn5eanxeaW5SahF+Q2MBUPlXdA==": 0,
    "eJyLrk7NK8ksqYwvyMjPS43Py7dSMNQz0FHIzCsBSsQHoIoWFKWWxZeWlKQWxRelJuck5iaWZObnQSWLc/JL4v3yc+OTczJBeg2QxWHGQ0VrdRTItTg9Pz8lqTKVTEuhxrujGAI2PTEZ5Jf4nMxioApyTI8FAMPXcX8=": 4,
    "eJyLrs7MK0nNK4n3BFJFeakl8cn5eWmZ6VYKhnoGOgoFRall8YnJJZn5efE5mcVAlVCJ4pz8kni//Nz45JxMkHYDZPGCjPy81Pi8fKhorY4CEbaUlgCl4hOLs6Ha/YOpalV8Uk5icnZSalFRJVX9FgsAjHxwMA==": 13,
    "eJyLrs7MK0nNK4n3BFJFeakl8cn5eWmZ6VYKhnoGOgoFRall8aUlQKn4xOLs+IKM/LzUeP9gqGxxTn5JvF9+bnxyTibIDANkcYjavHyoaK2OAg6r4pNyEpOzk1KLiiqRbU1MLsnMz4vPySwGaqKHhRBvgpUU5WKqIcnuWABvAHlF": 0,
    "eJyLrs7MK0nNK4n3BFJFeakl8cn5eWmZ6fFJOYnJ2UmpRUWVVgqGegY6CgVFqWXxicklmfl58TmZxUBNUIninPySeL/83PjknEyQSQbI4gUZ+Xmp8Xn5UNFaHQXSLCwtAaqCKCnKxVRDpt2RqcXxiWkgI6nquVgAWBp1TA==": 16,
    "eJy1j0EKwkAMRa8yByhSt97AjXsRCdMhbYPTpCRRKOLdndIKBZfi6sPn8R//8iR2ZIdjCWV0SMItddDkmG4Nqk6HsN/VVRgVH3D3Qi2IDt+MZXE4yQAp0zxab/uxF0ZgWdtXFT7uMxrEdp7cumJyEoZMVqB/CJYzhu7Enf345voGRXxzyw==": 0,
    "eJytjz0KwkAQha+yBwgSW0sPYC8ij80y0cHNTJiZKCLe3QgprGy0fX8f7/BgCZLAnhy579mGTVqv2iaNRlfkEqyCyj6HFsOrBnY6oFR+N9tPfTyrEEQX9dmk74ApggxOESwnR1dzuXRkdv8NtjW9+bwIn0oh979+Or4Akh5rOw==": 17,
    "eJy1j0EKwkAMRa8yByhSty49gHsRCdOQqcFpUiapRcS7W3GErgW3/3/e458eLE7icCSDmBKXYRe2m7YJY6EbTO5UwMidpTfocsRrR6Xc68iyOhx0AMz8prTrfLyoEIjW9NmEr2xfdLaFCDYhktlaGdFZBTLbMv2fpj77FIAqiftfbOcXIFdwzg==": 0,
    "eJyLrk7NK8ksqYz3y8+NT87JBPKsFAz1DHQUMvNKgJx4v8TcVKhIQVFqWXxicklmfl58TmYxUBoqUZyTX4JkQLwBWLxWR4FUw0tLSlKL4osTc0pLCBoNNcITSBXlpZbEJ+fnpWWmxyflJCZnJ6UWFVWS6epYAFdKXyc=": 13,
    "eJyLrk7NK8ksqYz3y8+NT87JBPKsFAz1DHQUMvNKgJx4v8TcVKhIQVFqWXxpSUlqUXxxYk4pTGFxTn4JkvZ4A7B4rY5CNdQITyBVlJdaEp+cn5eWmR6flJOYnJ2UWlRUiWxwYnJJZn5efE5mMVATdY2GuBmspCgXUw0OW2IB9bVkoA==": 0,
    "eJyLrs7MK0nNK4n3yy+J9w+2UjDUM9BRKChKLYtPTC7JzM+Lz8ksBiqAShTn5IOU5sYn52SCdBkgixdk5OelxuflQ0VrdRRwG15aUpJaBFSLJE6m2Z5AqigvtSQ+OT8vLTM9PiknMTk7KbWoqJKqnokFAKPMZfE=": 13,
    "eJyLrs7MK0nNK4n3yy+J9w+2UjDUM9BRKChKLYsvLSlJLYrPQxYvzskHqcyNT87JBGkyQBYvyMjPSwWqh4rW6ijAzPYEUkV5qSXxyfl5aZnp8Uk5icnZSalFRZXI9iUml2Tm58XnZBYDNdHDQogHwUqKcjHVkGR3LAAl2XLy": 0,
    "eJy9jjEKwkAQRa+yBwgSWy8gNlpYigxxd4wD6/wwOxpEvLsRLAwEO60+vM+Dt7uLOqvTEkiHGy/CfFZXoTO+0sWdjdrRUTKc1jhTzPLS6k/eaDJIGsPuBGXabKeo4k0fVfgS0kQXKBkXb8z/VrIaxpSdIvQoLfWiCX2ZKMtSBuPHYfsnvdqQaA==": 12,
    "eJzNjkEKwjAQRa+SAxSpWy8gbnThUmSIyagD6UyZjBaR3r0RK6h0K7j68P7/8HZ3YkM2WIrEww0Xbj6rK9cqXsEHI2FQzObVxiYnMVhLAyHR41e/c89RheInbM/CCJvtFGUZaV+5l8mqhDIaBOEjnaAjjtLlCbNEuTz+SexiZfLstfka/EpwPwCV4JqW": 0,
    "eJzFkMEKwkAMRH9lP6BIvXr0A/TgSUTCsptqYJuUJG0P4r+7Qg8K4lGvb2aYYU43Ykd2OKJB7DrSfhPWq7YJg+IEMTkJQyGrpkWwIg476SEVeibbVx45q1B+h8NVGGF/+ERZFnpvwvctozsqGLoTXwxm4iyz/WzUVmtbbQYbU0Kzf910fgDUIpN3": 17,
    "eJzNkEEKwkAMRa/SAxSpW5ceQBeuRCQMM5kamCZlktqFeHdHHKGCW8Hty+f/R043YkM2OKKCi5HysGnWq65txoxXmMwwg6IZca8wEweZtSY0icFOBvCJnhXdkjsOWSh8wvEijLA/fKMsld7b5i21zWWtLINO3qPqUs15I2FIpCX6F0b1Wa8DeOFI/Y/Fzg/yMJkK": 0,
    "eJyLrs7MK0nNK4l3KsovL87MS48vLk1OTi0utlIw1DPQUSgoSi2LT0wuyczPi8/JLAYqhUoU5+SXxPvl58Yn52SC9BsgiyfmpRTlZ6agChZk5OelxvsHYxPNy4eK1uooEOOi0pKS1CKYRHxyfl5aZjrdHOaen5+SVJk6UCEUCwA8JJPM": 4,
    "eJzFkLEKwkAMhl/lHqBIXR1d3HRwFAk1F8/AmZRLqoj47iq20IKruH5f+PnI7s7iJA7LoldjSWAdIpktwnxWV6EtdIHOncogAFWOnHpvWR3WegbM/J6px7yRWJTjFLYnFYLN9hsV7emjCkPYSjUebjTuadBZBTLb6+KfIZ/HpIn4Vcj+CZDzkAI=": 1,
    "eJyLrs7MK0nNK4l3z89PSapMtVIw1DPQUSgoSi2LLy0pSS2KT0eRKM7JL4n3y8+NT87JBGkzQBYvyMjPS43Py4eK1uoo4DE9MbkkMz8vvii1uCSxqIQy4z2BVFFeakl8cn5eWmZ6fHlmXkp+eTEW63Iyi4E6yLEtFgC9cWcW": 12,
    "eJyLrs7MK0nNK4l3z89PSapMtVIw1DPQUSgoSi2LT0wuyczPiy9KLS5JLCqByhTn5JfE++XnxifnZIL0GSCLF2Tk56XG5+VDRWt1FGDGewKporzUkvjk/Ly0zPT48sy8lPzyYizW5WQWA3XQ3LbSEqASiHxRLpoCkmyNBQAEAHFE": 0,
    "eJyljUEKwkAQBL+yDwgSr35AvPgBkWZ3HZPBdSbMjkIQ/24EDwqSg54auumq3Y3FSRxr1UMaaRWWi7YJg9EVF3cydB9DLerY6hm58PPWvvdDr0IQfbX3JszQY3ZWgVH1aP4ffjOFCTmyypE7pBLzKZHZ+MVYuE6nX4T7B/tSaCw=": 13,
    "eJyLrs7MK0nNK4l3z89PSapMtVIw1DPQUSgoSi2LT0wuyczPiy9KLS5JLCqByhTn5JfE++XnxifnZIL0GSCLF2Tk56XG5+VDRWt1FGDGewKporzUkvjk/Ly0zPT4pJzE5Oyk1KKiSiw25mQWAzXRw8LSEqAqiJKiXEw1JNkdCwAiYHSG": 0,
    "eJytj0EKwlAMRK/yD1Ck3fYQ3YuU8BtTDf4mJYlCEe9uhS5cdaPbeTM85vRkCZKAIznkcWSb2tQc6irNRg/IGKwChX0tbcCLBnQ6ARb+LOvvfL6qEIhu6atK+4J7BBk4RbBcHIaS8TaQ2fKbrFspqghh0Pmvh/o3Mthp2w==": 20,
    "eJy1j0EKwlAMRK/yD1Ckbj1E9yISfmNag79JSaIg4t2ttEIXbly4nTfMYw4PliAJ2JND7jq2YZe2m7pKo9ENrhFk4BTB0ju0JeOlJbP7UvKiAY0OgIXfK/U6H88qBKJL+qzSR9ZMFFWEMOi09mUMVoHCPvX+5Jg/yRf8k+n4AqzVbaM=": 0,
    "eJyLrs7MK0nNK4n3yy+JT87Py0tNLklNsVIw1DPQUSgoSi2LT0wuyczPi8/JLAaqg0oU5+SDdOTGJ+dkgjQbIIsXZOTnpcbn5UNFa3UUCNpRWlKSWgTUgilNpk3u+fkpSZWpVPVHLACqvGdP": 4,
    "eJyLrs7MK0nNK4n3yy+JT87Py0tNLklNsVIw1DPQUSgoSi2LLy0pSS2Kz8MiXZyTD9KXG5+ckwkywgBZvCAjPy8VqA0qWqujALPJPT8/JakyFdmOxOSSzPy8+JzMYqAKqpsO8UE6igRJpscCAChZZOU=": 1,
    "eJyLrs7MK0nNK4l3z89PSapMtVIw1DPQUSgoSi2LLy0pSS2KT0eRKM7JL4n3y8+NT87JBGkzQBYvyMjPS43Py4eK1uoo4DE9MbkkMz8vvii1uCSxqIQy4z2BVFFeakl8cn5eWmZ6fGJeSlF+ZgoW63Iyi4E6yLEtFgCwBGbs": 11,
    "eJy1jU0KAjEMha/SAwwybr2AuPECIqG2UQOdvCGNgoh3t+IIIm5cuHrw/r7NVdRZnZZA3l14Eeazvguj8ZlicoGScfVoPiW1wGmNgVKRx65/98cjlEkxubcuvO5XTUzZKUH3cqCo2SD5C65IbYu/007eKs/cho/CT9TtHcsYcMY=": 0,
    "eJytjzEKwkAURK+yBwgSWw+RXkQ+YfdHP2zmh93RRry7K6SwsknaNzM85vIyUEE5a5VxmqzMp3A89F1Yij5ljDSHZKuttAY1O2XwWWK277L/5cvdoQJf6bsL/wUPUotUJQ23VkAqbmmbaWhpdEAjNe365voB0Ulomw==": 20,
    "eJy1j7EKg0AQRH/lPkCCtn6EvQRZ5G41C+es3K1pQv7dCzFgkSZF2pnHPOb6EBjDqOdM4zRJWlrXXOrKrYnvtJlxosxmgrkACEklHESOatTpQj7Ka6I+5+tNwQQ90mflPqautF4B9sbhLBu9iYKi5ML9yfE+hC/1T6ZhByntbGM=": 0,
    "eJyLrs7MK0nNK4n3BFJFeakl8cn5eWmZ6VYKhnoGOgoFRall8YnJJZn5efE5mcVAlVCJ4pz8kni//Nz45JxMkHYDZPHEvJSi/MwUVMGCjPy81Hj/YKhorY4CEVaXlgCl4hOLs+HaaW9/fHlmXkp+eTHtgyAWAABdgrs=": 12,
    "eJyLrs7MK0nNK4n3BFJFeakl8cn5eWmZ6VYKhnoGOgoFRall8aUlQKn4xOLs+IKM/LzUeP9gqGxxTn5JvF9+bnxyTibIDANk8cS8lKL8zBRUQZgBUNFaHQUc9seXZ+al5JcXI7sjMbkkMz8vPiezGKhjYJwACQqwfFEumgLKnRILAGxGiaQ=": 0,
    "eJyLrs7MK0nNK4n3BFJFeakl8cn5eWmZ6fHlmXkp+eXFVgqGegY6CgVFqWXxicklmfl58TmZxUAdUIninPySeL/83PjknEyQMQbI4ol5KUX5mSmoggUZ+Xmp8f7BUNFaHQUSnFBaAlQCkS/KRVNATaf4AWX9g2nv+VgAdj6D2A==": 18,
    "eJyLrs7MK0nNK4n3BFJFeakl8cn5eWmZ6fHlmXkp+eXFVgqGegY6CgVFqWXxpSVAJRD5olw0BcU5+SXxfvm58ck5mSDjDJDFE/NSivIzU1AFCzLy81Lj/YOhorU6CjCn+AFl/YORbU5MLsnMz4vPySwGKqCLjRC/5iGLU25hLABOsnv7": 0,
    "eJyLrs7MK0nNK4l3z89PSapMtVIw1DPQUSgoSi2LLy0pSS2KT0eRKM7JL4n3y8+NT87JBGkzQBZPzEspys9MQRUsyMjPS433D8YmmpcPFa3VUcDjkMTkksz8vPii1OKSxKISurkkODGntCQRZHUxFtfkZBYDVdHYMbEAmG+Ldw==": 5,
    "eJzFjkEKwlAMRK/yD1Ckbr2Au7roUiTE/oDB36QkqSDi3W2hgkK34vbNDPOOD5YgCdir5vOddmm7qas0GN0Au2AVMPJAiyXxogGN9tAVnnf1J0fJppy/4XBRITi0a1R0oc8qvU1aLGPgfO0rNoV9av1bZowgA/QrCPb0Y5vTC9fCjZs=": 0,
    "eJyLrs7MK0nNK4kPTswpLUksyczPK7ZSMNQz0FEoKEoti09MBgnF52QWA1VBJYpz8kvi/fJz45NzMkFaDZDFE/NSivIzU1AFCzLy81Lj/YOxieblQ0VrdRQIOKa0pCS1KD6xODs+LzE3lfauARqXWVKJZDhUPdSVfghH0D2sYgGMdZQW": 3,
    "eJzNkEEKwkAMRa8yByhStx6iLroUCaENGJwmZZIKUnp3OzpgBbeC2/eTz+OfZhYncWgxTo7OKnYI+11dhTHRDSZ3SoB2BcGBSmJRHRodoIucf+stR+mTcv8Jx4sKwbH9RkULXaowr3Xs9015uS+WzVviqYddNobItsZ/Z/caz/KyP3Y7PwDYMpiJ": 0,
    "eJyLrk7NK8ksqYz3y8+NT87JBPKsFAz1DHQUMvNKgJx4v8TcVKhIQVFqWXxicklmfl58TmYxUBoqUZyTX4JkQLwBsnhiXkpRfmYKqmBBRn5earx/MDbRvHyoaK2OAqmuKy0pSS2KL07MKS2hvdugbvAEUkV5qSXxyfl5aZnpAxVYsQD85Jmq": 9,
    "eJzNkEEKwkAMRa8yByhSt97ATV24FAlhGjU4TcpMWpDi3R1wlBHcCq7Cf/yERw4LibHdoNMBfOCcNm69ahvHYjlAhwMVMkaaYTKjCAnD9CqmoFatQ1tzlD4q959wvKgQ7PbfqGih98YtxWGbRxQy8ConPtc66I1VIHDKzX8Qev4H0/V99MdWxwcZ0Zfu": 0,
    "eJyLrs7MK0nNK4n3BFJFeakl8cn5eWmZ6VYKhnoGOgoFRall8YnJJZn5efE5mcVAlVCJ4pz8kni//Nz45JxMkHYDZPHEvJSi/MwUVMGCjPy81Hj/YGyieflQ0VodBSIcVFoClIpPLM6GG0p7VwGNyyyphBkCVYzdqWiK6B6GsQDLi59U": 11,
    "eJyLrs7MK0nNK4n3BFJFeakl8cn5eWmZ6VYKhnoGOgoFRall8aUlQKn4xOLs+IKM/LzUeP9gqGxxTn5JvF9+bnxyTibIDANk8cS8lKL8zBRUQZgB2ETz8qGitToK1UDjMksqYYZAFWN3KpoisJMTk0sy8/PiczKLgToGvWshAQyWL8pFU0ArV8cCANMhrPs=": 0,
    "eJyLrk7NK8ksqYxPzEspys9MsVIw1DPQUcjMKwGKx3sCqaK81JL45Py8tMx0NEUFRall8YnJJZn5efE5mcVAHVCJ4pz8kni//Nz45JxMkDEGyOJQM1AFCzLy81Lj/YOxieblQ0VrdRQodW1pCVAJRL4oF00BDV0NdWBkanF8YhrI6oEKwVgAitipAg==": 14,
    "eJzFkEEKwkAMRa8yByhSt97AjS5ciUgYpmkNTJMyiYIU7+6UzqIW17oKvDySz7+MyEb2BM9NEmp2brupK0dsmcM+j8RoEIRb6lbSkPABd8vKvE/9StAoBgfpIUSaztVLXtRPONyEEY6nb5Sl0FflxhLwjAq+nV4vM/lgJAyRNEt/zjL3o2hG3OmPCrq+ASQZoG8=": 0,
    "eJzFkEEKwlAMRK/yD1Ckbl16AF10VUTC5zfVwG9SkrQuxLtboYIFcVm3b2aYYU53Ykd2qNEgti1ptwvbTVmEXnGEmJyEIZNNplmwLA4H6SBleiXLTx65UaFmCfurMMKx+kZZZvoowu8tgzsqGLoTX+zdtNqovcrNpmawISU0+9dN5yerzZNN": 17,
    "eJzNkEEKwkAMAL+yDyhSrx59gB48iUgo22wNbJOySetB/Hu3uEIFr4LXyZAMuTyIDdngjApNCJT6ndtu6soNCScYzTCBohlxlwVuk1BbDI1icJAefKRlRb3mRf2Ew00Y4Xj6RlkKfVbuHbVPctd8GXT0HlXXaY03EoZImtW/KCrPeg3ACwfqfhx2nQGwwZjg": 0,
    "eJy9jj0KwkAQRq+yBwgSWy8gNlpYigz7M8bBdSbMToQQcncjWBgIdlp98D4evNNAbMgGW5EUety49aquXKv4gM4MFZrZUbIY7OUOMdNLqz+556RCaQ7bqzDC4bhEWd50rNyXEB+NhEGxmFf7W8luGmU0iMIXaiBkH28BVfuFuExlkn7cdn4CfSCRfg==": 13,
    "eJzNjk0KwkAMRq8yByhSt15A3OjCpUiYn6jBaVLSVCji3R2xgmK3gqvAy/vg7a7EhmywFElhwIWbz+rKtYoX8NFIGBQ782rjp8tisJYGYqbHrn7nnpMKpU/YnoQRNtspyjLSW+VeJatylNEgCh/oCCH7eA6oOkzEZerK6M/aeivWU9Hm2/lV5v4OPcCd2A==": 0,
    "eJyLrs7MK0nNK4n3BFJFeakl8cn5eWmZ6fFJOYnJ2UmpRUWVVgqGegY6CgVFqWXxicklmfl58TmZxUBNUIninPySeL/83PjknEyQSQbI4ol5KUX5mSmoggUZ+Xmp8f7B2ETz8qGitToKpLmttASoCqKkKBdTDe2dGZlaHJ+YBrJ9oIIsFgCDep6e": 16,
    "eJzFkEEKwkAMRa8yByhSt97AjS5ciUiYTtManCYlkwoi3t0pVajoWleBx+Pn8w83YkM2WOejjAZBuKEWqujDuULV68otF2XhesULDJatSdHu00lRDDbSQYg0hpZz7rlWofod9idhhO3uG2V50nvhXjX3mMA34/d5LR+MhCFSytKfu0wTJTQjbtPvNjo+ALAknR0=": 0,
    "eJzFkEEKwlAMRK/yD1Ckbl16AF24EpHw+5tq8DcpSapI6d2t0IWCuNTtmxlmmMNA7MgOezSITUParsJyURahU7xCTE7CkMkm0yxYFoeNtJAyPZPlK49cq1D9DruzMMJ294myzHQswvctvTsqGLoTnwyqHNOlQtX7z3atVW42lYP1KaHZv546PgCl7pSN": 17,
    "eJzNkEEKwkAMRa/SAxSpW5ceQBeuRCRMp2kNTpOSpBUR727FChXcCm7f/ySPf7gRO7LDHg1CXZO2q2y5KPKsUxygd0cFQ3fixqBMIZ5LVL1OJUvisJEWYqLnlWLOA1cqVH3C7iSMsN19oywTvefZ22utcrHxOVgfI5rN7UJ0EoZENlb/wmja6xVAFK6p+bHY8QHduJog": 0,
    "eJzFkEEKwkAMRa8yByhStx6iXbgSkTCdSTU4TUoSBZHe3QpdKIhL3b73P3z+/k7syA47NIh9TzpswnpVV2FUvEJMTsJQyObQIqyIQyMDpELPZv3KI2cVyu9wPAkjtNtPlGWhUxW+b7m4o4KhO/HRoCsxnTtUvf1sVzPbJMyYHPO/bjo8ALjVky0=": 20,
    "eJzFkEEKwkAMRa8yByhStx6iXbgSkTCdSTU4TUomFaR4dytWqNCtuH3/83n840hsyAYHzODblrTbue2mLFyveIPBDBUymhGfMzTJh2uDqve5lJMYVNJBSPRaKZfcc1Sh+A37izBCvV+jLDN9FO7jVU1pEGYMhnGp5oORMCTKU+//Ou+neCX+ldTpCQ9blvU=": 0,
    "eJyLrs7MK0nNK4n3BFJFeakl8cn5eWmZ6VYKhnoGOgoFRall8YnJJZn5efE5mcVAlVCJ4pz8kni//Nz45JxMkHYDZPGCjPy81Pi8fKhorY4CEbaUlgCl4hOLs6Ha/YPJtAqoJrOkMj4xL6UoPzMFqhi7/WiKyPMt1Axs7vIPxu/aWAB7/4PI": 11,
    "eJyLrs7MK0nNK4n3BFJFeakl8cn5eWmZ6VYKhnoGOgoFRall8aUlQKn4xOLs+IKM/LzUeP9gqGxxTn5JvF9+bnxyTibIDANkcYjavHyoaK2OQjVQTWZJZXxiXkpRfmYKVDF2+9EUgd2RmFySmZ8Xn5NZDNRBjBOgZmBzl38wrV0LCTWwfFEumgJauToWADRpnzU=": 0,
    "eJyLrs7MK0nNK4n3yy+J9w+2UjDUM9BRKChKLYtPTC7JzM+Lz8ksBiqAShTn5IOU5sYn52SCdBkgiyfmpRTlZ6agChZk5OelAk2GitbqKOC2sbSkJLUoPg9ZnJoWegKporzUkvjk/Ly0zPT4pJzE5Oyk1KKiStp7OxYASLV5kg==": 13,
    "eJyLrs7MK0nNK4n3yy+J9w+2UjDUM9BRKChKLYsvLSlJLYrPQxYvzskHqcyNT87JBGkyQBZPzEspys9MQRUsyMjPSwUaABWt1VGAWegJpIryUkvik/Pz0jLT45NyEpOzk1KLiiqRHZGYXJKZnxefk1kM1DRgroAEBVhJUS6mGsodFAsAmxeGkw==": 0,
    "eJy1jzEOwlAMQ6/yD1ChsjJyADowIYSi398UIn6TKkmLEOLutFIHWNi6PtuyfX4RO7LDCQ1i25J2u7DdlEXoFUeIyUkYMtlkWgTL4nCQDlKmOVl+88iNCjW/sL8JI1THhb6L8L91cEcFQ3fiq0GdY7rXqPpcYcFe5WFTDdiQEpqt//7yAXt/ftw=": 17,
    "eJy9kEEKwkAMRa/SAxSpW5ceQBeuRCRMp5kanCYlSRUR727FCnUvbl8+/z9yuBM7ssMeDUJKpN2qWC6qsugVLzC4o4KhO3FrUOcQzzWq3qaQZXHYSAcx06ulmvPAjQo137A/CSNsdxN9lMXHYK1ytXEGbIgRzeYeIToJQyYbo3/enn7wPkAUTtT+TOH4BFUchG8=": 0,
    "eJyLrs7MK0nNK4l3z89PSapMtVIw1DPQUSgoSi2LLy0pSS2KT0eRKM7JL4n3y8+NT87JBGkzAIvX6ijgMScxuSQzPy++KLW4JLGohKBBQF5mSSWSHFQH1AK/xFxspudkFgOl8RseCwCU6VGX": 3,
    "eJyLrs7MK0nNK4l3z89PSapMtVIw1DPQUSgoSi2LT0wuyczPiy9KLS5JLCqByhTn5JfE++XnxifnZIL0GYDFa3UUqoG8zJJKJDmoDqgFfom52EzPySwGSlPb8NKSktSi+OLEnFIC7o4FAMiIV8g=": 0,
    "eJytjzEKwlAQRK/yDxAkth4ivYgM4WejCz+74e9oCvHuRkhhZaPtvBkec3qoUYw4SqAfR63TIe13bZPmKnf0meqGorGWNhDFic4n5KLvZfuZz1c3gfmWPpv0XXAjpSKEVLsEFrXBl/jN1K00u5lkyvDXN+cX6wRoxQ==": 20,
    "eJy1jzEKg1AQRK/yDyBBWw9hH4Is8l2The+s/N3EInj3GGLAwiZF2nnDPObyFDjD6cxG3TBIHutQncoiTJkfdHfnTMbugqvRLOh1tq1hSZ0aHSkmeU+U+3y6KZigW7oU4WtqVhoV4Ojc72VddFFQElt7f3J8DuEA/2RqX1UMbI0=": 0,
    "eJyLrk7NK8ksqYz3y8+NT87JBPKsFAz1DHQUMvNKgJx4v8TcVKhIQVFqWXxicklmfl58TmYxUBoqUZyTX4JkQLwBsnhBRn5eanxePlS0VkeBVCtLS0pSi+KLE3NKS8i0EGpwUGpyTmJuIsgDVPVSLAAtd26p": 6,
    "eJy1j00KwjAQha+SAxSpWw/RhVuRYQwDDp1kSjIRpHj3Rkwh64LL9/F+eLeVorG9YdIAXriqizufxsFxtCpgwkCNLIleUMwoQUYpuzGLWheHsefLUyNB1EY/g1tb8ZW8YEBjjX0/+i8B4Vxdf1n4PcA879ESHpSOTN03RlJtJQ==": 0,
    "eJy1j7EKwkAQRH/lPiBIbP2IWFiJyHDcbXThshtuV1ME/90IKbSxS/veDMNcZhYncZzJEPue63AI+13bhLHSEzE5q6CwLaFVWFFHpwNS4U+z/eZRclXOv3C8qxCOp5W+mvB/9eFOFUbuLDfDxJJ1sg3mu8UmFaHklLf/fX0DTwZ8Zg==": 20,
    "eJy9j0EKwkAMRa8yByhStx6iLlyJSBhmUg20P2US7UK8uxUrVHAnuH3/819yuAmc4bRno9i2UvpNWK/qKgyFr3Rx50LG7oKT0SjIOtrcsE6dGu0pdfKcqJc8IheV/AmHs4Jpu5vpvQpvfTOlSQFOznl5QUwuCurEpt4/xa/X8SX+XX98AJ34gC4=": 0,
    "eJy1jksKwkAQRK8yBwgSt15AsokLlyLNfNrYOHaHnlYIwbubgAsD4kpXBa94VB1GYkM22IqkMODGrVd15XrFO9zMUKFbFCWLQStXiJlmrX7nnpMKpSXsz8IIu/2LPir3ZdJHI2FQLObV/rDZTKGMBlH4RB2E7OMloOrw4UamMkk/e3F8Ah9Me80=": 13,
    "eJzFjj0KAkEMha8yB1hkbb2A2GhhKRLmJ2pwNlkyUVjEuzviCop2FlaBl+/xvs2F2JAN5iIpDDhz00nbuF7xDD4aCYNiMa82fkoWg6V0EDPde+1r7jmpUHoP+4Mwwmo9ptfGPTcX9SijQRTe0R5C9vEYUHX4opGp1NLfLE5WqQei3Sfzu9D2BvsKiCc=": 0,
    "eJyLrs7MK0nNK4n3BFJFeakl8cn5eWmZ6VYKhnoGOgoFRall8YnJJZn5efE5mcVAlVCJ4pz8kni//Nz45JxMkHYDZPHEvJSi/MwUVMGCjPy81Hj/YGyieflQ0VodBSIcVFoClIpPLM6GGzpQropPyklMzk5KLSqqHKgQiwUA8a6Zgg==": 13,
    "eJyLrs7MK0nNK4n3BFJFeakl8cn5eWmZ6VYKhnoGOgoFRall8aUlQKn4xOLs+IKM/LzUeP9gqGxxTn5JvF9+bnxyTibIDANk8cS8lKL8zBRUQZgB2ETz8qGitToKOFwVn5STmJydlFpUVInswMTkksz8vPiczGKgpkHmNkjggZUU5WKqoZUzYwHuvaKX": 0,
    "eJyLrs7MK0nNK4l3z89PSapMtVIw1DPQUSgoSi2LLy0pSS2KT0eRKM7JL4n3y8+NT87JBGkzQBZPzEspys9MQRUsyMjPS433D4aK1uoo4LEyMbkkMz8vvii1uCSxqIQGdnoCqaK81JL45Py8tMx0LHbnZBYDVVLN6lgAiS93TQ==": 9,
    "eJyLrs7MK0nNK4l3z89PSapMtVIw1DPQUSgoSi2LT0wuyczPiy9KLS5JLCqByhTn5JfE++XnxifnZIL0GSCLJ+alFOVnpqAKFmTk56XG+wdDRWt1FGB2egKporzUkvjk/Ly0zHQsdudkFgNV0tfq0hKgVHxicTZcO9XsjwUAYvl8cg==": 0,
    "eJydjUEKwkAMRa8yByjSbj2EFLciYZyGGpgmZeYrFPHubWEEC27s9v3kvcuLFYKJxrspk9rRNYe6cqJYBmq3dEz8pAfAiXqz7jZxGXI00MkGClHWv/qbf9SFviv3f9QHiCklzvAJO6vFf+YQ/eBX4Y9ElLxc7SlcZwckceU=": 6,
    "eJy1jU0KwkAMRq8yByhStx5CxK2UkA4BgzNJyaRCKd7dFqZQwZXg9vt57zaTOPsEw12FQPQUjoe2CSy+FHD5TAejJ2B0VgGj4mhem5LU4awZYuL12O7zjV3TVxPmyr9STJhxBX5RJC7L6i+G0Z0MsDy265h7sl9U3Rvslm9O": 0,
    "eJydjUEKwjAQRa+SAxSpW2/gprgXGZI41sE4UyajEMS7N0IEBTd29eF9/n/7B7KRFZjOwggsG7de9Z0jtlrA7ptOine4maHCKHIMBVuRkxgMcoWY6LXrP/n7utFn5/6X+mgkDIrZvNpCa/vf1lBGgyh8ohFC8vESULX8MCbKdbREeJgBRx94FA==": 13,
    "eJy9jcEKwkAMRH9lP6BIvfoHXsS7lLBdoga3SclGoZT+uyuuYNFLLz0NzLyZOY3IRjZAfxVGYNm57aauHLHlAI5zt1d8gA9GwqCYzKuVJEUxOEgHIdKrWH/7n+3iTpUby/4+izIaBOEzXaCNPtxaVB3+PEZKubTG4d0y9Ua0+2UWfTdP4st8eg==": 0,
    "eJyLrs7MK0nNK4l3z89PSapMtVIw1DPQUSgoSi2LLy0pSS2KT0eRKM7JL4n3y8+NT87JBGkzAIvX6ijgMScxuSQzPy++KLW4JLGohFiDPIFUUV5qSXxyfl5aZnp8eWZeSn55MRaDczKLgTrwmxsLAGJbUWU=": 12,
    "eJyLrs7MK0nNK4l3z89PSapMtVIw1DPQUSgoSi2LT0wuyczPiy9KLS5JLCqByhTn5JfE++XnxifnZIL0GYDFa3UUYAZ5AqmivNSS+OT8vLTM9PjyzLyU/PJiLAbnZBYDdVDR3NISoBKIfFEumgIc5scCAEzWW5M=": 0,
    "eJyLrk7NK8ksqYz3y8+NT87JBPKsFAz1DHQUMvNKgJx4v8TcVKhIQVFqWXxicklmfl58TmYxUBoqUZyTX4JkQLwBWLxWR4FUw0tLSlKL4osTc0pLCBoNNcITSBXlpZbEJ+fnpWWmxyfmpRTlZ6aQ6eRYACzaXec=": 11,
    "eJyLrk7NK8ksqYz3y8+NT87JBPKsFAz1DHQUMvNKgJx4v8TcVKhIQVFqWXxpSUlqUXxxYk4pTGFxTn4JkvZ4A7B4rY5CNdQITyBVlJdaEp+cn5eWmR6fmJdSlJ+ZgmxqYnJJZn5efE5mMVAHFc2FuBYsX5SLpgCH+bEARN1g4A==": 0,
    "eJyLrs7MK0nNK4l3z89PSapMtVIw1DPQUSgoSi2LLy0pSS2KT0eRKM7JL4n3y8+NT87JBGkzQBZPzEspys9MQRUsyMjPS433D8YmmpcPFa3VUcDjkMTkksz8vPii1OKSxKISurkkKDU5JzE3EWQ3FtfkZBYDVdHYMbEAhIaLTw==": 6,
    "eJzFjkEKwkAMRa8yByhSt17AnYIuRUI6EzA4k5RMKoh4dy20oNCtuH3/f/47PVicxGGrmro7bcJ61TahN7oBRmcVMKqO5lNSszrstEDMPO7aT46STDl9w/6iQrA/LlHRiT6bMJscKGYsOH4v2GSu79a/ZQZ3MsB6nadD6ch+bHV+AWKRkKw=": 0,
    "eJyLrs7MK0nNK4kPSk3OScxNLMnMz7NSMNQz0FEoKEoti09MBonE52QWA1VBJYpz8kvi/fJz45NzMkFaDZDFE/NSivIzU1AFCzLy81Lj/YOxieblQ0VrdRQIOKa0pCS1KD6xOBumtTQ3KbWI9q4CGpdZUgmXgaqGujUAVZTuoRYLAOeFmCo=": 7,
    "eJzNkEEKwjAQRa+SAxSpWw+hokuRYUwHHExmSjIVpHh3WxvEolvB7fufz+MfehYjMdiRDxjRWGXllou6cm2iK3RmlADzBdqzCoF08USpNHJQg7VG8IHHjfqdozRJuZnDaWSz/0ZFC71Xrh/m2G6vpLSL63ZOn6LoR3UInIfKH/pNR6aPl3/leHwAgfGgLg==": 4,
    "eJyLrk7NK8ksqYwvyMjPS43Py7dSMNQz0FHIzCsBSsQHoIoWFKWWxZeWlKQWxRelJuck5iaWZObnQSWLc/JL4v3yc+OTczJBeg2QxRPzUoryM1NQBSF2+gdjE83Lh4rW6iiQ68b0/PyUpMpU2rsP6hJ3FPvADklMBoVQfE5mMVAFjR0SCwB5F5rR": 4,
    "eJyLrs7MK0nNK4l3z89PSapMtVIw1DPQUSgoSi2LLy0pSS2KT0eRKM7JL4n3y8+NT87JBGkzQBYvyMjPS43Py4eK1uoo4DE9MbkkMz8vvii1uCSxqIRM44FqMksqkXRA1UOt9UvMxWZnTmYxUJocK2MBPKhnSA==": 3,
    "eJyLrs7MK0nNK4l3z89PSapMtVIw1DPQUSgoSi2LT0wuyczPiy9KLS5JLCqByhTn5JfE++XnxifnZIL0GSCLF2Tk56XG5+VDRWt1FKqBajJLKpF0QNVDrfVLzMVmZ05mMVCaPlaWlpSkFsUXJ+aUkuXHWAAMZW15": 0,
    "eJyLrk7NK8ksqYz3y8+NT87JBPKsFAz1DHQUMvNKgJx4v8TcVKhIQVFqWXxicklmfl58TmYxUBoqUZyTX4JkQLwBsnhBRn5eanxePlS0VkeBVCtLS0pSi+KLE3NKS8i0EGqwf1FiXnpqfC5QvpKqfooFAKZ+bx0=": 6,
    "eJy1j9EJwzAMRFfxAKGkvxkiHaAUoQTRithSsOVCCN29hjrg70A/7+lOx913EmPbYNQAs+eiBne99J1jsSJgxECVrJHekM0oQkKfD2Pyak0c+pavLxUC0Uo/ndvr41tEeRKEct/aApyNVcBzKrb/VPw2YFqObA4TxTNdjy9Ba24N": 0,
    "eJyLrs7MK0nNK4n3L0rMS0+Nz83PS620UjDUM9BRKChKLYtPTC7JzM+Lz8ksBiqDShTn5JfE++XnxifnZIL0GiCLF2QAjYjPy4eK1uooELKitKQktSg+sTgbprc0Nym1iEy7gGoySyrhMlDVUBcEoIpSx4OxAO5Ub8A=": 8,
    "eJyLrs7MK0nNK4n3L0rMS0+Nz83PS620UjDUM9BRKChKLYsvLSlJLYpPLM6OL8gAysXnleYmpRZBVRTn5JfE++XnxifnZIIMMUAWh6rPh4rW6ihUA9VkllTCZaCqoS4IQBUF256YXJKZnxefk1kMVEIvSyFezs8lx75YALrdc50=": 4,
    "eJy1jz0KwkAQha+yBwgSWw8RCysRGZbdiQ5sZsLO00a8uwlEiI1d2u/98S4vUbCCzuwU+17qcAj7XduEsfKTYoKYUhGfTIvgxUCdDZSKzMl2zaPmapJ/4Xg3ZTqeFvpuwv/VB8CVnAHRm387N5jvJjWZKidw3v739QMuZ3w8": 20,
    "eJy9j0EKwjAQRa+SAxSpWw9RF65EZCjJVAfSmZJ83Yh3N6URKrgT3P7/+G/m9BAFK+jImfphkDTu3HbTNm5KfKcbwIkyA6KXAmhIJqESORqos5F8lHmiXecV/QynqynT/lDTZ+Pe+q603lTZg8P6gt5DTClKLtw/xcvr+qX+XX9+AWiDgAQ=": 0,
    "eJyLrs7MK0nNK4l3z89PSapMtVIw1DPQUSgoSi2LLy0pSS2KT0eRKM7JL4n3y8+NT87JBGkzQBZPzEspys9MQRUsyMjPS433D4aK1uoo4LEyMbkkMz8vvii1uCSxqIQGdnoCqaK81JL45Py8tMx0mHYsbsjJLAbqoJoTYgGSbXqN": 11,
    "eJyLrs7MK0nNK4l3z89PSapMtVIw1DPQUSgoSi2LT0wuyczPiy9KLS5JLCqByhTn5JfE++XnxifnZIL0GSCLJ+alFOVnpqAKFmTk56XG+wdDRWt1FGB2egKporzUkvjk/Ly0zHSYdixuyMksBuoYGCeUlgCVQOSLctEUUO6UWADYnYRn": 0,
    "eJyLrs7MK0nNK4n3BFJFeakl8cn5eWmZ6fFJOYnJ2UmpRUWVVgqGegY6CgVFqWXxicklmfl58TmZxUBNUIninPySeL/83PjknEyQSQbI4gUZ+Xmp8Xn5UNFaHQXSLCwtAaqCKCnKxVRDpt1+QFn/YKp6LBYAXXNzeQ==": 18,
    "eJyLrs7MK0nNK4n3BFJFeakl8cn5eWmZ6fFJOYnJ2UmpRUWVVgqGegY6CgVFqWXxpSVAVRAlRbmYaopz8kvi/fJz45NzMkGGGiCLF2Tk56XG5+VDRWt1FGB2+wFl/YOR7UlMLsnMz4vPySwGKqC24RBP5CGLk2R2LABTxGqG": 0,
    "eJyLrs7MK0nNK4l3z89PSapMtVIw1DPQUSgoSi2LLy0pSS2KT0eRKM7JL4n3y8+NT87JBGkzQBZPzEspys9MQRUsyMjPS433D4aK1uoo4LEyMbkkMz8vvii1uCSxqISuduZkFgNVUM3KWACRdHP4": 4,
    "eJyLrs7MK0nNK4l3z89PSapMtVIw1DPQUSgoSi2LT0wuyczPiy9KLS5JLCqByhTn5JfE++XnxifnZIL0GSCLJ+alFOVnpqAKFmTk56XG+wdDRWt1FAjbmZNZDFRBHytLS0pSi+LTUSQotzIWAJGvc/g=": 1,
    "eJyLrs7MK0nNK4n3BFJFeakl8cn5eWmZ6fHlmXkp+eXFVgqGegY6CgVFqWXxicklmfl58TmZxUAdUIninPySeL/83PjknEyQMQbI4ol5KUX5mSmoggUZ+Xmp8f7B2ETz8qGitToKJDistASoBCJflIumgPYO9APK+gcPVEDFAgAHipmJ": 18,
    "eJyLrs7MK0nNK4n3BFJFeakl8cn5eWmZ6fHlmXkp+eXFVgqGegY6CgVFqWXxpSVAJRD5olw0BcU5+SXxfvm58ck5mSDjDJDFE/NSivIzU1AFCzLy81Lj/YOxieblQ0VrdRRgDvQDyvoHI7snMbkkMz8vPiezGKhgAN0BCZc8ZHFaOSMWABsvkaw=": 0,
    "eJyLrs7MK0nNK4n3yy+J9w+2UjDUM9BRKChKLYtPTC7JzM+Lz8ksBiqAShTn5IOU5sYn52SCdBkgiyfmpRTlZ6agChZk5OelAk3GJpqXDxWt1VHA7Y7SkpLUIqBaJHHaO8MTSBXlpZbEJ+fnpWWmxyflJCZnJ6UWFVUOVBDFAgAgWo9D": 13,
    "eJyLrs7MK0nNK4n3yy+J9w+2UjDUM9BRKChKLYsvLSlJLYrPQxYvzskHqcyNT87JBGkyQBZPzEspys9MQRUsyMjPSwUagE00Lx8qWqujAHOGJ5AqykstiU/Oz0vLTI9PyklMzk5KLSqqRHZaYnJJZn5efE5mMVDTIHMbJNjASopyMdXQypmxAHWWnEQ=": 0,
    "eJyLrs7MK0nNK4l3z89PSapMtVIw1DPQUSgoSi2LLy0pSS2KT0eRKM7JL4n3y8+NT87JBGkzAIvX6ijgMScxuSQzPy++KLW4JLGohHKDcjKLgSrwmxMLACuFSqY=": 4,
    "eJyLrs7MK0nNK4l3z89PSapMtVIw1DPQUSgoSi2LT0wuyczPiy9KLS5JLCqByhTn5JfE++XnxifnZIL0GYDFa3UUCBuUk1kMVEGBOaUlJalF8ekoEjjMiQUAKxRKpg==": 1,
    "eJyLrs7MK0nNK4n3BFJFeakl8cn5eWmZ6VYKhnoGOgoFRall8YnJJZn5efE5mcVAlVCJ4pz8kni//Nz45JxMkHYDZPHEvJSi/MwUVMGCjPy81Hj/YGyieflQ0VodBSIcVFoClIpPLM6GGzpQroIZOlDBFQsABfCYQg==": 11,
    "eJyLrs7MK0nNK4n3BFJFeakl8cn5eWmZ6VYKhnoGOgoFRall8aUlQKn4xOLs+IKM/LzUeP9gqGxxTn5JvF9+bnxyTibIDANk8cS8lKL8zBRUQZgB2ETz8qGitToKOFwFMxTZdYnJJZn5efE5mcVAHYPJYZBgA8sX5aIpoJUDYwHHFZ7X": 0,
    "eJyLrs7MK0nNK4n3BFJFeakl8cn5eWmZ6fGJeSlF+ZkpVgqGegY6CgVFqWXxicklmfl58TmZxUAdUIninPySeL/83PjknEyQMQbI4lAzUAULMvLzUuP9g7GJ5uVDRWt1FEhwWGkJUAlEvigXTQHtHRiZWhyfmAayeqACKxYAF9Ga3g==": 14,
    "eJyLrs7MK0nNK4n3BFJFeakl8cn5eWmZ6fGJeSlF+ZkpVgqGegY6CgVFqWXxpSVAJRD5olw0BcU5+SXxfvm58ck5mSDjDJDFoUpRBQsy8vNS4/2DsYnm5UNFa3UUYA6MTC2OT0wDWY3spsTkksz8vPiczGKgogF2CyR8ilNLSjLz0ovpFECxAFfTmV0=": 0,
    "eJzFkMEKwkAQQ39lP6BIvfoR9eBJRIZld6oD25myE70U/90KFRTEo15fEhJymETBCtqzU+x7qcMmrFdtE8bKV4oJYkpFfDYtghcDdTZQKvJItq88aq4m+R2OZ1Om7e4TVVvorQnft1wAruQMiJ782fSzUd2sJlPlBM7/+uh4B8J0ke0=": 20,
    "eJzFkEEKwjAQRa+SAxSpWw9RF65EZCjJVAfSPyUZ3RTvbsQIFboVt+8/hsecZoExjI6cqR8GSePObTdt46bEd7qZcaLMZoJLERCSSqhGjmrU6Ug+yutEu+RV/YbTVcG0P6xRaKWPxn2iurJ6Bdgbh2VX700UFCUX7/857zdhZf5V1PkJ6xWVtQ==": 0,
    "eJyLrk7NK8ksqYz3y8+NT87JBPKsFAz1DHQUMvNKgJx4v8TcVKhIQVFqWXxicklmfl58TmYxUBoqUZyTX4JkQLwBsnhBRn5eanxePlS0VkeBVCtLS0pSi+KLE3NKS8i0EGqwe35+SlIldb0TCwBbfG0D": 4,
    "eJyLrk7NK8ksqYz3y8+NT87JBPKsFAz1DHQUMvNKgJx4v8TcVKhIQVFqWXxpSUlqUXxxYk4pTGFxTn4JkvZ4A2Txgoz8vNT4vHyoaK2OQjXUYPf8/JSkShSzE5NLMvPz4nMyi4EqqG46xOXpKBIkmR4LAMOIZiI=": 1,
    "eJyLrs7MK0nNK4l3z89PSapMtVIw1DPQUSgoSi2LLy0pSS2KT0eRKM7JL4n3y8+NT87JBGkzQBYvyMjPS43Py4eK1uoo4DE9MbkkMz8vvii1uCSxqIRWxudkFgNVkGN6LAAKwmBX": 4,
    "eJyLrs7MK0nNK4l3z89PSapMtVIw1DPQUSgoSi2LT0wuyczPiy9KLS5JLCqByhTn5JfE++XnxifnZIL0GSCLF2Tk56XG5+VDRWt1FAgbn5NZDFRBddNLS0pSi+LTUSRIMj0WAAp6YFc=": 1,
    "eJyLrk7NK8ksqYz3y8+NT87JBPKsFAz1DHQUMvNKgJx4v8TcVKhIQVFqWXxicklmfl58TmYxUBoqUZyTX4JkQLwBWLxWR4FUw0tLSlKL4osTc0pLCBoNNcITSBXlpZbEJ+fnpWWmx5dn5qXklxeT6eRYADarXhE=": 12,
    "eJyLrk7NK8ksqYz3y8+NT87JBPKsFAz1DHQUMvNKgJx4v8TcVKhIQVFqWXxpSUlqUXxxYk4pTGFxTn4JkvZ4A7B4rY5CNdQITyBVlJdaEp+cn5eWmR5fnpmXkl9ejGxqYnJJZn5efE5mMVAHFc2FuBYsX5SLpgCH+bEAb0ZhXg==": 0,
    "eJyLrs7MK0nNK4l3z89PSapMtVIw1DPQUSgoSi2LLy0pSS2KT0eRKM7JL4n3y8+NT87JBGkzQBZPzEspys9MQRUsyMjPS433D8YmmpcPFa3VUcDjkMTkksz8vPii1OKSxKKSQeCSnMxioAoaOyQWADApiak=": 4,
    "eJyLrs7MK0nNK4l3z89PSapMtVIw1DPQUSgoSi2LT0wuyczPiy9KLS5JLCqByhTn5JfE++XnxifnZIL0GSCLJ+alFOVnpqAKFmTk56XG+wdjE83Lh4rW6igQdklOZjFQxUA6pLSkJLUoPh1FglYOiQUAMI2JqQ==": 1,
    "eJyLrk7NK8ksqYz3y8+NT87JBPKsFAz1DHQUMvNKgJx4v8TcVKhIQVFqWXxicklmfl58TmYxUBoqUZyTX4JkQLwBsnhiXkpRfmYKqmBBRn5earx/MFS0VkeBVHeUlpSkFsUXJ+aUllDTFVDbglKTcxJzE0Fepb3nYwElzoJK": 6,
    "eJy9j0EKwjAQRa+SAxSpWw/Rgi5FhjEdcDCZlGQilOLdTTFC3IvL//ifxz+vJMq6wBA8WMclHcx+13eGRUuAAT1VMkd6QFalCAld/hSTC9rMoW85yhQDT99wvgUhGE+VPjuzVtuRrEOPykFaKdqNgONUWv/Tvr9iutepZH+l+DP/5QW00IDG": 0,
    "eJy1kMEKwkAMRH9lP6BIvfoRVvQoEtZtwOBuUnZTQaT/bgspuCcven2ZyQxzfhErssIRQ/TJKwnv3HbTNm7I+AAfFgKRyqyyQ4misJcEIdJibT+55z4L9TUcbsII3cno1LgvsaMqZvDlblYe0xXzL/NnI+lzfS+mtlaHmv5viYqyrP0ubz/DibQ=": 7,
    "eJy1kEEKwjAQRa+SAxSpWw9hRZciQ0wHHExmSjIVpHj3tjaCwaW6ffz/efzjQKzICnt03garJLwx61VdmS7iDXpVjGDTFbqLMAL34YwxJ5IXha0EcJ7mjfqdW26jUFvCZaQ5ZPqozDAVSe+vecnpbLUr6VPJulkSPKUp8iuTgrJ847dcFj/+/JfjaQQ40Jjz": 4,
    "eJyLrs7MK0nNK4n3BFJFeakl8cn5eWmZ6VYKhnoGOgoFRall8YnJJZn5efE5mcVAlVCJ4pz8kni//Nz45JxMkHYDZPHEvJSi/MwUVMGCjPy81Hj/YKhorY4CEVaXlgCl4hOLs+HaqWk/UGNmSSVMOVQxdkehKaJhuMQCAOnBiaM=": 11,
    "eJyLrs7MK0nNK4n3BFJFeakl8cn5eWmZ6VYKhnoGOgoFRall8aUlQKn4xOLs+IKM/LzUeP9gqGxxTn5JvF9+bnxyTibIDANk8cS8lKL8zBRUQZgBUNFaHYVqoMbMkkqYcqhi7I5CUwR2XGJySWZ+XnxOZjFQxyByFyTQwPJFuWgKKHdfLACXTJdK": 0,
    "eJyLrk7NK8ksqYwvyMjPS43Py7dSMNQz0FHIzCsBSsQHoIoWFKWWxZeWlKQWxRelJuck5iaWZObnQSWLc/JL4v3yc+OTczJBeg2QxRPzUoryM1NQBSF2+gdjE83Lh4rW6iiQ68b0/PyUpMrUQei+xGRQwAEDsbgksaiExg6MBQCipaM7": 0,
    "eJyLrk7NK8ksqYz3y8+NT87JBPKsFAz1DHQUMvNKgJx4v8TcVKhIQVFqWXxicklmfl58TmYxUBoqUZyTX4JkQLwBsnhiXkpRfmYKqmBBRn5earx/MFS0VkeBVHeUlpSkFsUXJ+aUllDTFVDb3PPzU5Iq6eDxWAD8zoCk": 4,
    "eJyLrk7NK8ksqYz3y8+NT87JBPKsFAz1DHQUMvNKgJx4v8TcVKhIQVFqWXxpSUlqUXxxYk4pTGFxTn4JkvZ4A2TxxLyUovzMFFTBgoz8vNR4/2CoaK2OQjXUNvf8/JSkShQLE5NLMvPz4nMyi4Eq6GMlxI/pKBKUWxkLALfQecM=": 1,
    "eJy1kMEKwkAMRH9lP6BIvfoHXurBo0hIt1GD26RkU6GI/+4e9lCPgp6GeQOZIacnibMv0OkIMXFxu7DdtE1g8WKgw5EqmYwegNFZBRLnEtcgJ/XVAWjXHGUw5eETTjcVgsOx0lcTvt0xu5NBxjT7L1fUtn0RE3KIKhe+Qp8w3nsyW/7/i/Mbe3mIeQ==": 13,
    "eJzFkMEKwjAQRH8lH1CkXv0DL/XgUWRJ01UXk03ZbIVS/HeDRoh49OBpmccMO8xhQVbSGboYwHnKamPWq7YxxJoFdDZgIaPgDSZVFEjWT29j8lGrOLQ1tzxIpOETjpfICLt9offGLOXbNh9hVHCRT3SG3lt37VFkrjtYpxQZPKUc+luL1xJPi4Rvz++Fjg89JI3y": 0,
    "eJyLrk7NK8ksqYz3y8+NT87JBPKsFAz1DHQUMvNKgJx4v8TcVKhIQVFqWXxicklmfl58TmYxUBoqUZyTX4JkQLwBsnhiXkpRfmYKqmBBRn5earx/MFS0VkeBVHeUlpSkFsUXJ+aUllDTFVDbPIFUUV5qSXxyfl5aZjpMO+0DIhYAyJaHOQ==": 11,
    "eJyLrk7NK8ksqYz3y8+NT87JBPKsFAz1DHQUMvNKgJx4v8TcVKhIQVFqWXxpSUlqUXxxYk4pTGFxTn4JkvZ4A2TxxLyUovzMFFTBgoz8vNR4/2CoaK2OQjXUNk8gVZSXWhKfnJ+XlpkO047sgMTkksz8vPiczGKgjoFxAiQMwPJFuWgKKHdKLADmhYoy": 0,
    "eJyLrk7NK8ksqYz3y8+NT87JBPKsFAz1DHQUMvNKgJx4v8TcVKhIQVFqWXxicklmfl58TmYxUBoqUZyTX4JkQLwBWLxWR4FUw0tLSlKL4osTc0pLqG00Ce6OBQColV5D": 3,
    "eJyLrk7NK8ksqYz3y8+NT87JBPKsFAz1DHQUMvNKgJx4v8TcVKhIQVFqWXxpSUlqUXxxYk4pTGFxTn4JkvZ4A7B4rY4CqUYnJpdk5ufF52QWA6WpbTjR7o4FAOr4XZM=": 0,
    "eJzFkEEKg0AMRa8yB5CiWw+hC5ciIWhoAzOJzMSCFO/eWczCQjcuSpf/PQiPjC8SY9uh0wCz57xa19zqyrFYHtBhoELWSE/A2VgFPKesi0he7XQA6jNHWaLy8gnXhwpBP3yjooUelbtat5lRhIR+s9+3lYY+otwJQvb7vz41vQER9phv": 6,
    "eJzFkEEKwkAMRa8yByhStx6iXbgUCbENGpxJykwqlOLdHXAKI7gVl//lf3jktJIY2wKdBhg853Rw+13bOBbLAToMVMgU6QGzGUVI6OetmLxaNYe25ihjVB4/4XRTIeiP36hooc/GrcWhjyhXgpDvS+2Cg7EKeE659neb92cw3bftHC4Uf6x1fgHIgJdf": 0,
    "eJyLrs7MK0nNK4n3L0rMS0+Nz83PS620UjDUM9BRKChKLYtPTC7JzM+Lz8ksBiqDShTn5JfE++XnxifnZIL0GiCLJ+alFOVnpqAKFmQAzY33D8YmmpcPFa3VUSDkmtKSktSi+MTibJje0tyk1CLaOwtoXGZJJVwGqhrq2ABUUboHWywAb82ZEg==": 8,
    "eJzNkEEKwjAQRa+SAxSpWw9hBZciQ2wHHUxmymQqlOLdjTaIBbeC2/c/n8c/TMSGbNCo5zNCFMZx49arunK94g0GM1Tw6Qr9JWfAQzyhlkYKYrCVCG2g50j9yT13KtQt4TzS7L9RlkLvlZvyHNn4Tkq7yO6W9CXqWyNhCJRy5Q/95iMl/ljt+ABy2Jzv": 4,
    "eJyLrs7MK0nNK4l3z89PSapMtVIw1DPQUSgoSi2LLy0pSS2KT0eRKM7JL4n3y8+NT87JBGkzQBZPzEspys9MQRUsyMjPS433D4aK1uoo4LEyMbkkMz8vvii1uCSxqIQGdgalJuck5iaCbMFib05mMVAV1ayNBQCHtXWe": 6,
    "eJy9zUEKAjEMheGr9ACDjFsv4E5BlyIh0wYMtsmQZgQR764DFRRcits/eXyHG4uTOKxV03ClVVgu+i6MRhfA6KwCRtXRvF1qVoeNFoiZ513/3lGSKafPOJ5UCLb7Vu9deJk7ihkLzsoXN3N9fv2PndzJAOu5TWUqA9nP/OMDLDR6+w==": 0,
    "eJyLrk7NK8ksqYz3y8+NT87JBPKsFAz1DHQUMvNKgJx4v8TcVKhIQVFqWXxicklmfl58TmYxUBoqUZyTX4JkQLwBsnhiXkpRfmYKqmBBRn5earx/MDbRvHyoaK2OAqmuKy0pSS2KL07MKS2hvdugbnDPz09JqhywQIoFAOK8llU=": 4,
    "eJyLrk7NK8ksqYz3y8+NT87JBPKsFAz1DHQUMvNKgJx4v8TcVKhIQVFqWXxpSUlqUXxxYk4pTGFxTn4JkvZ4A2TxxLyUovzMFFTBgoz8vNR4/2Bsonn5UNFaHYVqqBvc8/NTkipRnJGYXJKZnxefk1kMVDGQDoGERzqKBK0cEgsA1ROPdA==": 1,
    "eJydjcEKwjAQRH8lH1CkXv0DL+JdZKjp2i7E3ZKsllL8dyNEUOjFngbeMPNOM4mxTRh6FYLozm03deVYLBc4/tIh0gN3M4roVNvLRKVIQQ0HvcEHfu/qb/65LvRZuf+ljTdWQaRkTbSV1vK/zxGFDF7lyh1GllbHtKALnPJije38Atl3dv4=": 12,
    "eJy1jUsKwkAQRK8yBwgSt97AjbgXKcLYasOkO/S0Bgne3RFHUHHjwlVBvfpsJhJnv2A4qhBEF2E+a5vA4gVg/e4ORmd00VkFRtk780pyUsdKe8TE92L76j+3q3ttwlT3l0VMyBFV9nzAyLLTMX+5S5xL4+9vJy+RB7f+I/DT6/YGfNd5OA==": 0,
    "eJyLrs7MK0nNK4n3BFJFeakl8cn5eWmZ6fGJeSlF+ZkpVgqGegY6CgVFqWXxicklmfl58TmZxUAdUIninPySeL/83PjknEyQMQbI4lAzUAULMvLzUuP9g7GJ5uVDRWt1FEhwWGkJUAlEvigXTQHtHegHlPUPHqiAigUAb3qZCw==": 18,
    "eJyLrs7MK0nNK4n3BFJFeakl8cn5eWmZ6fGJeSlF+ZkpVgqGegY6CgVFqWXxpSVAJRD5olw0BcU5+SXxfvm58ck5mSDjDJDFoUpRBQsy8vNS4/2DsYnm5UNFa3UUYA70A8r6ByO7JzG5JDM/Lz4nsxioYADdAQmXPGRxWjkjFgCcCJFY": 0,
    "eJyLrs7MK0nNK4n3yy+J9w+2UjDUM9BRKChKLYtPTC7JzM+Lz8ksBiqAShTn5IOU5sYn52SCdBkgiyfmpRTlZ6agChZk5OelAk3GJpqXDxWt1VHA7Y7SkpLUIqBaJHHaO8MTSBXlpZbEJ+fnpWWmx5dn5qXklxcPVPjEAgBnxY4t": 12,
    "eJyLrs7MK0nNK4n3yy+J9w+2UjDUM9BRKChKLYsvLSlJLYrPQxYvzskHqcyNT87JBGkyQBZPzEspys9MQRUsyMjPSwUagE00Lx8qWqujAHOGJ5AqykstiU/Oz0vLTI8vz8xLyS8vRnZXYnJJZn5efE5mMVDHYHIYJMDA8kW5aApo5cBYANvqmQI=": 0,
    "eJyLrs7MK0nNK4l3z89PSapMtVIw1DPQUSgoSi2LLy0pSS2KT0eRKM7JL4n3y8+NT87JBGkzQBZPzEspys9MQRUsyMjPS433D8YmmpcPFa3VUcDjkMTkksz8vPii1OKSxKISurnEE0gV5aWWxCfn56VlpsMMxeKynMxioA4aOywWAKlfkD4=": 11,
    "eJyLrs7MK0nNK4l3z89PSapMtVIw1DPQUSgoSi2LT0wuyczPiy9KLS5JLCqByhTn5JfE++XnxifnZIL0GSCLJ+alFOVnpqAKFmTk56XG+wdjE83Lh4rW6ijAXOIJpIryUkvik/Pz0jLTYYZicVlOZjFQx2ByWGkJUAlEvigXTQGtHBgLAEDPmhg=": 0,
    "eJyLrs7MK0nNK4n3BFJFeakl8cn5eWmZ6fFJOYnJ2UmpRUWVVgqGegY6CgVFqWXxicklmfl58TmZxUBNUIninPySeL/83PjknEyQSQbI4ol5KUX5mSmoggUZ+Xmp8f7B2ETz8qGitToKpLmttASoCqKkKBdTDe2d6QeU9Q8eqOCKBQDMI5zL": 18,
    "eJzFkEEKwkAMAL+yDyhSr/7AS3voUSRst1GD26SkURDx765UYUu9iqfAZAhDdndiQzbYpqGMBkH4QEdoow/nFlVvG7delYUbFK9wsWRNivZLZ4xiUEkPIdLraJlzz50KdXM4nIQR6uYbZXnTR+E+mVXa1k2e5IORMEQak/DHjuk1nPNfZeyf1cST2A==": 0,
    "eJyLrs7MK0nNK4n3yy+J9w+2UjDUM9BRKChKLYtPTC7JzM+Lz8ksBiqAShTn5IOU5sYn52SCdBkgiyfmpRTlZ6agChZk5OelAk3GJpqXDxWt1VHA7Y7SkpLUIqBaJHHaO8MTSBXlpZbEJ+fnpWWmwwwdqPCJBQBTSo4D": 11,
    "eJyLrs7MK0nNK4n3yy+J9w+2UjDUM9BRKChKLYsvLSlJLYrPQxYvzskHqcyNT87JBGkyQBZPzEspys9MQRUsyMjPSwUagE00Lx8qWqujAHOGJ5AqykstiU/Oz0vLTIcZiuyuxOSSzPy8+JzMYqCOweQwSICB5Yty0RTQyoGxAIbZmIQ=": 0,
    "eJy1jk0Kg0AMRq8yB5Bit71Ad7pwKSVMnWADYyKZtCCld1dhFgrSndv3/fDaL7EhG9xFwnPCm7teysKNih94m6FCvwtSFINKBugirbNyyz0HFQp7OL6EEermiLJk+ivcHxHfGQmDYjKvdr7Jckc2bc5zPxtWfjjSi5SW+GS7xwzPM5Ca": 3,
    "eJyLrs7MK0nNK4l3z89PSapMtVIw1DPQUSgoSi2LT0wuyczPiy9KLS5JLCqByhTn5JfE++XnxifnZIL0GSCLJ+alFOVnpqAKFmTk56XG+wdjE83Lh4rW6ihUA43LLKlEMhyqHupCv8RcbM7LySwGSg8615WWlKQWxRcn5pTSOuRiAb6llss=": 0,
    "eJyLrk7NK8ksqYz3y8+NT87JBPKsFAz1DHQUMvNKgJx4v8TcVKhIQVFqWXxicklmfl58TmYxUBoqUZyTX4JkQLwBsnhiXkpRfmYKqmBBRn5earx/MFS0VkeBVHeUlpSkFsUXJ+aUlgygK2gTGrEA3ZCHlQ==": 3,
    "eJyLrk7NK8ksqYz3y8+NT87JBPKsFAz1DHQUMvNKgJx4v8TcVKhIQVFqWXxpSUlqUXxxYk4pTGFxTn4JkvZ4A2TxxLyUovzMFFTBgoz8vNR4/2CoaK2OAqmuSEwuyczPi8/JLAZKD6A7aBEasQDJR4bl": 0,
    "eJyLrk7NK8ksqYwvyMjPS43Py7dSMNQz0FHIzCsBSsQHoIoWFKWWxZeWlKQWxafn56ckVaZCJYpz8kvi/fJz45NzMkH6DJDFYUZDRWt1FEi3NDG5JDM/L74otbgksaiEMlsROlDt9UvMTcViZ05mMVCaHCtjAag2dzA=": 3,
    "eJyLrk7NK8ksqYwvyMjPS43Py7dSMNQz0FHIzCsBSsQHoIoWFKWWxScml2Tm58UXpRaXJBaVQGWKc/JL4v3yc+OTczJBGg2QxWFmQ0VrdRRgtiJ0oNrrl5ibisXOnMxioDR9rCwtKUktii9OzCkly4+xAIU8dW0=": 0,
    "eJyLzivNydFRqC7OyS+J98vPjU/OyUzNK4k3sFIw1DOoBcpk5pWABDyBVFFeakl8cn5eWmZ6fFJOYnJ2UmpRUSVYpY5CQVFqWXxicklmfl58TmYxUBNUAofRsQDYYyu/": 13,
    "eJyLri7OyS+J98vPjU/OyUzNK4k3sFIw1DOo1VGozswrAQl4AqmivNSS+OT8vLTM9PiknMTk7KTUoqJKsEodhYKi1LL4xOSSzPy8+JzMYqAmqASVjC4tAaqCKCnKxVSDw5ZYADDoTrM=": 0,
    "eJyLrk7NK8ksqYz3y8+NT87JBPKsFAz1DHQUMvNKgJx4v8TcVKhIQVFqWXxicklmfl58TmYxUBoqUZyTX4JkQLwBsnhiXkpRfmYKqmBBRn5earx/MDbRvHyoaK2OAqmuKy0pSS2KL07MKS2hvdugbghKTc5JzE0EBctABVQsAGnYl/s=": 6,
    "eJzFkEEKwjAQRa+SAxSpWw9RQZciw5gOGExmSjIRSvHuRkwhgltx+R//w+OfFmJ1OsMgAax3Je3MdtN3xrGWAAMGqmSKdIesShES+rwWkxdt5tC3HHmM4sZPOF2FCfbHb5Sl0kdnlupwIOsxoDrhVgXti4B3qbT+LfP+BdNtneZwofhjq/MTaaGWdw==": 0,
    "eJy1kLEKAjEQRH8lH3DI2foHNmdhKTKEZNWF3O6R7HmI+O+mSHGWglbDvIGdYU9PEmN7YNARIXF1O7fd9J1jsWow+JEamTLd4YOxChKXGregJLXVAfRr7iVm5fgJp5sK4XBs9NW5b3fMZpRRfJrtlyta275KFjIElQtfsbBEXcr/H3F+A9l1h2M=": 12,
    "eJzFkEEKAjEMRa/SAwwybr2Bm3HhUiSUNmqgTYY24yCDd7doherWhavwX/4nnxwWZCW9wSARXKCiNma96jtDrEXAYCNWMia8wqSKCbIN09uYg2gTh77lln0S8p9wvAgj7PaV3juz1GvbMhKjghM+0RlmYi9zbgtYpyQMgXJJ/KfC6wfPfYpfht+rHB8tNYqw": 0
  }
}