{
  "rasa_nlu_data": {
    "common_examples": [
      {
        "intent": "Salutations",
        "text": "salut"
      },
      {
        "intent": "Salutations",
        "text": "bonjour"
      },
      {
        "intent": "Salutations",
        "text": "bonsoir"
      },
      {
        "intent": "Salutations",
        "text": "hello"
      },
      {
        "intent": "Salutations",
        "text": "bonjour bot"
      },
      {
        "intent": "Salutations",
        "text": "Hi"
      },
      {
        "intent": "Salutations",
        "text": "Salam"
      },
      {
        "intent": "Salutations",
        "text": "Comment vas-tu"
      },
      {
        "intent": "Salutations",
        "text": "HoHé"
      },
      {
        "intent": "Salutations",
        "text": "Qui-etes-vous"
      },
      {
        "intent": "Salutations",
        "text": "C'est qui"
      },
      {
        "intent": "Salutations",
        "text": "yangui ci diam"
      },
      {
        "intent": "Salutations",
        "text": "naka biss bi"
      },
      {
        "intent": "Salutations",
        "text": "naka souba si"
      },
      {
        "intent": "Salutations",
        "text": "ci lo nek"
      },
      {
        "intent": "Salutations",
        "text": "comment est ta journée"
      },
      {
        "intent": "Salutations",
        "text": "as tu bien dormi"
      },
      {
        "intent": "Salutations",
        "text": "Ca va"
      },
      {
        "intent": "Salutations",
        "text": "Tu vas bien"
      },
      {
        "intent": "Salutations",
        "text": "Hey"
      },
      {
        "intent": "Salutations",
        "text": "Bonjour!"
      },
      {
        "intent": "Salutations",
        "text": "Salut"
      },
      {
        "intent": "Salutations",
        "text": "Salut, Comment ca va?"
      },
      {
        "intent": "Salutations",
        "text": "Bien"
      },
      {
        "intent": "Salutations",
        "text": "Salut, Comment ca va?"
      },
      {
        "intent": "Salutations",
        "text": "Très bien, merci"
      },
      {
        "intent": "Salutations",
        "text": "Bonjour, Comment ca va?"
      },
      {
        "intent": "Salutations",
        "text": "Okay"
      },
      {
        "intent": "Salutations",
        "text": "Génial"
      },
      {
        "intent": "Salutations",
        "text": "Ca pourrait aller mieux"
      },
      {
        "intent": "Salutations",
        "text": "Comme ci, Comme ca"
      },
      {
        "intent": "Salutations",
        "text": "Salut, Comment vas-tu?"
      },
      {
        "intent": "Salutations",
        "text": "bien"
      },
      {
        "intent": "Salutations",
        "text": "Très bien, merci"
      },
      {
        "intent": "Salutations",
        "text": "Bonjour, Comment vas-tu?"
      },
      {
        "intent": "Salutations",
        "text": "Okay"
      },
      {
        "intent": "Salutations",
        "text": "Ca pourrait aller mieux"
      },
      {
        "intent": "Salutations",
        "text": "Comment vas-tu?"
      },
      {
        "intent": "Salutations",
        "text": "Je vais bien, et vous?"
      },
      {
        "intent": "Salutations",
        "text": "Je vais bien, et toi?"
      },
      {
        "intent": "Salutations",
        "text": "Salut, content de te connaitre."
      },
      {
        "intent": "Salutations",
        "text": "Quoi de neuf?"
      },
      {
        "intent": "Salutations",
        "text": "Rien de nouveau."
      },
      {
        "intent": "Salutations",
        "text": "Rien de nouveau, et de ton coté?"
      },
      {
        "intent": "Salutations",
        "text": "Rien de nouveau, et toi?"
      },
      {
        "intent": "Salutations",
        "text": "Rien de special."
      },
      {
        "intent": "Salutations",
        "text": "Tout baigne."
      },
      {
        "intent": "Salutations",
        "text": "Le chiffre avant 10, sinon, toi, quoi de neuf?"
      },
      {
        "intent": "Name",
        "entities": [
          {
            "start": 6,
            "end": 16,
            "value": "Isaac Paul",
            "entity": "Nom_client"
          }
        ],
        "text": "C'est Isaac Paul"
      },
      {
        "intent": "Name",
        "entities": [
          {
            "start": 0,
            "end": 11,
            "value": "Bright Aboh",
            "entity": "Nom_client"
          }
        ],
        "text": "Bright Aboh"
      },
      {
        "intent": "Name",
        "entities": [
          {
            "start": 14,
            "end": 22,
            "value": "Ibrahima",
            "entity": "Nom_client"
          }
        ],
        "text": "mon nom c'est Ibrahima"
      },
      {
        "intent": "Name",
        "entities": [
          {
            "start": 0,
            "end": 11,
            "value": "Abdul-Karim",
            "entity": "Nom_client"
          }
        ],
        "text": "Abdul-Karim"
      },
      {
        "intent": "Name",
        "entities": [
          {
            "start": 0,
            "end": 13,
            "value": "Aissatou Sarr",
            "entity": "Nom_client"
          }
        ],
        "text": "Aissatou Sarr"
      },
      {
        "intent": "Name",
        "entities": [
          {
            "start": 6,
            "end": 17,
            "value": "Khadidjatou",
            "entity": "Nom_client"
          }
        ],
        "text": "c'est Khadidjatou"
      },
      {
        "intent": "Name",
        "entities": [
          {
            "start": 12,
            "end": 25,
            "value": "Ibrahima Diaw",
            "entity": "Nom_client"
          }
        ],
        "text": "Mon nom est Ibrahima Diaw"
      },
      {
        "intent": "Name",
        "entities": [
          {
            "start": 0,
            "end": 29,
            "value": "Mory Moussou Koulibaly Traore",
            "entity": "Nom_client"
          }
        ],
        "text": "Mory Moussou Koulibaly Traore"
      },
      {
        "intent": "Name",
        "entities": [
          {
            "start": 0,
            "end": 7,
            "value": "Sandene",
            "entity": "Nom_client"
          }
        ],
        "text": "Sandene"
      },
      {
        "intent": "Name",
        "entities": [
          {
            "start": 6,
            "end": 12,
            "value": "mariam",
            "entity": "Nom_client"
          }
        ],
        "text": "c'est mariam"
      },
      {
        "intent": "Name",
        "entities": [
          {
            "start": 0,
            "end": 5,
            "value": "isaac",
            "entity": "Nom_client"
          }
        ],
        "text": "isaac"
      },
      {
        "intent": "Name",
        "entities": [
          {
            "start": 12,
            "end": 21,
            "value": "abdullahi",
            "entity": "Nom_client"
          }
        ],
        "text": "mon nom est abdullahi"
      },
      {
        "intent": "Name",
        "entities": [
          {
            "start": 13,
            "end": 19,
            "value": "cedric",
            "entity": "Nom_client"
          }
        ],
        "text": "je m'appelle cedric"
      },
      {
        "intent": "Name",
        "entities": [
          {
            "start": 13,
            "end": 24,
            "value": "Cheirk Ndao",
            "entity": "Nom_client"
          }
        ],
        "text": "Je m'appelle Cheirk Ndao"
      },
      {
        "intent": "Name",
        "entities": [
          {
            "start": 0,
            "end": 8,
            "value": "Aissatou",
            "entity": "Nom_client"
          }
        ],
        "text": "Aissatou"
      },
      {
        "intent": "Name",
        "entities": [
          {
            "start": 13,
            "end": 19,
            "value": "Hadija",
            "entity": "Nom_client"
          }
        ],
        "text": "je m'appelle Hadija"
      },
      {
        "intent": "Name",
        "entities": [
          {
            "start": 13,
            "end": 24,
            "value": "Khadidjatou",
            "entity": "Nom_client"
          }
        ],
        "text": "Je m'appelle Khadidjatou"
      },
      {
        "intent": "Name",
        "entities": [
          {
            "start": 0,
            "end": 6,
            "value": "Bright",
            "entity": "Nom_client"
          }
        ],
        "text": "Bright"
      },
      {
        "intent": "Name",
        "entities": [
          {
            "start": 0,
            "end": 5,
            "value": "Isaac",
            "entity": "Nom_client"
          }
        ],
        "text": "Isaac"
      },
      {
        "intent": "Name",
        "entities": [
          {
            "start": 0,
            "end": 6,
            "value": "hadija",
            "entity": "Nom_client"
          }
        ],
        "text": "hadija"
      },
      {
        "intent": "Name",
        "entities": [
          {
            "start": 0,
            "end": 4,
            "value": "John",
            "entity": "Nom_client"
          }
        ],
        "text": "John"
      },
      {
        "intent": "Name",
        "entities": [
          {
            "start": 0,
            "end": 6,
            "value": "Bathie",
            "entity": "Nom_client"
          }
        ],
        "text": "Bathie"
      },
      {
        "intent": "Name",
        "entities": [
          {
            "start": 0,
            "end": 5,
            "value": "Samba",
            "entity": "Nom_client"
          }
        ],
        "text": "Samba"
      },
      {
        "intent": "Name",
        "entities": [
          {
            "start": 0,
            "end": 5,
            "value": "Dioup",
            "entity": "Nom_client"
          }
        ],
        "text": "Dioup"
      },
      {
        "intent": "Name",
        "entities": [
          {
            "start": 0,
            "end": 5,
            "value": "Naing",
            "entity": "Nom_client"
          }
        ],
        "text": "Naing"
      },
      {
        "intent": "Name",
        "entities": [
          {
            "start": 0,
            "end": 4,
            "value": "Ndao",
            "entity": "Nom_client"
          }
        ],
        "text": "Ndao"
      },
      {
        "intent": "Name",
        "entities": [
          {
            "start": 0,
            "end": 9,
            "value": "Nafisatou",
            "entity": "Nom_client"
          }
        ],
        "text": "Nafisatou"
      },
      {
        "intent": "Name",
        "entities": [
          {
            "start": 0,
            "end": 4,
            "value": "name",
            "entity": "Nom_client"
          }
        ],
        "text": "name"
      },
      {
        "intent": "Name",
        "entities": [
          {
            "start": 6,
            "end": 10,
            "value": "name",
            "entity": "Nom_client"
          }
        ],
        "text": "c'est name"
      },
      {
        "intent": "Name",
        "entities": [
          {
            "start": 12,
            "end": 16,
            "value": "name",
            "entity": "Nom_client"
          }
        ],
        "text": "Mon nom est name"
      },
      {
        "intent": "Name",
        "entities": [
          {
            "start": 12,
            "end": 16,
            "value": "name",
            "entity": "Nom_client"
          }
        ],
        "text": "mon nim est name"
      },
      {
        "intent": "Name",
        "entities": [
          {
            "start": 13,
            "end": 17,
            "value": "name",
            "entity": "Nom_client"
          }
        ],
        "text": "Je m'appelle name"
      },
      {
        "intent": "Name",
        "entities": [
          {
            "start": 13,
            "end": 17,
            "value": "name",
            "entity": "Nom_client"
          }
        ],
        "text": "je m'appelle name"
      },
      {
        "intent": "Name",
        "entities": [
          {
            "start": 14,
            "end": 18,
            "value": "name",
            "entity": "Nom_client"
          }
        ],
        "text": "Mon nom c'est name"
      },
      {
        "intent": "Name",
        "entities": [
          {
            "start": 5,
            "end": 9,
            "value": "name",
            "entity": "Nom_client"
          }
        ],
        "text": "cest name"
      },
      {
        "intent": "Phone_no",
        "entities": [
          {
            "start": 15,
            "end": 24,
            "value": "773846441",
            "entity": "phone_no"
          }
        ],
        "text": "Mon numero est 773846441"
      },
      {
        "intent": "Phone_no",
        "entities": [
          {
            "start": 16,
            "end": 25,
            "value": "773846723",
            "entity": "phone_no"
          }
        ],
        "text": "Mon numero c'est773846723"
      },
      {
        "intent": "Phone_no",
        "entities": [
          {
            "start": 0,
            "end": 13,
            "value": "+221773846441",
            "entity": "phone_no"
          }
        ],
        "text": "+221773846441"
      },
      {
        "intent": "Phone_no",
        "entities": [
          {
            "start": 6,
            "end": 19,
            "value": "+221777957319",
            "entity": "phone_no"
          }
        ],
        "text": "c'est +221777957319"
      },
      {
        "intent": "Phone_no",
        "entities": [
          {
            "start": 0,
            "end": 13,
            "value": "+221777957319",
            "entity": "phone_no"
          }
        ],
        "text": "+221777957319"
      },
      {
        "intent": "Phone_no",
        "entities": [
          {
            "start": 17,
            "end": 26,
            "value": "777957319",
            "entity": "phone_no"
          }
        ],
        "text": "C'est mon numero 777957319"
      },
      {
        "intent": "Phone_no",
        "entities": [
          {
            "start": 19,
            "end": 32,
            "value": "+221774534567",
            "entity": "phone_no"
          }
        ],
        "text": "prendre mon numero +221774534567"
      },
      {
        "intent": "Phone_no",
        "entities": [
          {
            "start": 0,
            "end": 13,
            "value": "+221774534567",
            "entity": "phone_no"
          }
        ],
        "text": "+221774534567"
      },
      {
        "intent": "Phone_no",
        "entities": [
          {
            "start": 11,
            "end": 20,
            "value": "774534567",
            "entity": "phone_no"
          }
        ],
        "text": "mon numero 774534567"
      },
      {
        "intent": "Phone_no",
        "entities": [
          {
            "start": 11,
            "end": 16,
            "value": "phone",
            "entity": "phone_no"
          }
        ],
        "text": "mon numero phone"
      },
      {
        "intent": "Goodbye",
        "text": "au revoir"
      },
      {
        "intent": "Goodbye",
        "text": "merci beaucoup, ça marche maintenant"
      },
      {
        "intent": "Goodbye",
        "text": "merci"
      },
      {
        "intent": "Goodbye",
        "text": "A plus"
      },
      {
        "intent": "Goodbye",
        "text": "A la prochaine"
      },
      {
        "intent": "Goodbye",
        "text": "ça marche"
      },
      {
        "intent": "Goodbye",
        "text": "C'est bon"
      },
      {
        "intent": "Goodbye",
        "text": "Bye Bye"
      },
      {
        "intent": "Goodbye",
        "text": "à bientot"
      },
      {
        "intent": "Goodbye",
        "text": "à plus tard"
      },
      {
        "intent": "Goodbye",
        "text": "Merci. Moi aussi."
      },
      {
        "intent": "Goodbye",
        "text": "Un plaisir de te connaitre."
      },
      {
        "intent": "Goodbye",
        "text": "Merci. Plaisir partagé."
      },
      {
        "intent": "Goodbye",
        "text": "Passe une bonne journée"
      },
      {
        "intent": "Goodbye",
        "text": "Merci, toi aussi."
      },
      {
        "intent": "Goodbye",
        "text": "Au revoir"
      },
      {
        "intent": "Goodbye",
        "text": "Enchantée."
      },
      {
        "intent": "Yes_affirm",
        "text": "oui c'est ça"
      },
      {
        "intent": "Yes_affirm",
        "text": "c'est ça"
      },
      {
        "intent": "Yes_affirm",
        "text": "Je panse que c'est tellement"
      },
      {
        "intent": "Yes_affirm",
        "text": "oui"
      },
      {
        "intent": "Yes_affirm",
        "text": "Oui"
      },
      {
        "intent": "Yes_affirm",
        "text": "c'est tellement"
      },
      {
        "intent": "Yes_affirm",
        "text": "Oui exactement"
      },
      {
        "intent": "Yes_affirm",
        "text": "Oui c'est correct"
      },
      {
        "intent": "Yes_affirm",
        "text": "c'est exact"
      },
      {
        "intent": "Yes_affirm",
        "text": "exactement"
      },
      {
        "intent": "Yes_affirm",
        "text": "Je crois que c'est tellement"
      },
      {
        "intent": "Yes_affirm",
        "text": "c'est correct"
      },
      {
        "intent": "Yes_affirm",
        "text": "c'est vrai"
      },
      {
        "intent": "Yes_affirm",
        "text": "Oui c'est vrai"
      },
      {
        "intent": "Yes_affirm",
        "text": "oui exactement"
      },
      {
        "intent": "Not_OS",
        "text": "Ce n'est pas ainsi"
      },
      {
        "intent": "Not_OS",
        "text": "Non, ce n'est pas que"
      },
      {
        "intent": "Not_OS",
        "text": "non ce n'est pas"
      },
      {
        "intent": "Not_OS",
        "text": "non ce n'est pas vrai"
      },
      {
        "intent": "Not_OS",
        "text": "ce n'est pas vrai"
      },
      {
        "intent": "Not_OS",
        "text": "Ce n'est pas correct"
      },
      {
        "intent": "Not_OS",
        "text": "non je ne pense pas"
      },
      {
        "intent": "Not_OS",
        "text": "non je ne le crois pas"
      },
      {
        "intent": "Not_OS",
        "text": "Je ne le crois pas"
      },
      {
        "intent": "Not_OS",
        "text": "je ne pense pas"
      },
      {
        "intent": "Not_OS",
        "text": "non pas vrai"
      },
      {
        "intent": "Not_OS",
        "text": "non pas correct"
      },
      {
        "intent": "Not_OS",
        "text": "non pas exact"
      },
      {
        "intent": "Not_OS",
        "text": "Non"
      },
      {
        "intent": "Not_OS",
        "text": "non"
      },
      {
        "intent": "Not_OS",
        "text": "ce n'est pas"
      },
      {
        "intent": "Not_connected",
        "text": "Je n'ai toujours pas de connexion"
      },
      {
        "intent": "Not_connected",
        "text": "Je ne suis pas connecté"
      },
      {
        "intent": "Not_connected",
        "text": "toujours pas de connexion"
      },
      {
        "intent": "Not_connected",
        "text": "ça ne marche pas"
      },
      {
        "intent": "Not_connected",
        "text": "il a refusé de se connecter"
      },
      {
        "intent": "Not_connected",
        "text": "je n'ai pas encore la connexion"
      },
      {
        "intent": "Not_connected",
        "text": "pas connecté"
      },
      {
        "intent": "Not_connected",
        "text": "non pas connecté"
      },
      {
        "intent": "Not_connected",
        "text": "pas encore"
      },
      {
        "intent": "Not_connected",
        "text": "pas encore connecté"
      },
      {
        "intent": "Not_connected",
        "text": "je n'ai pas encore de connexion"
      },
      {
        "intent": "Not_connected",
        "text": "il n'a pas commencé à fonctionner"
      },
      {
        "intent": "Not_connected",
        "text": "ne fonctionne pas"
      },
      {
        "intent": "Not_connected",
        "text": "ne fonctionne pas encore"
      },
      {
        "intent": "Not_connected",
        "text": "ça n'a pas marché"
      },
      {
        "intent": "Not_connected",
        "text": "je ne peux pas le voir fonctionner"
      },
      {
        "intent": "Not_connected",
        "text": "je ne peux pas le voir naviguer"
      },
      {
        "intent": "Not_connected",
        "text": "je ne peux pas le voir se connecter"
      },
      {
        "intent": "Not_connected",
        "text": "mon téléphone ne navigue toujours pas"
      },
      {
        "intent": "Not_connected",
        "text": "mon téléphone n'est toujours pas connecté a internet"
      },
      {
        "intent": "Not_connected",
        "text": "il est connecté à internet"
      },
      {
        "intent": "Not_connected",
        "text": "pas encore naviguer sur internet"
      },
      {
        "intent": "Not_connected",
        "text": "pas encore parcouru"
      },
      {
        "intent": "Browsing_success",
        "text": "oui maintenant je peux naviguer sur mon téléphone"
      },
      {
        "intent": "Browsing_success",
        "text": "oui navigue"
      },
      {
        "intent": "Browsing_success",
        "text": "oui c'est réussi"
      },
      {
        "intent": "Browsing_success",
        "text": "oui c'est marché maintenant"
      },
      {
        "intent": "Browsing_success",
        "text": "oui ça marche maintenant"
      },
      {
        "intent": "Browsing_success",
        "text": "oui il navigue maintenant"
      },
      {
        "intent": "Browsing_success",
        "text": "oui il est maintenant connecté"
      },
      {
        "intent": "Browsing_success",
        "text": "J'ai maintenant une connexion sur mon téléphone"
      },
      {
        "intent": "Browsing_success",
        "text": "Mon portable est connecté"
      },
      {
        "intent": "Browsing_success",
        "text": "mon téléphone est maintenant connecté"
      },
      {
        "intent": "Browsing_success",
        "text": "mon portable est maintenant connecté"
      },
      {
        "intent": "Browsing_success",
        "text": "le smartphone est maintenant connecté"
      },
      {
        "intent": "Browsing_success",
        "text": "oui je peux maintenant naviguer sur mon téléphone"
      },
      {
        "intent": "Browsing_success",
        "text": "oui je peux maintenant naviguer sur mon smartphone"
      },
      {
        "intent": "Browsing_success",
        "text": "oui je peux maintenant naviguer sur mon portable"
      },
      {
        "intent": "Browsing_success",
        "text": "merci je peux le voir travailler maintenant"
      },
      {
        "intent": "Browsing_success",
        "text": "je peux le voir fonctionner maintenant"
      },
      {
        "intent": "Orange_money",
        "text": "Je veux annuler ma limite de transfert quotidienne pour l'orange money"
      },
      {
        "intent": "Orange_money",
        "text": "j'ai un problème avec mon orange money"
      },
      {
        "intent": "Orange_money",
        "text": "Je veux connaitre le motif rejet déplafonnement d'un numéro"
      },
      {
        "intent": "Orange_money",
        "text": "Quel est le motif de rejet déplafonnement"
      },
      {
        "intent": "Orange_money",
        "text": "Donne moi le motif de rejet déplafonnement de ce numéro"
      },
      {
        "intent": "Orange_money",
        "text": "Je veux voir le motif de rejet déplafonnement du numéro"
      },
      {
        "intent": "Orange_money",
        "text": "Rejet déplafonnement du numéro"
      },
      {
        "intent": "Orange_money",
        "text": "Comment plafonné mon compte orange money"
      },
      {
        "intent": "Orange_money",
        "text": "Pourquoi la Durée de traitement d'un puce plafonné Orange Money dure plus d'un mois?"
      },
      {
        "intent": "Orange_money",
        "text": "Bonjour je voulais enlever le plafonnement de mon compte"
      },
      {
        "intent": "Orange_money",
        "text": "Puis augmenter mon plafonnement jusqu'à 1 million en ligne"
      },
      {
        "intent": "Orange_money",
        "text": "Comment faire pour augmenter mon seuil de transactions plafonné à 200.000fr?"
      },
      {
        "intent": "Orange_money",
        "text": "Pourquoi mes transactions orange money sont plafonnées à 200.000fr alors que certains dépassent ce montant?"
      },
      {
        "intent": "Orange_money",
        "text": "Je tente d élever mon plafon dans lesvkiosques orange money mais à chaque fois ça échoue comment je vais faire?"
      },
      {
        "intent": "Orange_money",
        "text": "Plafond de mon compte"
      },
      {
        "intent": "Orange_money",
        "text": "le solde compte OM esplafonné à 200.000f. Que faire en cas de vouloir faire un dépôt or le solde maximum atteint."
      },
      {
        "intent": "Orange_money",
        "text": "Le plafond orange money"
      },
      {
        "intent": "Orange_money",
        "text": "Comment faire pour augmenter son plafond orange money ?"
      },
      {
        "intent": "Orange_money",
        "text": "Comment puis-je augmenter le plafond de mon compte orange money sans me déplacer ?"
      },
      {
        "intent": "Orange_money",
        "text": "Tu veux lever le plafond de ton compte Orange Money?"
      },
      {
        "intent": "Orange_money",
        "text": "Veux-tu lever le plafond de ton compte Orange Money ?"
      },
      {
        "intent": "Orange_money",
        "text": "Bonjour comment faire pour lever mon plafond orange money?"
      },
      {
        "intent": "Orange_money",
        "text": "J’aimerais bien augmenter le plafond de mon compte orange money. Merci papesarr1@hotmail.com 779283708"
      },
      {
        "intent": "Orange_money",
        "text": "Plafond de mon compte"
      },
      {
        "intent": "Orange_money",
        "text": "Que dois-je faire si ma demande de relèvement de plafond n'est pas traitée ?"
      },
      {
        "intent": "Orange_money",
        "text": "Existe-t-il un plafond pour un transfert avec code Orange money ?"
      },
      {
        "intent": "Orange_money",
        "text": "plafond orange money"
      },
      {
        "intent": "Orange_money",
        "entities": [
          {
            "start": 25,
            "end": 35,
            "value": "7771445258",
            "entity": "phone_no"
          }
        ],
        "text": "je veux des infos sur le 7771445258"
      },
      {
        "intent": "Orange_money",
        "text": "Comment peut on augmenter le plafond pour mon compte orange money"
      },
      {
        "intent": "Orange_money",
        "text": "Existe-il un plafond autorisé pour la participation au don et/ou cotisation via Orange Money?"
      },
      {
        "intent": "Orange_money",
        "text": "Existe t-il un plafond autorisé pour les paiement en ligne via Orange Money avec Paydunya ?"
      },
      {
        "intent": "Orange_money",
        "text": "Comme limiter l'utilisation des données ou autrement définir un plafond pour la connexion mobile sous Android?"
      },
      {
        "intent": "Orange_money",
        "text": "Pourquoi je n'arrive plus à transférer de l'argent de mon compte bancaire à mon compte orange money ?"
      },
      {
        "intent": "Orange_money",
        "text": "Quels sont les plafonds journaliers et mensuels de transfert de mon compte bancaire vers mon compte orange money ?"
      },
      {
        "intent": "Orange_money",
        "text": "Je tente d élever mon plafon dans lesvkiosques orange money mais à chaque fois ça échoue comment je vais faire?"
      },
      {
        "intent": "Orange_money",
        "text": "Pourquoi mes transactions orange money sont plafonnées à 200.000fr alors que certains dépassent ce montant?"
      },
      {
        "intent": "Orange_money",
        "text": "Pourquoi Orange a-t-il limité les comptes OM?"
      },
      {
        "intent": "Orange_money",
        "text": "Pourquoi les comptes Orange MOney sont plafonnè?"
      },
      {
        "intent": "Orange_money",
        "text": "le solde compte OM esplafonné à 200.000f. Que faire en cas de vouloir faire un dépôt or le solde maximum atteint."
      },
      {
        "intent": "Orange_money",
        "text": "quel dépot maximum autorisé ?"
      },
      {
        "intent": "Orange_money",
        "text": "Déplafonnement"
      },
      {
        "intent": "Orange_money",
        "text": "Deplafonnement compte OM"
      },
      {
        "intent": "Orange_money",
        "text": "Bonus déplafonnement compte OM"
      },
      {
        "intent": "Orange_money",
        "text": "Bonjour. C BADOU SARR. Pouvez-vous m’envoyer un formulaire pour déplafonner mon compte Orange Money ? Merci beaucoup."
      },
      {
        "intent": "Orange_money",
        "text": "Deplafonner mon compte"
      },
      {
        "intent": "Orange_money",
        "text": "La durée du deplafonnement ?"
      },
      {
        "intent": "Orange_money",
        "text": "Pourquoi la Durée de traitement d'un puce plafonné Orange Money dure plus d'un mois?"
      },
      {
        "intent": "Orange_money",
        "text": "Deplafoner mon compte orange money"
      },
      {
        "intent": "Orange_money",
        "text": "Le deplafonnement d un Compte orange money dure combien de jour?"
      },
      {
        "intent": "Orange_money",
        "text": "Je veux déplafonner mon compte orange money comment faire ?"
      },
      {
        "intent": "Reclamation",
        "entities": [
          {
            "start": 54,
            "end": 63,
            "value": "773846441",
            "entity": "phone_no"
          }
        ],
        "text": "Je veux enregistrer une réclamation, mon numéro c'est 773846441"
      },
      {
        "intent": "Reclamation",
        "text": "Je veux faire une réclamation"
      },
      {
        "intent": "Reclamation",
        "text": "Je veux faire une réclamation sur un service d'Orange"
      },
      {
        "intent": "Reclamation",
        "text": "J'aimerais signaler un dérangement"
      },
      {
        "intent": "Reclamation",
        "text": "Je veux enregistrer un dérangement"
      },
      {
        "intent": "Reclamation",
        "text": "J'ai une réclamation à faire"
      },
      {
        "intent": "Reclamation",
        "text": "J'ai un dérangement à signaler"
      },
      {
        "intent": "Reclamation",
        "text": "Je veux signaler un problème"
      },
      {
        "intent": "Reclamation",
        "text": "J'ai un problème à signaler"
      },
      {
        "intent": "Reclamation",
        "text": "Comment déposer une réclamation formelle?"
      },
      {
        "intent": "Reclamation",
        "text": "Réclamation Orange Money"
      },
      {
        "intent": "Reclamation",
        "text": "Le distributeur qui paie les factures des clients via Orange Money doit-il leur réclamer des frais?"
      },
      {
        "intent": "Reclamation",
        "text": "comment reclamer un depot par erreur sur un nemero qui n a pas de compte orange money"
      },
      {
        "intent": "Reclamation",
        "text": "Je réclame mes 150mo."
      },
      {
        "intent": "Reclamation",
        "text": "reclamation de recu de transaction 1"
      },
      {
        "intent": "Reclamation",
        "text": "Qui contacter en cas de réclamations les revendeurs itinérants Orange Money?"
      },
      {
        "intent": "Reclamation",
        "text": "Réclamation des 10 Go offerts après achat d'un modem Airbox 4G"
      },
      {
        "intent": "Reclamation",
        "text": "Faire une réclamation"
      },
      {
        "intent": "Reclamation",
        "text": "Réclamations"
      },
      {
        "intent": "Reclamation",
        "text": "Si j’ai une réclamation à faire, après souscription à cette offre, à qui dois-je m’adresser ?"
      },
      {
        "intent": "Reclamation",
        "text": "Je réclame mes 10000f"
      },
      {
        "intent": "Reclamation",
        "text": "je réclame mon passe 150Mo"
      },
      {
        "intent": "Reclamation",
        "text": "Paiement deux fois d'une même facture,comment reclamer?"
      },
      {
        "intent": "Reclamation",
        "text": "Bonjour les gars , que pensez vous du cumul ? Doit il revenir ou rester ainsi ???"
      },
      {
        "intent": "Reclamation",
        "text": "J’ai pas eu mes 150Mo de bienvenu"
      },
      {
        "intent": "Reclamation",
        "text": "J’ai envoyer de l’argent sur un compte orange sois disant fermer maintenant"
      },
      {
        "intent": "Reclamation",
        "text": "Comment justifier le payement d'une facture par Orange Money en cas de contestation ?"
      },
      {
        "intent": "Reclamation",
        "text": "Recharge du credit WOYOFAL"
      },
      {
        "intent": "Reclamation",
        "text": "Mon compte OM est débité mais je n’ai pas reçu mon pass?"
      },
      {
        "intent": "Reclamation",
        "text": "Pourquoi mon numéro a été coupé et attribué à un autre ?"
      },
      {
        "intent": "Reclamation",
        "text": "Bonjour J’ai rechargé 5000f sur ma carte rapido mais on m’a débité 6000f ce n’est pas normal que dois je faire svp?"
      },
      {
        "intent": "Reclamation",
        "text": "Tous mes besoins de renseignements et d’assistance sur Orange Money pourront être traités si j'appelle le 1444?"
      },
      {
        "intent": "Reclamation",
        "text": "Clé Internet Everywhere: Ma clé de connexion refuse quand je valide sur ''connecter''. Que dois-je faire?"
      },
      {
        "intent": "Reclamation",
        "text": "Je constate que mon crédit est débité alors que j'appelle pas"
      },
      {
        "intent": "Reclamation",
        "text": "Mon compte OM est débité de 1100 F CFA suite à un achat de crédit pour mon numéro Kirène, mais le crédit pas positionné?"
      },
      {
        "intent": "Reclamation",
        "text": "Impossible d'utiliser la Voip avec un telephone SIP"
      },
      {
        "intent": "Reclamation",
        "text": "Rejoins la communauté d'entraide et gagne 150 Mo positionné sous 10 jours"
      },
      {
        "intent": "Reclamation",
        "text": "Je me suis tromper de numero en faisant un transfert entre ornage money. Que dois-je faire recupérer mon argent?"
      },
      {
        "intent": "Reclamation",
        "text": "Il existe toujours un problème de connection avec les appels skype, whatsapp etc, quand est-ce que ca sera résolu?"
      },
      {
        "intent": "Reclamation",
        "text": "Mon numeros ne marche plus. Personne n'arrive à me joindre et mon internet mobile ne fonctionne plus."
      },
      {
        "intent": "Internet_config",
        "text": "je n'ai pas de connexion internet sur mon téléphone"
      },
      {
        "intent": "Internet_config",
        "text": "Je ne peux pas naviguer sur Internet sur mon téléphone"
      },
      {
        "intent": "Internet_config",
        "text": "Je veux obtenir des paramètres pour la connectivité Internet"
      },
      {
        "intent": "Internet_config",
        "text": "Comment configurer l'internet de mon mobile"
      },
      {
        "intent": "Internet_config",
        "text": "Je veux paramétrer l'internet de mon téléphone portable"
      },
      {
        "intent": "Internet_config",
        "text": "Donne moi le paramétrage internet pour mon téléphone portable"
      },
      {
        "intent": "Internet_config",
        "text": "Peux-tu m'aider à configurer la connexion internet de mon mobile"
      },
      {
        "intent": "Internet_config",
        "text": "Aide moi à configurer la connexion de mon téléphone"
      },
      {
        "intent": "Internet_config",
        "text": "Comment configurer l'internet de mon téléphone"
      },
      {
        "intent": "Internet_config",
        "text": "Peux-tu me fournir les paramètres internet pour mon téléphone"
      },
      {
        "intent": "Internet_config",
        "text": "Paramétrage internet de mon mobile"
      },
      {
        "intent": "Internet_config",
        "text": "Configuration internet mobile"
      },
      {
        "intent": "Internet_config",
        "text": "J'ai besoin de paramètres de configuration Internet pour mon téléphone"
      },
      {
        "intent": "Internet_config",
        "text": "Puis-je paramétrer l'internet sur mon téléphone via le menu #1234# ?"
      },
      {
        "intent": "Internet_config",
        "text": "comment paramétrer son téléphone par soi même"
      },
      {
        "intent": "Internet_config",
        "text": "Comment faire un paramétrage manuel avec Orange ?"
      },
      {
        "intent": "Internet_config",
        "text": "connectivité reseau ou telephone ?"
      },
      {
        "intent": "Internet_config",
        "text": "Paramétrage Internet Mobile via #120# (Version Wolof)"
      },
      {
        "intent": "Internet_config",
        "text": "Paramétrage Internet Mobile via #120# (Version Française)"
      },
      {
        "intent": "Internet_config",
        "text": "Probleme de connexion sur mon telephone mobile"
      },
      {
        "intent": "Internet_config",
        "text": "salut je veut savoir est ce q'on peut configurer les telephone fixe sans fil importer au niveau de la sonatel ?"
      },
      {
        "intent": "Internet_config",
        "text": "Que dois je faire pour que le téléphone soit compatible"
      },
      {
        "intent": "Internet_config",
        "text": "je viens d achete un nouveaux telephone itel 1409 mais je met mon puce 4G sa me demande un code"
      },
      {
        "intent": "Internet_config",
        "text": "Ma clé Internet orange me demande de configurer l'apn et je n'y arrive pas je voudrai savoir comment faire"
      },
      {
        "intent": "Internet_config",
        "text": "je veux configurer mon portable pour internet connexion"
      },
      {
        "intent": "Internet_config",
        "text": "Bonjour pourquoi a POUT nous avons des problèmes de réseau 3G et 4G ?"
      },
      {
        "intent": "Internet_config",
        "text": "Bonsoir ! J’ai récupéré ma puce 4G et mon téléphone est compatible. Mais ça affiche encore la 3G que faire?"
      },
      {
        "intent": "Internet_config",
        "text": "Je n’ai pas de connexion internet sur la deuxième carte SIM de mon téléphone ONE PLUS. Que faire?"
      },
      {
        "intent": "Internet_config",
        "text": "Je ne suis pas capable de naviguer sur Internet sur mon téléphone"
      },
      {
        "intent": "Internet_config",
        "text": "J'ai un problème de navigation avec mon téléphone"
      },
      {
        "intent": "Internet_config",
        "text": "J'ai essayé d'obtenir les paramètres via # 120 # mais je ne peux toujours pas naviguer sur mon téléphone"
      },
      {
        "intent": "Internet_config",
        "text": "connectivité"
      },
      {
        "intent": "Internet_config",
        "text": "j'ai besoin de configurer mon internet connexion sur mon téléphone"
      },
      {
        "intent": "Internet_config",
        "text": "configuration internet pour mon téléphone"
      },
      {
        "intent": "Internet_config",
        "text": "je veux configurer mon portable"
      },
      {
        "intent": "Internet_config_android",
        "entities": [
          {
            "start": 23,
            "end": 30,
            "value": "Android",
            "entity": "android"
          }
        ],
        "text": "J'utilise un téléphone Android"
      },
      {
        "intent": "Internet_config_android",
        "entities": [
          {
            "start": 6,
            "end": 13,
            "value": "android",
            "entity": "android"
          }
        ],
        "text": "c'est android"
      },
      {
        "intent": "Internet_config_android",
        "entities": [
          {
            "start": 6,
            "end": 19,
            "value": "nokia android",
            "entity": "android"
          }
        ],
        "text": "c'est nokia android"
      },
      {
        "intent": "Internet_config_android",
        "text": "mon portable c'est android et il utilise le système d'exploitation Android"
      },
      {
        "intent": "Internet_config_android",
        "text": "J'ai un android"
      },
      {
        "intent": "Internet_config_android",
        "text": "Je ne suis pas capable de naviguer sur Internet sur mon téléphone Android"
      },
      {
        "intent": "Internet_config_android",
        "text": "Configurer l'internet mobile sur son téléphone android?"
      },
      {
        "intent": "Internet_config_android",
        "text": "Bonjour, je veux qu'on m'aide à paramétrer mon portable pour une connexion internet. J'ai un samsung s7 edge verizon?"
      },
      {
        "intent": "Internet_config_android",
        "text": "Android"
      },
      {
        "intent": "Internet_config_android",
        "text": "Mon portable est un android"
      },
      {
        "intent": "Internet_config_android",
        "text": "La marque de mon téléphone est infinix note 4 mais j'arrive pas à me connecté au 4G"
      },
      {
        "intent": "Internet_config_android",
        "text": "Mon téléphone a le système Android"
      },
      {
        "intent": "Internet_config_android",
        "text": "J'ai Android dans mon téléphone"
      },
      {
        "intent": "Internet_config_android",
        "entities": [
          {
            "start": 71,
            "end": 78,
            "value": "android",
            "entity": "android"
          }
        ],
        "text": "J'ai besoin de paramètres de configuration Internet pour mon téléphone android"
      },
      {
        "intent": "Internet_config_android",
        "entities": [
          {
            "start": 59,
            "end": 65,
            "value": "Techno",
            "entity": "android"
          }
        ],
        "text": "Je veux obtenir les paramètres Internet pour mon téléphone Techno"
      },
      {
        "intent": "Internet_config_android",
        "entities": [
          {
            "start": 8,
            "end": 15,
            "value": "samsung",
            "entity": "android"
          }
        ],
        "text": "J'ai un samsung S7 venant d'Amerique mais la 4g ne fonctionne presque pas. Comment le paramétrer?"
      },
      {
        "intent": "Internet_config_android",
        "entities": [
          {
            "start": 12,
            "end": 18,
            "value": "techno",
            "entity": "android"
          }
        ],
        "text": "Pourquoi ma techno n'est pas compatible avec la 4g"
      },
      {
        "intent": "Internet_config_android",
        "entities": [
          {
            "start": 59,
            "end": 73,
            "value": "samsung galaxy",
            "entity": "android"
          }
        ],
        "text": "Je veux obtenir les paramètres Internet pour mon téléphone samsung galaxy"
      },
      {
        "intent": "Internet_config_android",
        "entities": [
          {
            "start": 71,
            "end": 78,
            "value": "infinix",
            "entity": "android"
          }
        ],
        "text": "J'ai besoin de paramètres de configuration Internet pour mon téléphone infinix"
      },
      {
        "intent": "Internet_config_android",
        "entities": [
          {
            "start": 71,
            "end": 77,
            "value": "huawei",
            "entity": "android"
          }
        ],
        "text": "J'ai besoin de paramètres de configuration Internet pour mon téléphone huawei"
      },
      {
        "intent": "Internet_config_android",
        "entities": [
          {
            "start": 31,
            "end": 36,
            "value": "tecno",
            "entity": "android"
          }
        ],
        "text": "c'est pour mon appareil mobile tecno"
      },
      {
        "intent": "Internet_config_android",
        "text": "les paramètres Internet sont pour mon combiné itel"
      },
      {
        "intent": "Internet_config_android",
        "entities": [
          {
            "start": 31,
            "end": 38,
            "value": "alcatel",
            "entity": "android"
          }
        ],
        "text": "comment configurer mon combiné alcatel pour la connexion internet"
      },
      {
        "intent": "Internet_config_android",
        "text": "Paramétrage manuel de l'internet mobile sur un smartphone Android (version française)"
      },
      {
        "intent": "Internet_config_android",
        "entities": [
          {
            "start": 18,
            "end": 38,
            "value": "Huawei Ascend Gold 7",
            "entity": "android"
          }
        ],
        "text": "j'ai un téléphone Huawei Ascend Gold 7 compatible 4G et une puce 4G, mais la 4G ne s'affiche pas avec ma nouvelle puce"
      },
      {
        "intent": "Internet_config_android",
        "entities": [
          {
            "start": 58,
            "end": 65,
            "value": "Android",
            "entity": "android"
          }
        ],
        "text": "Paramétrage manuel de l'internet mobile sur un smartphone Android version Wolof"
      },
      {
        "intent": "Internet_config_android",
        "entities": [
          {
            "start": 18,
            "end": 31,
            "value": "infinix hot S",
            "entity": "android"
          }
        ],
        "text": "J'ai un téléphone infinix hot S qui supporte 4G et une puce 4G mais j'arrive pas à me connecter sur le réseau 4G ?"
      },
      {
        "intent": "Internet_config_android",
        "entities": [
          {
            "start": 62,
            "end": 67,
            "value": "Tecno",
            "entity": "android"
          }
        ],
        "text": "Je n'ai pas de paramètres de configuration pour mon téléphone Tecno"
      },
      {
        "intent": "Internet_config_android",
        "entities": [
          {
            "start": 68,
            "end": 74,
            "value": "Lenovo",
            "entity": "android"
          }
        ],
        "text": "j' ai besoin de configurer mon internet connexion sur mon téléphone Lenovo"
      },
      {
        "intent": "Internet_config_android",
        "entities": [
          {
            "start": 23,
            "end": 30,
            "value": "samsung",
            "entity": "android"
          }
        ],
        "text": "configuration internet samsung"
      },
      {
        "intent": "Internet_config_windows",
        "entities": [
          {
            "start": 0,
            "end": 6,
            "value": "window",
            "entity": "windows"
          }
        ],
        "text": "window"
      },
      {
        "intent": "Internet_config_windows",
        "text": "c'est nokia windows"
      },
      {
        "intent": "Internet_config_windows",
        "text": "Windows phone"
      },
      {
        "intent": "Internet_config_windows",
        "text": "système Windows"
      },
      {
        "intent": "Internet_config_windows",
        "entities": [
          {
            "start": 5,
            "end": 12,
            "value": "Windows",
            "entity": "windows"
          }
        ],
        "text": "J'ai Windows"
      },
      {
        "intent": "Internet_config_windows",
        "text": "Mon portable a un système windows"
      },
      {
        "intent": "Internet_config_windows",
        "text": "J'ai windows comme système"
      },
      {
        "intent": "Internet_config_windows",
        "text": "Mon système d'exploitation est windows"
      },
      {
        "intent": "Internet_config_windows",
        "entities": [
          {
            "start": 0,
            "end": 13,
            "value": "Nokia Windows",
            "entity": "windows"
          }
        ],
        "text": "Nokia Windows"
      },
      {
        "intent": "Internet_config_windows",
        "entities": [
          {
            "start": 71,
            "end": 84,
            "value": "nokia windows",
            "entity": "windows"
          }
        ],
        "text": "J'ai besoin de paramètres de configuration Internet pour mon téléphone nokia windows"
      },
      {
        "intent": "Internet_config_windows",
        "entities": [
          {
            "start": 59,
            "end": 72,
            "value": "Nokia windows",
            "entity": "windows"
          }
        ],
        "text": "Je veux obtenir les paramètres Internet pour mon téléphone Nokia windows"
      },
      {
        "intent": "Internet_config_windows",
        "entities": [
          {
            "start": 58,
            "end": 67,
            "value": "Microsoft",
            "entity": "windows"
          }
        ],
        "text": "Paramétrage manuel de l'internet mobile sur un smartphone Microsoft version Wolof"
      },
      {
        "intent": "Internet_config_windows",
        "text": "Je veux obtenir les paramètres Internet pour mon téléphone windows"
      },
      {
        "intent": "Internet_config_windows",
        "entities": [
          {
            "start": 66,
            "end": 73,
            "value": "windows",
            "entity": "windows"
          }
        ],
        "text": "Je ne suis pas capable de naviguer sur Internet sur mon téléphone windows"
      },
      {
        "intent": "Internet_config_windows",
        "text": "Configurer l'internet mobile sur Windows Phone?"
      },
      {
        "intent": "Internet_config_windows",
        "text": "Partage de connexion mobile avec Windows Phone"
      },
      {
        "intent": "Internet_config_windows",
        "entities": [
          {
            "start": 52,
            "end": 69,
            "value": "téléphone Windows",
            "entity": "windows"
          }
        ],
        "text": "Je n'ai pas de paramètres de configuration pour mon téléphone Windows"
      },
      {
        "intent": "Internet_config_windows",
        "entities": [
          {
            "start": 33,
            "end": 50,
            "value": "Microsoft Windows",
            "entity": "windows"
          }
        ],
        "text": "Configurer l'internet mobile sur Microsoft Windows Phone?"
      },
      {
        "intent": "Internet_config_windows",
        "entities": [
          {
            "start": 26,
            "end": 39,
            "value": "Windows Phone",
            "entity": "windows"
          }
        ],
        "text": "Comment mettre à jour son Windows Phone?"
      },
      {
        "intent": "Internet_config_windows",
        "entities": [
          {
            "start": 20,
            "end": 37,
            "value": "microsoft windows",
            "entity": "windows"
          }
        ],
        "text": "mon téléphone c'est microsoft windows"
      },
      {
        "intent": "Internet_config_windows",
        "entities": [
          {
            "start": 0,
            "end": 15,
            "value": "microsoft nokia",
            "entity": "windows"
          }
        ],
        "text": "microsoft nokia"
      },
      {
        "intent": "Internet_config_windows",
        "entities": [
          {
            "start": 0,
            "end": 15,
            "value": "Microsoft Nokia",
            "entity": "windows"
          }
        ],
        "text": "Microsoft Nokia"
      },
      {
        "intent": "Internet_config_windows",
        "entities": [
          {
            "start": 0,
            "end": 9,
            "value": "microsoft",
            "entity": "windows"
          }
        ],
        "text": "microsoft"
      },
      {
        "intent": "Internet_config_windows",
        "entities": [
          {
            "start": 32,
            "end": 39,
            "value": "windows",
            "entity": "windows"
          }
        ],
        "text": "configuration internet pour mon windows téléphone"
      },
      {
        "intent": "Internet_config_blackberry",
        "text": "mon téléphone c'est un blackberry"
      },
      {
        "intent": "Internet_config_blackberry",
        "text": "Blackberry"
      },
      {
        "intent": "Internet_config_blackberry",
        "text": "Configuration pas à pas du compte de messagerie BlackBerry Internet Service"
      },
      {
        "intent": "Internet_config_blackberry",
        "entities": [
          {
            "start": 34,
            "end": 49,
            "value": "BlackBerry 9700",
            "entity": "blackberry"
          }
        ],
        "text": "Comment faire pour configurer mon BlackBerry 9700"
      },
      {
        "intent": "Internet_config_blackberry",
        "text": "Configurer l'internet internet sur Blackberry OS 10"
      },
      {
        "intent": "Internet_config_blackberry",
        "entities": [
          {
            "start": 8,
            "end": 18,
            "value": "BlackBerry",
            "entity": "blackberry"
          }
        ],
        "text": "J’ai un BlackBerry avec OS10 (Z10, Q10, Q5, etc.), est-ce que je pourrai continuer à accéder à Internet?"
      },
      {
        "intent": "Internet_config_blackberry",
        "entities": [
          {
            "start": 8,
            "end": 17,
            "value": "blackbery",
            "entity": "blackberry"
          }
        ],
        "text": "J'ai un blackbery"
      },
      {
        "intent": "Internet_config_blackberry",
        "text": "Je ne suis pas capable de naviguer sur Internet sur mon téléphone blackberry"
      },
      {
        "intent": "Internet_config_blackberry",
        "entities": [
          {
            "start": 21,
            "end": 31,
            "value": "Blackberry",
            "entity": "blackberry"
          }
        ],
        "text": "Mon téléphone est un Blackberry"
      },
      {
        "intent": "Internet_config_blackberry",
        "entities": [
          {
            "start": 61,
            "end": 81,
            "value": "téléphone blackberry",
            "entity": "blackberry"
          }
        ],
        "text": "J'ai besoin de paramètres de configuration Internet pour mon téléphone blackberry"
      },
      {
        "intent": "Internet_config_blackberry",
        "entities": [
          {
            "start": 49,
            "end": 75,
            "value": "appareil mobile blackberry",
            "entity": "blackberry"
          }
        ],
        "text": "Je veux obtenir les paramètres Internet pour mon appareil mobile blackberry"
      },
      {
        "intent": "Internet_config_blackberry",
        "entities": [
          {
            "start": 49,
            "end": 59,
            "value": "blackberry",
            "entity": "blackberry"
          }
        ],
        "text": "Je veux obtenir les paramètres Internet pour mon blackberry"
      },
      {
        "intent": "Internet_config_blackberry",
        "entities": [
          {
            "start": 61,
            "end": 71,
            "value": "BlackBerry",
            "entity": "blackberry"
          }
        ],
        "text": "Je veux obtenir les paramètres Internet pour mon mon combiné BlackBerry"
      },
      {
        "intent": "Internet_config_blackberry",
        "entities": [
          {
            "start": 62,
            "end": 72,
            "value": "Blackberry",
            "entity": "blackberry"
          }
        ],
        "text": "Je n'ai pas de paramètres de configuration pour mon téléphone Blackberry"
      },
      {
        "intent": "Internet_config_blackberry",
        "entities": [
          {
            "start": 23,
            "end": 33,
            "value": "blackberry",
            "entity": "blackberry"
          }
        ],
        "text": "configuration internet blackberry"
      },
      {
        "intent": "Internet_config_blackberry",
        "entities": [
          {
            "start": 42,
            "end": 52,
            "value": "Blackberry",
            "entity": "blackberry"
          }
        ],
        "text": "configuration internet pour mon telephone Blackberry"
      }
    ],
    "regex_features": [
      {
        "name": " phone_no",
        "pattern": "[0-9]{11}"
      },
      {
        "name": " phone_no",
        "pattern": "[0-9]{9}"
      },
      {
        "name": " phone_no",
        "pattern": "^[+221][0-9]{9}$"
      }
    ],
    "entity_synonyms": [
      {
        "value": " windows",
        "synonyms": [
          "Nokia windows",
          "Windows phone",
          "windows téléphone",
          "Microsoft"
        ]
      },
      {
        "value": " android",
        "synonyms": [
          "tecno",
          "infinix",
          "gionee",
          "nokia android",
          "itel",
          "alcatel",
          "samsung galaxy",
          "motorola",
          "htc",
          "invense",
          "lenovo",
          "samsung",
          "Tecno",
          "Infinix",
          "Gionee",
          "Nokia android",
          "Itel",
          "Alcatel",
          "Samsung galaxy",
          "Motorola",
          "HTC",
          "Invense",
          "Lenovo",
          "Samsung",
          "Royal",
          "royal",
          "FERO",
          "fero",
          "Trend-Mi",
          "trend-mi",
          "sony",
          "Sony",
          "Sony Ericsson",
          "LG",
          "Huawei",
          "Xiaomi",
          "Google",
          "Vodafone",
          "BLU",
          "Wiko",
          "vivo",
          "Panasonic"
        ]
      }
    ]
  }
}