{
  "nokia windows": " windows",
  "windows phone": " windows",
  "windows téléphone": " windows",
  "microsoft": " windows",
  "tecno": " android",
  "infinix": " android",
  "gionee": " android",
  "nokia android": " android",
  "itel": " android",
  "alcatel": " android",
  "samsung galaxy": " android",
  "motorola": " android",
  "htc": " android",
  "invense": " android",
  "lenovo": " android",
  "samsung": " android",
  "royal": " android",
  "fero": " android",
  "trend-mi": " android",
  "sony": " android",
  "sony ericsson": " android",
  "lg": " android",
  "huawei": " android",
  "xiaomi": " android",
  "google": " android",
  "vodafone": " android",
  "blu": " android",
  "wiko": " android",
  "vivo": " android",
  "panasonic": " android"
}