[gd_scene load_steps=4 format=3 uid="uid://t874k6cepf4i"]

[ext_resource type="Script" path="res://scenes/Actors/Player.gd" id="1_8mps6"]
[ext_resource type="PackedScene" uid="uid://tbu8ouwfk4fv" path="res://scenes/Actors/Mesh.glb" id="1_cxxxo"]

[sub_resource type="SphereShape3D" id="SphereShape3D_evwwt"]
resource_name = "HitBox"
radius = 0.8

[node name="Player" type="CharacterBody3D"]
script = ExtResource("1_8mps6")

[node name="Pivot" type="Node3D" parent="."]

[node name="Character" parent="Pivot" instance=ExtResource("1_cxxxo")]
transform = Transform3D(1, 0, 0, 0, 1, 0, 0, 0, 1, 0, 0.466326, 0)

[node name="CollisionShape3D" type="CollisionShape3D" parent="."]
transform = Transform3D(1, 0, 0, 0, 1, 0, 0, 0, 1, 0, 0.792769, 0)
shape = SubResource("SphereShape3D_evwwt")
