{
    "realm":{
        "aerosol":"Aerosol",
        "atmos":"Atmosphere",
        "atmosChem":"Atmospheric Chemistry",
        "land":"Land Surface",
        "landIce":"Land Ice",
        "ocean":"Ocean",
        "ocnBgchem":"Ocean Biogeochemistry",
        "seaIce":"Sea Ice"
    },
    "version_metadata":{
        "CV_collection_modified":"Sun Feb  2 17:21:05 2020 -0800",
        "CV_collection_version":"6.2.48.1",
        "author":"Paul J. Durack <durack1@llnl.gov>",
        "institution_id":"PCMDI",
        "previous_commit":"99b8845a4ae5130db9fd3f06aa0ad964dfe61d05",
        "realm_CV_modified":"Tues Apr 18 12:03:00 2017 -0700",
        "realm_CV_note":"Issue285 durack1 update realm format (#290)",
        "specs_doc":"v6.2.7 (10th September 2018; https://goo.gl/v1drZl)"
    }
}