<?xml version="1.0" encoding="utf-8"?>
<!-- Generator: Adobe Illustrator 23.0.3, SVG Export Plug-In . SVG Version: 6.00 Build 0)  -->
<svg version="1.1" id="Слой_1" xmlns="http://www.w3.org/2000/svg" xmlns:xlink="http://www.w3.org/1999/xlink" x="0px" y="0px"
	 viewBox="0 0 18 18" style="enable-background:new 0 0 18 18;" xml:space="preserve">
<g>
	<polygon points="7.8,10.5 10.2,10.5 9,6.5 	"/>
	<path d="M14,1H4C2.3,1,1,2.3,1,4v10c0,1.7,1.3,3,3,3h10c1.7,0,3-1.3,3-3V4C17,2.3,15.7,1,14,1z M11.5,14.7l-0.7-2.1H7.1l-0.7,2.1
		H3.5L7.7,3.3h2.6l4.2,11.4H11.5z"/>
</g>
</svg>
