<?xml version="1.0" encoding="UTF-8" standalone="no"?>
<!-- Created with Inkscape (http://www.inkscape.org/) -->

<svg
   width="500"
   height="500"
   viewBox="0 0 132.29166 132.29166"
   version="1.1"
   id="svg639"
   sodipodi:docname="blank-image.svg"
   inkscape:version="1.3 (0e150ed6c4, 2023-07-21)"
   xmlns:inkscape="http://www.inkscape.org/namespaces/inkscape"
   xmlns:sodipodi="http://sodipodi.sourceforge.net/DTD/sodipodi-0.dtd"
   xmlns:xlink="http://www.w3.org/1999/xlink"
   xmlns="http://www.w3.org/2000/svg"
   xmlns:svg="http://www.w3.org/2000/svg">
  <sodipodi:namedview
     id="namedview18"
     pagecolor="#ffffff"
     bordercolor="#666666"
     borderopacity="1.0"
     inkscape:showpageshadow="2"
     inkscape:pageopacity="0.0"
     inkscape:pagecheckerboard="0"
     inkscape:deskcolor="#d1d1d1"
     showgrid="false"
     inkscape:zoom="1.0920308"
     inkscape:cx="291.20058"
     inkscape:cy="333.78179"
     inkscape:window-width="1366"
     inkscape:window-height="699"
     inkscape:window-x="0"
     inkscape:window-y="32"
     inkscape:window-maximized="1"
     inkscape:current-layer="svg639" />
  <defs
     id="defs636">
    <rect
       x="285.69958"
       y="177.63368"
       width="65.201709"
       height="78.544136"
       id="rect1" />
    <linearGradient
       id="linearGradient981">
      <stop
         style="stop-color:#f2f2f2;stop-opacity:1"
         offset="0"
         id="stop977" />
      <stop
         style="stop-color:#e6e6e6;stop-opacity:1"
         offset="1"
         id="stop979" />
    </linearGradient>
    <radialGradient
       xlink:href="#linearGradient981"
       id="radialGradient983"
       cx="63.121723"
       cy="66.368622"
       fx="63.121723"
       fy="66.368622"
       r="66.145836"
       gradientUnits="userSpaceOnUse"
       gradientTransform="matrix(1.3197014,0,6.0705398e-6,1.5544388,-20.180507,-36.79734)" />
  </defs>
  <rect
     style="fill:url(#radialGradient983);fill-opacity:1;stroke-width:1"
     id="rect884"
     width="132.29167"
     height="132.29167"
     x="-2.5431314e-06"
     y="-2.5431316e-06" />
  <path
     d="m 51.281107,80.778621 h 7.801344 l 7.759175,-26.145046 h -2.024132 l 8.138699,26.145046 h 8.05436 L 71.016401,51.513038 h -9.319445 z m 8.1387,-6.030227 H 72.829685 L 71.311586,68.169963 H 60.895737 Z"
     id="text1"
     style="font-weight:800;font-size:64px;font-family:Cantarell;-inkscape-font-specification:'Cantarell Ultra-Bold';text-align:justify;white-space:pre;fill:#b3b3b3;stroke-width:0.658897"
     aria-label="A" />
</svg>
