<svg xmlns="http://www.w3.org/2000/svg" width="204.702" height="91.347" viewBox="0 0 204.702 91.347">
    <defs>
        <style>
            .cls-2{fill:#50b55a}.cls-3{fill:none;stroke:#3a9140;stroke-miterlimit:10;stroke-width:.5px}.cls-4{fill:#fff}.cls-5{fill:#3a9140}.cls-6{fill:#ffdf5a}.cls-7{fill:#fcd222}.cls-8{fill:#fff2bb}.cls-9{fill:#fce895}.cls-10{fill:#ffe576}.cls-11,.cls-13{fill:#f4821c}.cls-12{fill:#ff9524}.cls-13{opacity:.5}
        </style>
    </defs>
    <g id="Group_586" data-name="Group 586" transform="translate(-3461 -1739)">
        <path id="Subtraction_4" fill="#3ea3e9" d="M153.736 76.388H0v-.426a75.031 75.031 0 0 1 13.128-42.471A76.959 76.959 0 0 1 61.377 1.543a78.526 78.526 0 0 1 30.983 0 76.929 76.929 0 0 1 48.249 31.948 75.693 75.693 0 0 1 7.087 12.9 74.954 74.954 0 0 1 6.041 29.568v.426z" data-name="Subtraction 4" transform="translate(3486.943 1739)"/>
        <g id="Group_392" data-name="Group 392" transform="translate(3502.278 1771.389)">
            <g id="Group_355" data-name="Group 355" transform="translate(3.9 35.805)">
                <path id="Rectangle_108" d="M0 0H106.098V11.935H0z" class="cls-2" data-name="Rectangle 108"/>
                <path id="Line_7" d="M0 0L106.098 0" class="cls-3" data-name="Line 7" transform="translate(0 10.599)"/>
                <path id="Line_8" d="M0 0L106.098 0" class="cls-3" data-name="Line 8" transform="translate(0 9.012)"/>
                <path id="Line_9" d="M0 0L106.098 0" class="cls-3" data-name="Line 9" transform="translate(0 7.425)"/>
                <path id="Line_10" d="M0 0L106.098 0" class="cls-3" data-name="Line 10" transform="translate(0 5.837)"/>
                <path id="Line_11" d="M0 0L106.098 0" class="cls-3" data-name="Line 11" transform="translate(0 4.25)"/>
                <path id="Line_12" d="M0 0L106.098 0" class="cls-3" data-name="Line 12" transform="translate(0 2.693)"/>
                <path id="Line_13" d="M0 0L106.098 0" class="cls-3" data-name="Line 13" transform="translate(0 1.118)"/>
                <path id="Rectangle_109" d="M0 0H33.84V11.935H0z" class="cls-4" data-name="Rectangle 109" transform="translate(36.129)"/>
                <path id="Rectangle_110" d="M0 0H30.168V11.935H0z" class="cls-5" data-name="Rectangle 110" transform="translate(37.965)"/>
            </g>
            <g id="Group_356" data-name="Group 356" transform="translate(10.49 23.87)">
                <path id="Rectangle_111" d="M0 0H106.098V11.935H0z" class="cls-2" data-name="Rectangle 111"/>
                <path id="Line_14" d="M0 0L106.098 0" class="cls-3" data-name="Line 14" transform="translate(0 10.599)"/>
                <path id="Line_15" d="M0 0L106.098 0" class="cls-3" data-name="Line 15" transform="translate(0 9.012)"/>
                <path id="Line_16" d="M0 0L106.098 0" class="cls-3" data-name="Line 16" transform="translate(0 7.425)"/>
                <path id="Line_17" d="M0 0L106.098 0" class="cls-3" data-name="Line 17" transform="translate(0 5.837)"/>
                <path id="Line_18" d="M0 0L106.098 0" class="cls-3" data-name="Line 18" transform="translate(0 4.25)"/>
                <path id="Line_19" d="M0 0L106.098 0" class="cls-3" data-name="Line 19" transform="translate(0 2.693)"/>
                <path id="Line_20" d="M0 0L106.098 0" class="cls-3" data-name="Line 20" transform="translate(0 1.118)"/>
                <path id="Rectangle_112" d="M0 0H33.84V11.935H0z" class="cls-4" data-name="Rectangle 112" transform="translate(36.129)"/>
                <path id="Rectangle_113" d="M0 0H30.168V11.935H0z" class="cls-5" data-name="Rectangle 113" transform="translate(37.965)"/>
            </g>
            <g id="Group_357" data-name="Group 357" transform="translate(5.366 11.935)">
                <path id="Rectangle_114" d="M0 0H106.098V11.935H0z" class="cls-2" data-name="Rectangle 114"/>
                <path id="Line_21" d="M0 0L106.098 0" class="cls-3" data-name="Line 21" transform="translate(0 10.599)"/>
                <path id="Line_22" d="M0 0L106.098 0" class="cls-3" data-name="Line 22" transform="translate(0 9.012)"/>
                <path id="Line_23" d="M0 0L106.098 0" class="cls-3" data-name="Line 23" transform="translate(0 7.425)"/>
                <path id="Line_24" d="M0 0L106.098 0" class="cls-3" data-name="Line 24" transform="translate(0 5.837)"/>
                <path id="Line_25" d="M0 0L106.098 0" class="cls-3" data-name="Line 25" transform="translate(0 4.25)"/>
                <path id="Line_26" d="M0 0L106.098 0" class="cls-3" data-name="Line 26" transform="translate(0 2.693)"/>
                <path id="Line_27" d="M0 0L106.098 0" class="cls-3" data-name="Line 27" transform="translate(0 1.118)"/>
                <path id="Rectangle_115" d="M0 0H33.84V11.935H0z" class="cls-4" data-name="Rectangle 115" transform="translate(36.129)"/>
                <path id="Rectangle_116" d="M0 0H30.168V11.935H0z" class="cls-5" data-name="Rectangle 116" transform="translate(37.965)"/>
            </g>
            <g id="Group_358" data-name="Group 358">
                <path id="Rectangle_117" d="M0 0H106.098V11.935H0z" class="cls-2" data-name="Rectangle 117"/>
                <path id="Line_28" d="M0 0L106.098 0" class="cls-3" data-name="Line 28" transform="translate(0 10.599)"/>
                <path id="Line_29" d="M0 0L106.098 0" class="cls-3" data-name="Line 29" transform="translate(0 9.012)"/>
                <path id="Line_30" d="M0 0L106.098 0" class="cls-3" data-name="Line 30" transform="translate(0 7.425)"/>
                <path id="Line_31" d="M0 0L106.098 0" class="cls-3" data-name="Line 31" transform="translate(0 5.837)"/>
                <path id="Line_32" d="M0 0L106.098 0" class="cls-3" data-name="Line 32" transform="translate(0 4.25)"/>
                <path id="Line_33" d="M0 0L106.098 0" class="cls-3" data-name="Line 33" transform="translate(0 2.693)"/>
                <path id="Line_34" d="M0 0L106.098 0" class="cls-3" data-name="Line 34" transform="translate(0 1.118)"/>
                <path id="Rectangle_118" d="M0 0H33.84V11.935H0z" class="cls-4" data-name="Rectangle 118" transform="translate(36.129)"/>
                <path id="Rectangle_119" d="M0 0H30.168V11.935H0z" class="cls-5" data-name="Rectangle 119" transform="translate(37.965)"/>
            </g>
        </g>
        <g id="Group_394" data-name="Group 394" transform="translate(3540.944 1765.904)">
            <g id="Group_367" data-name="Group 367" transform="translate(45.756 45.792)">
                <path id="Path_356" d="M369.4 406.21v6.745a1.61 1.61 0 0 1-1.614 1.6H334.52a1.6 1.6 0 0 1-1.509-1.067 1.41 1.41 0 0 1-.1-.538v-6.74a1.607 1.607 0 0 1 1.6-1.6h33.265a1.445 1.445 0 0 1 .538.1.913.913 0 0 1 .2.087 1.53 1.53 0 0 1 .807.98.754.754 0 0 1 .048.211 1.865 1.865 0 0 1 .031.222z" class="cls-6" data-name="Path 356" transform="translate(-332.915 -404.605)"/>
                <path id="Rectangle_129" d="M1.558 0h32.208a1.558 1.558 0 0 1 1.558 1.558V7.25a1.668 1.668 0 0 1-1.668 1.668H1.558A1.558 1.558 0 0 1 0 7.36v-5.8A1.558 1.558 0 0 1 1.558 0z" class="cls-7" data-name="Rectangle 129" transform="translate(1.157 1.038)"/>
                <rect id="Rectangle_130" width="2.002" height="7.607" class="cls-8" data-name="Rectangle 130" rx=".51" transform="translate(4.463 .637)"/>
                <path id="Rectangle_131" d="M.51 0h.981A.51.51 0 0 1 2 .51V7.1a.51.51 0 0 1-.51.51H.511A.511.511 0 0 1 0 7.1V.51A.51.51 0 0 1 .51 0z" class="cls-9" data-name="Rectangle 131" transform="translate(.459 .637)"/>
                <path id="Rectangle_132" d="M.51 0h.981A.511.511 0 0 1 2 .511V7.1a.51.51 0 0 1-.51.51H.51A.51.51 0 0 1 0 7.1V.51A.51.51 0 0 1 .51 0z" class="cls-8" data-name="Rectangle 132" transform="translate(8.767 .637)"/>
                <rect id="Rectangle_133" width="2.002" height="7.607" class="cls-10" data-name="Rectangle 133" rx=".51" transform="translate(12.95 .637)"/>
                <g id="Group_366" data-name="Group 366" transform="translate(2.746 .377)">
                    <rect id="Rectangle_134" width="1.281" height="9.218" class="cls-11" data-name="Rectangle 134" rx=".433"/>
                    <rect id="Rectangle_135" width=".971" height="9.068" class="cls-12" data-name="Rectangle 135" rx=".374" transform="translate(.31 .15)"/>
                    <rect id="Rectangle_136" width="1.281" height="9.218" class="cls-11" data-name="Rectangle 136" rx=".433" transform="translate(4.244)"/>
                    <rect id="Rectangle_137" width=".971" height="9.068" class="cls-12" data-name="Rectangle 137" rx=".374" transform="translate(4.554 .15)"/>
                    <rect id="Rectangle_138" width="1.281" height="9.218" class="cls-11" data-name="Rectangle 138" rx=".433" transform="translate(8.488)"/>
                    <rect id="Rectangle_139" width=".971" height="9.068" class="cls-12" data-name="Rectangle 139" rx=".374" transform="translate(8.798 .15)"/>
                    <rect id="Rectangle_140" width="1.281" height="9.218" class="cls-11" data-name="Rectangle 140" rx=".433" transform="translate(12.731)"/>
                    <rect id="Rectangle_141" width=".971" height="9.068" class="cls-12" data-name="Rectangle 141" rx=".374" transform="translate(13.042 .15)"/>
                    <rect id="Rectangle_142" width="1.281" height="9.218" class="cls-11" data-name="Rectangle 142" rx=".433" transform="translate(16.975)"/>
                    <rect id="Rectangle_143" width=".971" height="9.068" class="cls-12" data-name="Rectangle 143" rx=".374" transform="translate(17.285 .15)"/>
                    <rect id="Rectangle_144" width="1.281" height="9.218" class="cls-11" data-name="Rectangle 144" rx=".433" transform="translate(21.219)"/>
                    <rect id="Rectangle_145" width=".971" height="9.068" class="cls-12" data-name="Rectangle 145" rx=".374" transform="translate(21.529 .15)"/>
                    <rect id="Rectangle_146" width="1.281" height="9.218" class="cls-11" data-name="Rectangle 146" rx=".433" transform="translate(25.463)"/>
                    <rect id="Rectangle_147" width=".971" height="9.068" class="cls-12" data-name="Rectangle 147" rx=".374" transform="translate(25.773 .15)"/>
                    <rect id="Rectangle_148" width="1.281" height="9.218" class="cls-11" data-name="Rectangle 148" rx=".433" transform="translate(29.706)"/>
                    <rect id="Rectangle_149" width=".971" height="9.068" class="cls-12" data-name="Rectangle 149" rx=".374" transform="translate(30.017 .15)"/>
                </g>
                <path id="Path_357" d="M369.383 405.979a.755.755 0 0 0-.048-.211 1.53 1.53 0 0 0-.807-.98.912.912 0 0 0-.2-.087 1.445 1.445 0 0 0-.538-.1h-8.648l.317.163a1.931 1.931 0 0 1 1.086 1.643v5.294a1.784 1.784 0 0 1-1.787 1.787h-25.743a1.6 1.6 0 0 0 1.509 1.067h33.265a1.61 1.61 0 0 0 1.614-1.6v-6.745a1.865 1.865 0 0 0-.02-.231z" class="cls-13" data-name="Path 357" transform="translate(-332.919 -404.605)"/>
            </g>
            <g id="Group_369" data-name="Group 369" transform="translate(88.274 45.792)">
                <path id="Path_358" d="M413.649 406.21v6.745a1.61 1.61 0 0 1-1.614 1.6H378.77a1.6 1.6 0 0 1-1.509-1.067 1.41 1.41 0 0 1-.1-.538v-6.74a1.607 1.607 0 0 1 1.6-1.6h33.265a1.445 1.445 0 0 1 .538.1.912.912 0 0 1 .2.087 1.53 1.53 0 0 1 .807.98.754.754 0 0 1 .048.211 1.871 1.871 0 0 1 .03.222z" class="cls-6" data-name="Path 358" transform="translate(-377.165 -404.605)"/>
                <path id="Rectangle_150" d="M1.558 0h32.208a1.558 1.558 0 0 1 1.558 1.558v5.7a1.665 1.665 0 0 1-1.665 1.665H1.558A1.558 1.558 0 0 1 0 7.36v-5.8A1.558 1.558 0 0 1 1.558 0z" class="cls-7" data-name="Rectangle 150" transform="translate(1.158 1.038)"/>
                <rect id="Rectangle_151" width="2.002" height="7.607" class="cls-8" data-name="Rectangle 151" rx=".51" transform="translate(4.463 .637)"/>
                <rect id="Rectangle_152" width="2.002" height="7.607" class="cls-9" data-name="Rectangle 152" rx=".51" transform="translate(.46 .637)"/>
                <path id="Rectangle_153" d="M.51 0h.981A.51.51 0 0 1 2 .51V7.1a.51.51 0 0 1-.51.51H.511A.511.511 0 0 1 0 7.1V.51A.51.51 0 0 1 .51 0z" class="cls-8" data-name="Rectangle 153" transform="translate(8.767 .637)"/>
                <rect id="Rectangle_154" width="2.002" height="7.607" class="cls-10" data-name="Rectangle 154" rx=".51" transform="translate(12.951 .637)"/>
                <g id="Group_368" data-name="Group 368" transform="translate(2.746 .377)">
                    <rect id="Rectangle_155" width="1.281" height="9.218" class="cls-11" data-name="Rectangle 155" rx=".433"/>
                    <rect id="Rectangle_156" width=".971" height="9.068" class="cls-12" data-name="Rectangle 156" rx=".374" transform="translate(.31 .15)"/>
                    <rect id="Rectangle_157" width="1.281" height="9.218" class="cls-11" data-name="Rectangle 157" rx=".433" transform="translate(4.244)"/>
                    <rect id="Rectangle_158" width=".971" height="9.068" class="cls-12" data-name="Rectangle 158" rx=".374" transform="translate(4.554 .15)"/>
                    <rect id="Rectangle_159" width="1.281" height="9.218" class="cls-11" data-name="Rectangle 159" rx=".433" transform="translate(8.488)"/>
                    <rect id="Rectangle_160" width=".971" height="9.068" class="cls-12" data-name="Rectangle 160" rx=".374" transform="translate(8.798 .15)"/>
                    <rect id="Rectangle_161" width="1.281" height="9.218" class="cls-11" data-name="Rectangle 161" rx=".433" transform="translate(12.731)"/>
                    <rect id="Rectangle_162" width=".971" height="9.068" class="cls-12" data-name="Rectangle 162" rx=".374" transform="translate(13.042 .15)"/>
                    <rect id="Rectangle_163" width="1.281" height="9.218" class="cls-11" data-name="Rectangle 163" rx=".433" transform="translate(16.975)"/>
                    <rect id="Rectangle_164" width=".971" height="9.068" class="cls-12" data-name="Rectangle 164" rx=".374" transform="translate(17.285 .15)"/>
                    <rect id="Rectangle_165" width="1.281" height="9.218" class="cls-11" data-name="Rectangle 165" rx=".433" transform="translate(21.219)"/>
                    <rect id="Rectangle_166" width=".971" height="9.068" class="cls-12" data-name="Rectangle 166" rx=".374" transform="translate(21.529 .15)"/>
                    <rect id="Rectangle_167" width="1.281" height="9.218" class="cls-11" data-name="Rectangle 167" rx=".433" transform="translate(25.463)"/>
                    <rect id="Rectangle_168" width=".971" height="9.068" class="cls-12" data-name="Rectangle 168" rx=".374" transform="translate(25.773 .15)"/>
                    <rect id="Rectangle_169" width="1.281" height="9.218" class="cls-11" data-name="Rectangle 169" rx=".433" transform="translate(29.706)"/>
                    <rect id="Rectangle_170" width=".971" height="9.068" class="cls-12" data-name="Rectangle 170" rx=".374" transform="translate(30.017 .15)"/>
                </g>
                <path id="Path_359" d="M413.633 405.979a.753.753 0 0 0-.048-.211 1.53 1.53 0 0 0-.807-.98.912.912 0 0 0-.2-.087 1.445 1.445 0 0 0-.538-.1h-8.648l.317.163a1.931 1.931 0 0 1 1.086 1.643v5.294a1.784 1.784 0 0 1-1.787 1.787h-25.743a1.6 1.6 0 0 0 1.509 1.067h33.265a1.61 1.61 0 0 0 1.614-1.6v-6.745a1.865 1.865 0 0 0-.02-.231z" class="cls-13" data-name="Path 359" transform="translate(-377.169 -404.605)"/>
            </g>
            <g id="Group_379" data-name="Group 379" transform="translate(2.764 45.792)">
                <path id="Path_368" d="M324.656 406.21v6.745a1.61 1.61 0 0 1-1.614 1.6h-33.265a1.6 1.6 0 0 1-1.509-1.067 1.409 1.409 0 0 1-.1-.538v-6.74a1.607 1.607 0 0 1 1.6-1.6h33.265a1.445 1.445 0 0 1 .538.1.913.913 0 0 1 .2.087 1.53 1.53 0 0 1 .807.98.755.755 0 0 1 .048.211 1.865 1.865 0 0 1 .03.222z" class="cls-6" data-name="Path 368" transform="translate(-288.172 -404.605)"/>
                <rect id="Rectangle_255" width="35.324" height="8.918" class="cls-7" data-name="Rectangle 255" rx="1.558" transform="translate(1.157 1.038)"/>
                <path id="Rectangle_256" d="M.51 0h.981A.51.51 0 0 1 2 .51V7.1a.51.51 0 0 1-.51.51H.511A.511.511 0 0 1 0 7.1V.51A.51.51 0 0 1 .51 0z" class="cls-8" data-name="Rectangle 256" transform="translate(4.463 .637)"/>
                <rect id="Rectangle_257" width="2.002" height="7.607" class="cls-9" data-name="Rectangle 257" rx=".51" transform="translate(.459 .637)"/>
                <rect id="Rectangle_258" width="2.002" height="7.607" class="cls-8" data-name="Rectangle 258" rx=".51" transform="translate(8.767 .637)"/>
                <rect id="Rectangle_259" width="2.002" height="7.607" class="cls-10" data-name="Rectangle 259" rx=".51" transform="translate(12.951 .637)"/>
                <g id="Group_378" data-name="Group 378" transform="translate(2.746 .377)">
                    <rect id="Rectangle_260" width="1.281" height="9.218" class="cls-11" data-name="Rectangle 260" rx=".433"/>
                    <rect id="Rectangle_261" width=".971" height="9.068" class="cls-12" data-name="Rectangle 261" rx=".374" transform="translate(.31 .15)"/>
                    <rect id="Rectangle_262" width="1.281" height="9.218" class="cls-11" data-name="Rectangle 262" rx=".433" transform="translate(4.244)"/>
                    <rect id="Rectangle_263" width=".971" height="9.068" class="cls-12" data-name="Rectangle 263" rx=".374" transform="translate(4.554 .15)"/>
                    <rect id="Rectangle_264" width="1.281" height="9.218" class="cls-11" data-name="Rectangle 264" rx=".433" transform="translate(8.488)"/>
                    <rect id="Rectangle_265" width=".971" height="9.068" class="cls-12" data-name="Rectangle 265" rx=".374" transform="translate(8.798 .15)"/>
                    <rect id="Rectangle_266" width="1.281" height="9.218" class="cls-11" data-name="Rectangle 266" rx=".433" transform="translate(12.731)"/>
                    <rect id="Rectangle_267" width=".971" height="9.068" class="cls-12" data-name="Rectangle 267" rx=".374" transform="translate(13.042 .15)"/>
                    <rect id="Rectangle_268" width="1.281" height="9.218" class="cls-11" data-name="Rectangle 268" rx=".433" transform="translate(16.975)"/>
                    <rect id="Rectangle_269" width=".971" height="9.068" class="cls-12" data-name="Rectangle 269" rx=".374" transform="translate(17.285 .15)"/>
                    <rect id="Rectangle_270" width="1.281" height="9.218" class="cls-11" data-name="Rectangle 270" rx=".433" transform="translate(21.219)"/>
                    <rect id="Rectangle_271" width=".971" height="9.068" class="cls-12" data-name="Rectangle 271" rx=".374" transform="translate(21.529 .15)"/>
                    <rect id="Rectangle_272" width="1.281" height="9.218" class="cls-11" data-name="Rectangle 272" rx=".433" transform="translate(25.463)"/>
                    <rect id="Rectangle_273" width=".971" height="9.068" class="cls-12" data-name="Rectangle 273" rx=".374" transform="translate(25.773 .15)"/>
                    <rect id="Rectangle_274" width="1.281" height="9.218" class="cls-11" data-name="Rectangle 274" rx=".433" transform="translate(29.706)"/>
                    <rect id="Rectangle_275" width=".971" height="9.068" class="cls-12" data-name="Rectangle 275" rx=".374" transform="translate(30.017 .15)"/>
                </g>
                <path id="Path_369" d="M324.64 405.979a.755.755 0 0 0-.048-.211 1.53 1.53 0 0 0-.807-.98.913.913 0 0 0-.2-.087 1.445 1.445 0 0 0-.538-.1H314.4l.317.163a1.931 1.931 0 0 1 1.086 1.643v5.294a1.784 1.784 0 0 1-1.787 1.787h-25.744a1.6 1.6 0 0 0 1.509 1.067h33.265a1.61 1.61 0 0 0 1.614-1.6v-6.745a1.865 1.865 0 0 0-.02-.231z" class="cls-13" data-name="Path 369" transform="translate(-288.176 -404.605)"/>
            </g>
            <g id="Group_381" data-name="Group 381" transform="translate(0 35.839)">
                <path id="Path_370" d="M321.779 395.851v6.749a1.61 1.61 0 0 1-1.614 1.6H286.9a1.6 1.6 0 0 1-1.509-1.067 1.41 1.41 0 0 1-.1-.538v-6.745a1.607 1.607 0 0 1 1.6-1.6h33.265a1.444 1.444 0 0 1 .538.1.913.913 0 0 1 .2.086 1.53 1.53 0 0 1 .807.98.753.753 0 0 1 .048.211 1.864 1.864 0 0 1 .03.224z" class="cls-6" data-name="Path 370" transform="translate(-285.295 -394.246)"/>
                <rect id="Rectangle_276" width="35.324" height="8.918" class="cls-7" data-name="Rectangle 276" rx="1.558" transform="translate(1.157 1.038)"/>
                <rect id="Rectangle_277" width="2.002" height="7.607" class="cls-8" data-name="Rectangle 277" rx=".51" transform="translate(4.463 .638)"/>
                <rect id="Rectangle_278" width="2.002" height="7.607" class="cls-9" data-name="Rectangle 278" rx=".51" transform="translate(.459 .638)"/>
                <rect id="Rectangle_279" width="2.002" height="7.607" class="cls-8" data-name="Rectangle 279" rx=".51" transform="translate(8.767 .638)"/>
                <rect id="Rectangle_280" width="2.002" height="7.607" class="cls-10" data-name="Rectangle 280" rx=".51" transform="translate(12.95 .638)"/>
                <g id="Group_380" data-name="Group 380" transform="translate(2.746 .378)">
                    <rect id="Rectangle_281" width="1.281" height="9.218" class="cls-11" data-name="Rectangle 281" rx=".433"/>
                    <rect id="Rectangle_282" width=".971" height="9.068" class="cls-12" data-name="Rectangle 282" rx=".374" transform="translate(.31 .15)"/>
                    <rect id="Rectangle_283" width="1.281" height="9.218" class="cls-11" data-name="Rectangle 283" rx=".433" transform="translate(4.244)"/>
                    <rect id="Rectangle_284" width=".971" height="9.068" class="cls-12" data-name="Rectangle 284" rx=".374" transform="translate(4.554 .15)"/>
                    <rect id="Rectangle_285" width="1.281" height="9.218" class="cls-11" data-name="Rectangle 285" rx=".433" transform="translate(8.488)"/>
                    <rect id="Rectangle_286" width=".971" height="9.068" class="cls-12" data-name="Rectangle 286" rx=".374" transform="translate(8.798 .15)"/>
                    <rect id="Rectangle_287" width="1.281" height="9.218" class="cls-11" data-name="Rectangle 287" rx=".433" transform="translate(12.731)"/>
                    <rect id="Rectangle_288" width=".971" height="9.068" class="cls-12" data-name="Rectangle 288" rx=".374" transform="translate(13.042 .15)"/>
                    <rect id="Rectangle_289" width="1.281" height="9.218" class="cls-11" data-name="Rectangle 289" rx=".433" transform="translate(16.975)"/>
                    <rect id="Rectangle_290" width=".971" height="9.068" class="cls-12" data-name="Rectangle 290" rx=".374" transform="translate(17.285 .15)"/>
                    <rect id="Rectangle_291" width="1.281" height="9.218" class="cls-11" data-name="Rectangle 291" rx=".433" transform="translate(21.219)"/>
                    <rect id="Rectangle_292" width=".971" height="9.068" class="cls-12" data-name="Rectangle 292" rx=".374" transform="translate(21.529 .15)"/>
                    <rect id="Rectangle_293" width="1.281" height="9.218" class="cls-11" data-name="Rectangle 293" rx=".433" transform="translate(25.463)"/>
                    <rect id="Rectangle_294" width=".971" height="9.068" class="cls-12" data-name="Rectangle 294" rx=".374" transform="translate(25.773 .15)"/>
                    <rect id="Rectangle_295" width="1.281" height="9.218" class="cls-11" data-name="Rectangle 295" rx=".433" transform="translate(29.706)"/>
                    <rect id="Rectangle_296" width=".971" height="9.068" class="cls-12" data-name="Rectangle 296" rx=".374" transform="translate(30.017 .15)"/>
                </g>
                <path id="Path_371" d="M321.763 395.62a.756.756 0 0 0-.048-.211 1.53 1.53 0 0 0-.807-.98.914.914 0 0 0-.2-.086 1.444 1.444 0 0 0-.538-.1h-8.648l.317.163a1.931 1.931 0 0 1 1.086 1.643v5.294a1.784 1.784 0 0 1-1.787 1.787h-25.743a1.6 1.6 0 0 0 1.505 1.07h33.265a1.61 1.61 0 0 0 1.614-1.6v-6.745a1.864 1.864 0 0 0-.016-.235z" class="cls-13" data-name="Path 371" transform="translate(-285.299 -394.246)"/>
            </g>
            <g id="Group_383" data-name="Group 383" transform="translate(49.033 35.84)">
                <path id="Path_372" d="M372.809 395.852v6.748a1.61 1.61 0 0 1-1.614 1.6H337.93a1.6 1.6 0 0 1-1.509-1.067 1.41 1.41 0 0 1-.1-.538v-6.745a1.608 1.608 0 0 1 1.6-1.6h33.265a1.445 1.445 0 0 1 .538.1.913.913 0 0 1 .2.087 1.53 1.53 0 0 1 .807.98.751.751 0 0 1 .048.211 1.859 1.859 0 0 1 .03.224z" class="cls-6" data-name="Path 372" transform="translate(-336.325 -394.247)"/>
                <path id="Rectangle_297" d="M1.558 0h32.208a1.558 1.558 0 0 1 1.558 1.558v5.688a1.672 1.672 0 0 1-1.672 1.672H1.558A1.558 1.558 0 0 1 0 7.36v-5.8A1.558 1.558 0 0 1 1.558 0z" class="cls-7" data-name="Rectangle 297" transform="translate(1.157 1.038)"/>
                <path id="Rectangle_298" d="M.51 0h.981A.51.51 0 0 1 2 .51V7.1a.511.511 0 0 1-.511.511H.511A.511.511 0 0 1 0 7.1V.51A.51.51 0 0 1 .51 0z" class="cls-8" data-name="Rectangle 298" transform="translate(4.463 .637)"/>
                <path id="Rectangle_299" d="M.51 0h.981A.51.51 0 0 1 2 .51V7.1a.511.511 0 0 1-.511.511H.51A.51.51 0 0 1 0 7.1V.51A.51.51 0 0 1 .51 0z" class="cls-9" data-name="Rectangle 299" transform="translate(.459 .637)"/>
                <path id="Rectangle_300" d="M.51 0h.981A.51.51 0 0 1 2 .51V7.1a.511.511 0 0 1-.511.511H.51A.51.51 0 0 1 0 7.1V.51A.51.51 0 0 1 .51 0z" class="cls-8" data-name="Rectangle 300" transform="translate(8.767 .637)"/>
                <path id="Rectangle_301" d="M.51 0h.981A.51.51 0 0 1 2 .51V7.1a.511.511 0 0 1-.511.511H.51A.51.51 0 0 1 0 7.1V.51A.51.51 0 0 1 .51 0z" class="cls-10" data-name="Rectangle 301" transform="translate(12.95 .637)"/>
                <g id="Group_382" data-name="Group 382" transform="translate(2.746 .377)">
                    <rect id="Rectangle_302" width="1.281" height="9.218" class="cls-11" data-name="Rectangle 302" rx=".433"/>
                    <rect id="Rectangle_303" width=".971" height="9.068" class="cls-12" data-name="Rectangle 303" rx=".374" transform="translate(.31 .15)"/>
                    <rect id="Rectangle_304" width="1.281" height="9.218" class="cls-11" data-name="Rectangle 304" rx=".433" transform="translate(4.244)"/>
                    <rect id="Rectangle_305" width=".971" height="9.068" class="cls-12" data-name="Rectangle 305" rx=".374" transform="translate(4.554 .15)"/>
                    <rect id="Rectangle_306" width="1.281" height="9.218" class="cls-11" data-name="Rectangle 306" rx=".433" transform="translate(8.488)"/>
                    <rect id="Rectangle_307" width=".971" height="9.068" class="cls-12" data-name="Rectangle 307" rx=".374" transform="translate(8.798 .15)"/>
                    <rect id="Rectangle_308" width="1.281" height="9.218" class="cls-11" data-name="Rectangle 308" rx=".433" transform="translate(12.731)"/>
                    <rect id="Rectangle_309" width=".971" height="9.068" class="cls-12" data-name="Rectangle 309" rx=".374" transform="translate(13.042 .15)"/>
                    <rect id="Rectangle_310" width="1.281" height="9.218" class="cls-11" data-name="Rectangle 310" rx=".433" transform="translate(16.975)"/>
                    <rect id="Rectangle_311" width=".971" height="9.068" class="cls-12" data-name="Rectangle 311" rx=".374" transform="translate(17.285 .15)"/>
                    <rect id="Rectangle_312" width="1.281" height="9.218" class="cls-11" data-name="Rectangle 312" rx=".433" transform="translate(21.219)"/>
                    <rect id="Rectangle_313" width=".971" height="9.068" class="cls-12" data-name="Rectangle 313" rx=".374" transform="translate(21.529 .15)"/>
                    <rect id="Rectangle_314" width="1.281" height="9.218" class="cls-11" data-name="Rectangle 314" rx=".433" transform="translate(25.463)"/>
                    <rect id="Rectangle_315" width=".971" height="9.068" class="cls-12" data-name="Rectangle 315" rx=".374" transform="translate(25.773 .15)"/>
                    <rect id="Rectangle_316" width="1.281" height="9.218" class="cls-11" data-name="Rectangle 316" rx=".433" transform="translate(29.707)"/>
                    <rect id="Rectangle_317" width=".971" height="9.068" class="cls-12" data-name="Rectangle 317" rx=".374" transform="translate(30.017 .15)"/>
                </g>
                <path id="Path_373" d="M372.793 395.621a.754.754 0 0 0-.048-.211 1.53 1.53 0 0 0-.807-.98.913.913 0 0 0-.2-.087 1.445 1.445 0 0 0-.538-.1h-8.648l.317.163a1.931 1.931 0 0 1 1.086 1.643v5.294a1.784 1.784 0 0 1-1.787 1.787h-25.743a1.6 1.6 0 0 0 1.509 1.067H371.2a1.61 1.61 0 0 0 1.614-1.6v-6.745a1.859 1.859 0 0 0-.021-.231z" class="cls-13" data-name="Path 373" transform="translate(-336.329 -394.247)"/>
            </g>
            <g id="Group_385" data-name="Group 385" transform="translate(44.272 25.884)">
                <path id="Path_374" d="M367.855 385.491v6.745a1.61 1.61 0 0 1-1.614 1.6h-33.265a1.6 1.6 0 0 1-1.509-1.067 1.41 1.41 0 0 1-.1-.538v-6.745a1.607 1.607 0 0 1 1.6-1.6h33.273a1.444 1.444 0 0 1 .538.1.914.914 0 0 1 .2.086 1.53 1.53 0 0 1 .807.98.753.753 0 0 1 .048.211 1.871 1.871 0 0 1 .022.228z" class="cls-6" data-name="Path 374" transform="translate(-331.371 -383.886)"/>
                <path id="Rectangle_318" d="M1.558 0h32.208a1.558 1.558 0 0 1 1.558 1.558v5.693a1.667 1.667 0 0 1-1.667 1.667H1.558A1.558 1.558 0 0 1 0 7.36v-5.8A1.558 1.558 0 0 1 1.558 0z" class="cls-7" data-name="Rectangle 318" transform="translate(1.158 1.037)"/>
                <rect id="Rectangle_319" width="2.002" height="7.607" class="cls-8" data-name="Rectangle 319" rx=".51" transform="translate(4.463 .637)"/>
                <path id="Rectangle_320" d="M.51 0h.981A.51.51 0 0 1 2 .51V7.1a.51.51 0 0 1-.51.51H.511A.511.511 0 0 1 0 7.1V.51A.51.51 0 0 1 .51 0z" class="cls-9" data-name="Rectangle 320" transform="translate(.459 .637)"/>
                <rect id="Rectangle_321" width="2.002" height="7.607" class="cls-8" data-name="Rectangle 321" rx=".51" transform="translate(8.767 .637)"/>
                <path id="Rectangle_322" d="M.51 0h.981A.51.51 0 0 1 2 .51V7.1a.51.51 0 0 1-.51.51H.511A.511.511 0 0 1 0 7.1V.51A.51.51 0 0 1 .51 0z" class="cls-10" data-name="Rectangle 322" transform="translate(12.951 .637)"/>
                <g id="Group_384" data-name="Group 384" transform="translate(2.746 .377)">
                    <rect id="Rectangle_323" width="1.281" height="9.218" class="cls-11" data-name="Rectangle 323" rx=".433"/>
                    <rect id="Rectangle_324" width=".971" height="9.068" class="cls-12" data-name="Rectangle 324" rx=".374" transform="translate(.31 .15)"/>
                    <rect id="Rectangle_325" width="1.281" height="9.218" class="cls-11" data-name="Rectangle 325" rx=".433" transform="translate(4.244)"/>
                    <rect id="Rectangle_326" width=".971" height="9.068" class="cls-12" data-name="Rectangle 326" rx=".374" transform="translate(4.554 .15)"/>
                    <rect id="Rectangle_327" width="1.281" height="9.218" class="cls-11" data-name="Rectangle 327" rx=".433" transform="translate(8.488)"/>
                    <rect id="Rectangle_328" width=".971" height="9.068" class="cls-12" data-name="Rectangle 328" rx=".374" transform="translate(8.798 .15)"/>
                    <rect id="Rectangle_329" width="1.281" height="9.218" class="cls-11" data-name="Rectangle 329" rx=".433" transform="translate(12.731)"/>
                    <rect id="Rectangle_330" width=".971" height="9.068" class="cls-12" data-name="Rectangle 330" rx=".374" transform="translate(13.042 .15)"/>
                    <rect id="Rectangle_331" width="1.281" height="9.218" class="cls-11" data-name="Rectangle 331" rx=".433" transform="translate(16.975)"/>
                    <rect id="Rectangle_332" width=".971" height="9.068" class="cls-12" data-name="Rectangle 332" rx=".374" transform="translate(17.285 .15)"/>
                    <rect id="Rectangle_333" width="1.281" height="9.218" class="cls-11" data-name="Rectangle 333" rx=".433" transform="translate(21.219)"/>
                    <rect id="Rectangle_334" width=".971" height="9.068" class="cls-12" data-name="Rectangle 334" rx=".374" transform="translate(21.529 .15)"/>
                    <rect id="Rectangle_335" width="1.281" height="9.218" class="cls-11" data-name="Rectangle 335" rx=".433" transform="translate(25.463)"/>
                    <rect id="Rectangle_336" width=".971" height="9.068" class="cls-12" data-name="Rectangle 336" rx=".374" transform="translate(25.773 .15)"/>
                    <rect id="Rectangle_337" width="1.281" height="9.218" class="cls-11" data-name="Rectangle 337" rx=".433" transform="translate(29.706)"/>
                    <rect id="Rectangle_338" width=".971" height="9.068" class="cls-12" data-name="Rectangle 338" rx=".374" transform="translate(30.017 .15)"/>
                </g>
                <path id="Path_375" d="M367.839 385.26a.754.754 0 0 0-.048-.211 1.53 1.53 0 0 0-.807-.98.914.914 0 0 0-.2-.086 1.444 1.444 0 0 0-.538-.1H357.6l.317.163a1.931 1.931 0 0 1 1.083 1.646v5.294a1.784 1.784 0 0 1-1.787 1.787h-25.742a1.6 1.6 0 0 0 1.509 1.067h33.265a1.61 1.61 0 0 0 1.614-1.6v-6.745a1.871 1.871 0 0 0-.02-.235z" class="cls-13" data-name="Path 375" transform="translate(-331.375 -383.886)"/>
            </g>
            <g id="Group_388" data-name="Group 388" transform="translate(13.867)">
                <circle id="Ellipse_33" cx="24.293" cy="24.293" r="24.293" class="cls-7" data-name="Ellipse 33" transform="rotate(-24.699 46.364 10.151)"/>
                <circle id="Ellipse_34" cx="17.486" cy="17.486" r="17.486" class="cls-11" data-name="Ellipse 34" transform="translate(14.735 14.735)"/>
                <circle id="Ellipse_35" cx="16.603" cy="16.603" r="16.603" class="cls-12" data-name="Ellipse 35" transform="translate(16.061 15.82)"/>
                <g id="Group_414" data-name="Group 414" transform="translate(19.689 22.362)">
                    <g id="Group_413" data-name="Group 413" font-family="Comfortaa-Bold, Comfortaa" font-size="18px" font-weight="700">
                        <text id="RP" fill="#f4821c" transform="translate(.737 16.216)">
                            <tspan x="0" y="0">RP</tspan>
                        </text>
                        <text id="RP-2" fill="#fcd222" data-name="RP" transform="translate(0 16)">
                            <tspan x="0" y="0">RP</tspan>
                        </text>
                    </g>
                </g>
                <path id="Path_378" d="M309.65 394.084s-3.521-23.413 20.156-27.726c0 0-17.428 4.136-20.156 27.726z" class="cls-8" data-name="Path 378" transform="translate(-300.108 -357.316)"/>
            </g>
        </g>
        <g id="Group_393" data-name="Group 393" transform="translate(3461 1791.789)">
            <g id="Group_371" data-name="Group 371" transform="translate(0 19.578)">
                <path id="Path_360" d="M144.578 402.868v6.745a1.61 1.61 0 0 1-1.614 1.6H109.7a1.6 1.6 0 0 1-1.509-1.067 1.41 1.41 0 0 1-.1-.538v-6.745a1.607 1.607 0 0 1 1.6-1.6h33.265a1.443 1.443 0 0 1 .538.1.912.912 0 0 1 .2.086 1.53 1.53 0 0 1 .807.98.755.755 0 0 1 .048.211 1.872 1.872 0 0 1 .029.228z" class="cls-6" data-name="Path 360" transform="translate(-108.094 -401.263)"/>
                <path id="Rectangle_171" d="M1.558 0h32.208a1.558 1.558 0 0 1 1.558 1.558v5.7a1.665 1.665 0 0 1-1.665 1.665H1.558A1.558 1.558 0 0 1 0 7.36v-5.8A1.558 1.558 0 0 1 1.558 0z" class="cls-7" data-name="Rectangle 171" transform="translate(1.158 1.038)"/>
                <path id="Rectangle_172" d="M.51 0h.981A.51.51 0 0 1 2 .51V7.1a.51.51 0 0 1-.51.51H.511A.511.511 0 0 1 0 7.1V.51A.51.51 0 0 1 .51 0z" class="cls-8" data-name="Rectangle 172" transform="translate(4.463 .637)"/>
                <rect id="Rectangle_173" width="2.002" height="7.607" class="cls-9" data-name="Rectangle 173" rx=".51" transform="translate(.46 .637)"/>
                <rect id="Rectangle_174" width="2.002" height="7.607" class="cls-8" data-name="Rectangle 174" rx=".51" transform="translate(8.767 .637)"/>
                <rect id="Rectangle_175" width="2.002" height="7.607" class="cls-10" data-name="Rectangle 175" rx=".51" transform="translate(12.951 .637)"/>
                <g id="Group_370" data-name="Group 370" transform="translate(2.746 .377)">
                    <rect id="Rectangle_176" width="1.281" height="9.218" class="cls-11" data-name="Rectangle 176" rx=".433"/>
                    <rect id="Rectangle_177" width=".971" height="9.068" class="cls-12" data-name="Rectangle 177" rx=".374" transform="translate(.31 .15)"/>
                    <rect id="Rectangle_178" width="1.281" height="9.218" class="cls-11" data-name="Rectangle 178" rx=".433" transform="translate(4.244)"/>
                    <rect id="Rectangle_179" width=".971" height="9.068" class="cls-12" data-name="Rectangle 179" rx=".374" transform="translate(4.554 .15)"/>
                    <rect id="Rectangle_180" width="1.281" height="9.218" class="cls-11" data-name="Rectangle 180" rx=".433" transform="translate(8.488)"/>
                    <rect id="Rectangle_181" width=".971" height="9.068" class="cls-12" data-name="Rectangle 181" rx=".374" transform="translate(8.798 .15)"/>
                    <rect id="Rectangle_182" width="1.281" height="9.218" class="cls-11" data-name="Rectangle 182" rx=".433" transform="translate(12.731)"/>
                    <rect id="Rectangle_183" width=".971" height="9.068" class="cls-12" data-name="Rectangle 183" rx=".374" transform="translate(13.042 .15)"/>
                    <rect id="Rectangle_184" width="1.281" height="9.218" class="cls-11" data-name="Rectangle 184" rx=".433" transform="translate(16.975)"/>
                    <rect id="Rectangle_185" width=".971" height="9.068" class="cls-12" data-name="Rectangle 185" rx=".374" transform="translate(17.285 .15)"/>
                    <rect id="Rectangle_186" width="1.281" height="9.218" class="cls-11" data-name="Rectangle 186" rx=".433" transform="translate(21.219)"/>
                    <rect id="Rectangle_187" width=".971" height="9.068" class="cls-12" data-name="Rectangle 187" rx=".374" transform="translate(21.529 .15)"/>
                    <rect id="Rectangle_188" width="1.281" height="9.218" class="cls-11" data-name="Rectangle 188" rx=".433" transform="translate(25.463)"/>
                    <rect id="Rectangle_189" width=".971" height="9.068" class="cls-12" data-name="Rectangle 189" rx=".374" transform="translate(25.773 .15)"/>
                    <rect id="Rectangle_190" width="1.281" height="9.218" class="cls-11" data-name="Rectangle 190" rx=".433" transform="translate(29.707)"/>
                    <rect id="Rectangle_191" width=".971" height="9.068" class="cls-12" data-name="Rectangle 191" rx=".374" transform="translate(30.017 .15)"/>
                </g>
                <path id="Path_361" d="M144.562 402.637a.755.755 0 0 0-.048-.211 1.53 1.53 0 0 0-.807-.98.912.912 0 0 0-.2-.086 1.443 1.443 0 0 0-.538-.1h-8.649l.317.163a1.931 1.931 0 0 1 1.086 1.643v5.294a1.784 1.784 0 0 1-1.787 1.787h-25.742a1.6 1.6 0 0 0 1.509 1.067h33.265a1.61 1.61 0 0 0 1.614-1.6v-6.745a1.869 1.869 0 0 0-.02-.232z" class="cls-13" data-name="Path 361" transform="translate(-108.098 -401.263)"/>
            </g>
            <g id="Group_373" data-name="Group 373" transform="translate(39.002 19.907)">
                <path id="Path_362" d="M185.169 406.21v6.745a1.61 1.61 0 0 1-1.614 1.6H150.29a1.6 1.6 0 0 1-1.509-1.067 1.41 1.41 0 0 1-.1-.538v-6.74a1.607 1.607 0 0 1 1.6-1.6h33.265a1.444 1.444 0 0 1 .538.1.912.912 0 0 1 .2.087 1.53 1.53 0 0 1 .807.98.754.754 0 0 1 .048.211 1.865 1.865 0 0 1 .03.222z" class="cls-6" data-name="Path 362" transform="translate(-148.685 -404.605)"/>
                <path id="Rectangle_192" d="M1.558 0h32.208a1.558 1.558 0 0 1 1.558 1.558v5.691a1.669 1.669 0 0 1-1.669 1.669H1.558A1.558 1.558 0 0 1 0 7.36v-5.8A1.558 1.558 0 0 1 1.558 0z" class="cls-7" data-name="Rectangle 192" transform="translate(1.158 1.038)"/>
                <rect id="Rectangle_193" width="2.002" height="7.607" class="cls-8" data-name="Rectangle 193" rx=".51" transform="translate(4.464 .637)"/>
                <rect id="Rectangle_194" width="2.002" height="7.607" class="cls-9" data-name="Rectangle 194" rx=".51" transform="translate(.46 .637)"/>
                <path id="Rectangle_195" d="M.51 0h.981A.511.511 0 0 1 2 .511V7.1a.51.51 0 0 1-.51.51H.51A.51.51 0 0 1 0 7.1V.51A.51.51 0 0 1 .51 0z" class="cls-8" data-name="Rectangle 195" transform="translate(8.767 .637)"/>
                <rect id="Rectangle_196" width="2.002" height="7.607" class="cls-10" data-name="Rectangle 196" rx=".51" transform="translate(12.951 .637)"/>
                <g id="Group_372" data-name="Group 372" transform="translate(2.747 .377)">
                    <rect id="Rectangle_197" width="1.281" height="9.218" class="cls-11" data-name="Rectangle 197" rx=".433"/>
                    <rect id="Rectangle_198" width=".971" height="9.068" class="cls-12" data-name="Rectangle 198" rx=".374" transform="translate(.31 .15)"/>
                    <rect id="Rectangle_199" width="1.281" height="9.218" class="cls-11" data-name="Rectangle 199" rx=".433" transform="translate(4.244)"/>
                    <rect id="Rectangle_200" width=".971" height="9.068" class="cls-12" data-name="Rectangle 200" rx=".374" transform="translate(4.554 .15)"/>
                    <rect id="Rectangle_201" width="1.281" height="9.218" class="cls-11" data-name="Rectangle 201" rx=".433" transform="translate(8.488)"/>
                    <rect id="Rectangle_202" width=".971" height="9.068" class="cls-12" data-name="Rectangle 202" rx=".374" transform="translate(8.798 .15)"/>
                    <rect id="Rectangle_203" width="1.281" height="9.218" class="cls-11" data-name="Rectangle 203" rx=".433" transform="translate(12.731)"/>
                    <rect id="Rectangle_204" width=".971" height="9.068" class="cls-12" data-name="Rectangle 204" rx=".374" transform="translate(13.042 .15)"/>
                    <rect id="Rectangle_205" width="1.281" height="9.218" class="cls-11" data-name="Rectangle 205" rx=".433" transform="translate(16.975)"/>
                    <rect id="Rectangle_206" width=".971" height="9.068" class="cls-12" data-name="Rectangle 206" rx=".374" transform="translate(17.285 .15)"/>
                    <rect id="Rectangle_207" width="1.281" height="9.218" class="cls-11" data-name="Rectangle 207" rx=".433" transform="translate(21.219)"/>
                    <rect id="Rectangle_208" width=".971" height="9.068" class="cls-12" data-name="Rectangle 208" rx=".374" transform="translate(21.529 .15)"/>
                    <rect id="Rectangle_209" width="1.281" height="9.218" class="cls-11" data-name="Rectangle 209" rx=".433" transform="translate(25.463)"/>
                    <rect id="Rectangle_210" width=".971" height="9.068" class="cls-12" data-name="Rectangle 210" rx=".374" transform="translate(25.773 .15)"/>
                    <rect id="Rectangle_211" width="1.281" height="9.218" class="cls-11" data-name="Rectangle 211" rx=".433" transform="translate(29.707)"/>
                    <rect id="Rectangle_212" width=".971" height="9.068" class="cls-12" data-name="Rectangle 212" rx=".374" transform="translate(30.017 .15)"/>
                </g>
                <path id="Path_363" d="M185.153 405.979a.754.754 0 0 0-.048-.211 1.53 1.53 0 0 0-.807-.98.912.912 0 0 0-.2-.087 1.445 1.445 0 0 0-.538-.1h-8.648l.317.163a1.931 1.931 0 0 1 1.086 1.643v5.294a1.784 1.784 0 0 1-1.787 1.787h-25.743a1.6 1.6 0 0 0 1.509 1.067h33.265a1.61 1.61 0 0 0 1.614-1.6v-6.745a1.862 1.862 0 0 0-.02-.231z" class="cls-13" data-name="Path 363" transform="translate(-148.689 -404.605)"/>
            </g>
            <g id="Group_375" data-name="Group 375" transform="translate(37.52 9.954)">
                <path id="Path_364" d="M183.626 395.851v6.749a1.61 1.61 0 0 1-1.614 1.6h-33.265a1.6 1.6 0 0 1-1.509-1.067 1.41 1.41 0 0 1-.1-.538v-6.745a1.607 1.607 0 0 1 1.6-1.6h33.265a1.444 1.444 0 0 1 .538.1.913.913 0 0 1 .2.086 1.53 1.53 0 0 1 .807.98.754.754 0 0 1 .048.211 1.861 1.861 0 0 1 .03.224z" class="cls-6" data-name="Path 364" transform="translate(-147.142 -394.246)"/>
                <path id="Rectangle_213" d="M1.558 0h32.208a1.558 1.558 0 0 1 1.558 1.558V7.25a1.668 1.668 0 0 1-1.668 1.668H1.558A1.558 1.558 0 0 1 0 7.36v-5.8A1.558 1.558 0 0 1 1.558 0z" class="cls-7" data-name="Rectangle 213" transform="translate(1.157 1.037)"/>
                <path id="Rectangle_214" d="M.511 0h.981A.51.51 0 0 1 2 .51V7.1a.51.51 0 0 1-.51.51H.51A.51.51 0 0 1 0 7.1V.511A.511.511 0 0 1 .511 0z" class="cls-8" data-name="Rectangle 214" transform="translate(4.463 .637)"/>
                <path id="Rectangle_215" d="M.511 0h.981A.51.51 0 0 1 2 .51V7.1a.51.51 0 0 1-.51.51H.51A.51.51 0 0 1 0 7.1V.511A.511.511 0 0 1 .511 0z" class="cls-9" data-name="Rectangle 215" transform="translate(.459 .637)"/>
                <path id="Rectangle_216" d="M.511 0h.981A.511.511 0 0 1 2 .511V7.1a.51.51 0 0 1-.51.51H.51A.51.51 0 0 1 0 7.1V.511A.511.511 0 0 1 .511 0z" class="cls-8" data-name="Rectangle 216" transform="translate(8.767 .637)"/>
                <path id="Rectangle_217" d="M.511 0h.981A.51.51 0 0 1 2 .51V7.1a.51.51 0 0 1-.51.51H.51A.51.51 0 0 1 0 7.1V.511A.511.511 0 0 1 .511 0z" class="cls-10" data-name="Rectangle 217" transform="translate(12.951 .637)"/>
                <g id="Group_374" data-name="Group 374" transform="translate(2.746 .377)">
                    <rect id="Rectangle_218" width="1.281" height="9.218" class="cls-11" data-name="Rectangle 218" rx=".433"/>
                    <rect id="Rectangle_219" width=".971" height="9.068" class="cls-12" data-name="Rectangle 219" rx=".374" transform="translate(.31 .15)"/>
                    <rect id="Rectangle_220" width="1.281" height="9.218" class="cls-11" data-name="Rectangle 220" rx=".433" transform="translate(4.244)"/>
                    <rect id="Rectangle_221" width=".971" height="9.068" class="cls-12" data-name="Rectangle 221" rx=".374" transform="translate(4.554 .15)"/>
                    <rect id="Rectangle_222" width="1.281" height="9.218" class="cls-11" data-name="Rectangle 222" rx=".433" transform="translate(8.488)"/>
                    <rect id="Rectangle_223" width=".971" height="9.068" class="cls-12" data-name="Rectangle 223" rx=".374" transform="translate(8.798 .15)"/>
                    <rect id="Rectangle_224" width="1.281" height="9.218" class="cls-11" data-name="Rectangle 224" rx=".433" transform="translate(12.731)"/>
                    <rect id="Rectangle_225" width=".971" height="9.068" class="cls-12" data-name="Rectangle 225" rx=".374" transform="translate(13.042 .15)"/>
                    <rect id="Rectangle_226" width="1.281" height="9.218" class="cls-11" data-name="Rectangle 226" rx=".433" transform="translate(16.975)"/>
                    <rect id="Rectangle_227" width=".971" height="9.068" class="cls-12" data-name="Rectangle 227" rx=".374" transform="translate(17.285 .15)"/>
                    <rect id="Rectangle_228" width="1.281" height="9.218" class="cls-11" data-name="Rectangle 228" rx=".433" transform="translate(21.219)"/>
                    <rect id="Rectangle_229" width=".971" height="9.068" class="cls-12" data-name="Rectangle 229" rx=".374" transform="translate(21.529 .15)"/>
                    <rect id="Rectangle_230" width="1.281" height="9.218" class="cls-11" data-name="Rectangle 230" rx=".433" transform="translate(25.463)"/>
                    <rect id="Rectangle_231" width=".971" height="9.068" class="cls-12" data-name="Rectangle 231" rx=".374" transform="translate(25.773 .15)"/>
                    <rect id="Rectangle_232" width="1.281" height="9.218" class="cls-11" data-name="Rectangle 232" rx=".433" transform="translate(29.706)"/>
                    <rect id="Rectangle_233" width=".971" height="9.068" class="cls-12" data-name="Rectangle 233" rx=".374" transform="translate(30.017 .15)"/>
                </g>
                <path id="Path_365" d="M183.61 395.62a.754.754 0 0 0-.048-.211 1.53 1.53 0 0 0-.807-.98.913.913 0 0 0-.2-.086 1.444 1.444 0 0 0-.538-.1h-8.648l.317.163a1.931 1.931 0 0 1 1.086 1.643v5.294a1.784 1.784 0 0 1-1.787 1.787h-25.743a1.6 1.6 0 0 0 1.509 1.067h33.265a1.61 1.61 0 0 0 1.614-1.6v-6.745a1.861 1.861 0 0 0-.02-.232z" class="cls-13" data-name="Path 365" transform="translate(-147.146 -394.246)"/>
            </g>
            <g id="Group_377" data-name="Group 377" transform="translate(38.097)">
                <path id="Path_366" d="M184.227 385.492v6.745a1.61 1.61 0 0 1-1.614 1.6h-33.265a1.6 1.6 0 0 1-1.509-1.067 1.409 1.409 0 0 1-.1-.538v-6.745a1.607 1.607 0 0 1 1.6-1.6h33.265a1.444 1.444 0 0 1 .538.1.912.912 0 0 1 .2.086 1.53 1.53 0 0 1 .807.98.754.754 0 0 1 .048.211 1.865 1.865 0 0 1 .03.228z" class="cls-6" data-name="Path 366" transform="translate(-147.743 -383.887)"/>
                <path id="Rectangle_234" d="M1.558 0h32.208a1.558 1.558 0 0 1 1.558 1.558V7.25a1.668 1.668 0 0 1-1.668 1.668H1.558A1.558 1.558 0 0 1 0 7.36v-5.8A1.558 1.558 0 0 1 1.558 0z" class="cls-7" data-name="Rectangle 234" transform="translate(1.158 1.038)"/>
                <path id="Rectangle_235" d="M.51 0h.981A.51.51 0 0 1 2 .51V7.1a.511.511 0 0 1-.511.511H.51A.51.51 0 0 1 0 7.1V.51A.51.51 0 0 1 .51 0z" class="cls-8" data-name="Rectangle 235" transform="translate(4.463 .637)"/>
                <path id="Rectangle_236" d="M.51 0h.981A.51.51 0 0 1 2 .51V7.1a.511.511 0 0 1-.511.511H.51A.51.51 0 0 1 0 7.1V.51A.51.51 0 0 1 .51 0z" class="cls-9" data-name="Rectangle 236" transform="translate(.46 .637)"/>
                <path id="Rectangle_237" d="M.51 0h.981A.51.51 0 0 1 2 .51V7.1a.511.511 0 0 1-.511.511H.51A.51.51 0 0 1 0 7.1V.51A.51.51 0 0 1 .51 0z" class="cls-8" data-name="Rectangle 237" transform="translate(8.767 .637)"/>
                <path id="Rectangle_238" d="M.51 0h.981A.51.51 0 0 1 2 .51V7.1a.511.511 0 0 1-.511.511H.51A.51.51 0 0 1 0 7.1V.51A.51.51 0 0 1 .51 0z" class="cls-10" data-name="Rectangle 238" transform="translate(12.951 .637)"/>
                <g id="Group_376" data-name="Group 376" transform="translate(2.746 .377)">
                    <rect id="Rectangle_239" width="1.281" height="9.218" class="cls-11" data-name="Rectangle 239" rx=".433"/>
                    <rect id="Rectangle_240" width=".971" height="9.068" class="cls-12" data-name="Rectangle 240" rx=".374" transform="translate(.31 .15)"/>
                    <rect id="Rectangle_241" width="1.281" height="9.218" class="cls-11" data-name="Rectangle 241" rx=".433" transform="translate(4.244)"/>
                    <rect id="Rectangle_242" width=".971" height="9.068" class="cls-12" data-name="Rectangle 242" rx=".374" transform="translate(4.554 .15)"/>
                    <rect id="Rectangle_243" width="1.281" height="9.218" class="cls-11" data-name="Rectangle 243" rx=".433" transform="translate(8.488)"/>
                    <rect id="Rectangle_244" width=".971" height="9.068" class="cls-12" data-name="Rectangle 244" rx=".374" transform="translate(8.798 .15)"/>
                    <rect id="Rectangle_245" width="1.281" height="9.218" class="cls-11" data-name="Rectangle 245" rx=".433" transform="translate(12.731)"/>
                    <rect id="Rectangle_246" width=".971" height="9.068" class="cls-12" data-name="Rectangle 246" rx=".374" transform="translate(13.042 .15)"/>
                    <rect id="Rectangle_247" width="1.281" height="9.218" class="cls-11" data-name="Rectangle 247" rx=".433" transform="translate(16.975)"/>
                    <rect id="Rectangle_248" width=".971" height="9.068" class="cls-12" data-name="Rectangle 248" rx=".374" transform="translate(17.285 .15)"/>
                    <rect id="Rectangle_249" width="1.281" height="9.218" class="cls-11" data-name="Rectangle 249" rx=".433" transform="translate(21.219)"/>
                    <rect id="Rectangle_250" width=".971" height="9.068" class="cls-12" data-name="Rectangle 250" rx=".374" transform="translate(21.529 .15)"/>
                    <rect id="Rectangle_251" width="1.281" height="9.218" class="cls-11" data-name="Rectangle 251" rx=".433" transform="translate(25.463)"/>
                    <rect id="Rectangle_252" width=".971" height="9.068" class="cls-12" data-name="Rectangle 252" rx=".374" transform="translate(25.773 .15)"/>
                    <rect id="Rectangle_253" width="1.281" height="9.218" class="cls-11" data-name="Rectangle 253" rx=".433" transform="translate(29.707)"/>
                    <rect id="Rectangle_254" width=".971" height="9.068" class="cls-12" data-name="Rectangle 254" rx=".374" transform="translate(30.017 .15)"/>
                </g>
                <path id="Path_367" d="M184.211 385.261a.754.754 0 0 0-.048-.211 1.53 1.53 0 0 0-.807-.98.911.911 0 0 0-.2-.086 1.444 1.444 0 0 0-.538-.1h-8.648l.317.163a1.931 1.931 0 0 1 1.086 1.643v5.294a1.784 1.784 0 0 1-1.787 1.787h-25.743a1.6 1.6 0 0 0 1.509 1.067h33.265a1.61 1.61 0 0 0 1.614-1.6v-6.745a1.859 1.859 0 0 0-.02-.232z" class="cls-13" data-name="Path 367" transform="translate(-147.747 -383.887)"/>
            </g>
        </g>
        <g id="Group_395" data-name="Group 395" transform="translate(3487.904 1781.91)">
            <g id="Group_371-2" data-name="Group 371" transform="translate(0 29.458)">
                <path id="Path_360-2" d="M144.578 402.868v6.745a1.61 1.61 0 0 1-1.614 1.6H109.7a1.6 1.6 0 0 1-1.509-1.067 1.41 1.41 0 0 1-.1-.538v-6.745a1.607 1.607 0 0 1 1.6-1.6h33.265a1.443 1.443 0 0 1 .538.1.912.912 0 0 1 .2.086 1.53 1.53 0 0 1 .807.98.755.755 0 0 1 .048.211 1.872 1.872 0 0 1 .029.228z" class="cls-6" data-name="Path 360" transform="translate(-108.094 -401.263)"/>
                <path id="Rectangle_171-2" d="M1.558 0h32.208a1.558 1.558 0 0 1 1.558 1.558v5.7a1.665 1.665 0 0 1-1.665 1.665H1.558A1.558 1.558 0 0 1 0 7.36v-5.8A1.558 1.558 0 0 1 1.558 0z" class="cls-7" data-name="Rectangle 171" transform="translate(1.158 1.038)"/>
                <path id="Rectangle_172-2" d="M.51 0h.981A.51.51 0 0 1 2 .51V7.1a.51.51 0 0 1-.51.51H.511A.511.511 0 0 1 0 7.1V.51A.51.51 0 0 1 .51 0z" class="cls-8" data-name="Rectangle 172" transform="translate(4.463 .637)"/>
                <rect id="Rectangle_173-2" width="2.002" height="7.607" class="cls-9" data-name="Rectangle 173" rx=".51" transform="translate(.46 .637)"/>
                <rect id="Rectangle_174-2" width="2.002" height="7.607" class="cls-8" data-name="Rectangle 174" rx=".51" transform="translate(8.767 .637)"/>
                <rect id="Rectangle_175-2" width="2.002" height="7.607" class="cls-10" data-name="Rectangle 175" rx=".51" transform="translate(12.951 .637)"/>
                <g id="Group_370-2" data-name="Group 370" transform="translate(2.746 .377)">
                    <rect id="Rectangle_176-2" width="1.281" height="9.218" class="cls-11" data-name="Rectangle 176" rx=".433"/>
                    <rect id="Rectangle_177-2" width=".971" height="9.068" class="cls-12" data-name="Rectangle 177" rx=".374" transform="translate(.31 .15)"/>
                    <rect id="Rectangle_178-2" width="1.281" height="9.218" class="cls-11" data-name="Rectangle 178" rx=".433" transform="translate(4.244)"/>
                    <rect id="Rectangle_179-2" width=".971" height="9.068" class="cls-12" data-name="Rectangle 179" rx=".374" transform="translate(4.554 .15)"/>
                    <rect id="Rectangle_180-2" width="1.281" height="9.218" class="cls-11" data-name="Rectangle 180" rx=".433" transform="translate(8.488)"/>
                    <rect id="Rectangle_181-2" width=".971" height="9.068" class="cls-12" data-name="Rectangle 181" rx=".374" transform="translate(8.798 .15)"/>
                    <rect id="Rectangle_182-2" width="1.281" height="9.218" class="cls-11" data-name="Rectangle 182" rx=".433" transform="translate(12.731)"/>
                    <rect id="Rectangle_183-2" width=".971" height="9.068" class="cls-12" data-name="Rectangle 183" rx=".374" transform="translate(13.042 .15)"/>
                    <rect id="Rectangle_184-2" width="1.281" height="9.218" class="cls-11" data-name="Rectangle 184" rx=".433" transform="translate(16.975)"/>
                    <rect id="Rectangle_185-2" width=".971" height="9.068" class="cls-12" data-name="Rectangle 185" rx=".374" transform="translate(17.285 .15)"/>
                    <rect id="Rectangle_186-2" width="1.281" height="9.218" class="cls-11" data-name="Rectangle 186" rx=".433" transform="translate(21.219)"/>
                    <rect id="Rectangle_187-2" width=".971" height="9.068" class="cls-12" data-name="Rectangle 187" rx=".374" transform="translate(21.529 .15)"/>
                    <rect id="Rectangle_188-2" width="1.281" height="9.218" class="cls-11" data-name="Rectangle 188" rx=".433" transform="translate(25.463)"/>
                    <rect id="Rectangle_189-2" width=".971" height="9.068" class="cls-12" data-name="Rectangle 189" rx=".374" transform="translate(25.773 .15)"/>
                    <rect id="Rectangle_190-2" width="1.281" height="9.218" class="cls-11" data-name="Rectangle 190" rx=".433" transform="translate(29.707)"/>
                    <rect id="Rectangle_191-2" width=".971" height="9.068" class="cls-12" data-name="Rectangle 191" rx=".374" transform="translate(30.017 .15)"/>
                </g>
                <path id="Path_361-2" d="M144.562 402.637a.755.755 0 0 0-.048-.211 1.53 1.53 0 0 0-.807-.98.912.912 0 0 0-.2-.086 1.443 1.443 0 0 0-.538-.1h-8.649l.317.163a1.931 1.931 0 0 1 1.086 1.643v5.294a1.784 1.784 0 0 1-1.787 1.787h-25.742a1.6 1.6 0 0 0 1.509 1.067h33.265a1.61 1.61 0 0 0 1.614-1.6v-6.745a1.869 1.869 0 0 0-.02-.232z" class="cls-13" data-name="Path 361" transform="translate(-108.098 -401.263)"/>
            </g>
            <g id="Group_373-2" data-name="Group 373" transform="translate(39.002 29.787)">
                <path id="Path_362-2" d="M185.169 406.21v6.745a1.61 1.61 0 0 1-1.614 1.6H150.29a1.6 1.6 0 0 1-1.509-1.067 1.41 1.41 0 0 1-.1-.538v-6.74a1.607 1.607 0 0 1 1.6-1.6h33.265a1.444 1.444 0 0 1 .538.1.912.912 0 0 1 .2.087 1.53 1.53 0 0 1 .807.98.754.754 0 0 1 .048.211 1.865 1.865 0 0 1 .03.222z" class="cls-6" data-name="Path 362" transform="translate(-148.685 -404.605)"/>
                <path id="Rectangle_192-2" d="M1.558 0h32.208a1.558 1.558 0 0 1 1.558 1.558v5.691a1.669 1.669 0 0 1-1.669 1.669H1.558A1.558 1.558 0 0 1 0 7.36v-5.8A1.558 1.558 0 0 1 1.558 0z" class="cls-7" data-name="Rectangle 192" transform="translate(1.158 1.038)"/>
                <rect id="Rectangle_193-2" width="2.002" height="7.607" class="cls-8" data-name="Rectangle 193" rx=".51" transform="translate(4.464 .637)"/>
                <rect id="Rectangle_194-2" width="2.002" height="7.607" class="cls-9" data-name="Rectangle 194" rx=".51" transform="translate(.46 .637)"/>
                <path id="Rectangle_195-2" d="M.51 0h.981A.511.511 0 0 1 2 .511V7.1a.51.51 0 0 1-.51.51H.51A.51.51 0 0 1 0 7.1V.51A.51.51 0 0 1 .51 0z" class="cls-8" data-name="Rectangle 195" transform="translate(8.767 .637)"/>
                <rect id="Rectangle_196-2" width="2.002" height="7.607" class="cls-10" data-name="Rectangle 196" rx=".51" transform="translate(12.951 .637)"/>
                <g id="Group_372-2" data-name="Group 372" transform="translate(2.747 .377)">
                    <rect id="Rectangle_197-2" width="1.281" height="9.218" class="cls-11" data-name="Rectangle 197" rx=".433"/>
                    <rect id="Rectangle_198-2" width=".971" height="9.068" class="cls-12" data-name="Rectangle 198" rx=".374" transform="translate(.31 .15)"/>
                    <rect id="Rectangle_199-2" width="1.281" height="9.218" class="cls-11" data-name="Rectangle 199" rx=".433" transform="translate(4.244)"/>
                    <rect id="Rectangle_200-2" width=".971" height="9.068" class="cls-12" data-name="Rectangle 200" rx=".374" transform="translate(4.554 .15)"/>
                    <rect id="Rectangle_201-2" width="1.281" height="9.218" class="cls-11" data-name="Rectangle 201" rx=".433" transform="translate(8.488)"/>
                    <rect id="Rectangle_202-2" width=".971" height="9.068" class="cls-12" data-name="Rectangle 202" rx=".374" transform="translate(8.798 .15)"/>
                    <rect id="Rectangle_203-2" width="1.281" height="9.218" class="cls-11" data-name="Rectangle 203" rx=".433" transform="translate(12.731)"/>
                    <rect id="Rectangle_204-2" width=".971" height="9.068" class="cls-12" data-name="Rectangle 204" rx=".374" transform="translate(13.042 .15)"/>
                    <rect id="Rectangle_205-2" width="1.281" height="9.218" class="cls-11" data-name="Rectangle 205" rx=".433" transform="translate(16.975)"/>
                    <rect id="Rectangle_206-2" width=".971" height="9.068" class="cls-12" data-name="Rectangle 206" rx=".374" transform="translate(17.285 .15)"/>
                    <rect id="Rectangle_207-2" width="1.281" height="9.218" class="cls-11" data-name="Rectangle 207" rx=".433" transform="translate(21.219)"/>
                    <rect id="Rectangle_208-2" width=".971" height="9.068" class="cls-12" data-name="Rectangle 208" rx=".374" transform="translate(21.529 .15)"/>
                    <rect id="Rectangle_209-2" width="1.281" height="9.218" class="cls-11" data-name="Rectangle 209" rx=".433" transform="translate(25.463)"/>
                    <rect id="Rectangle_210-2" width=".971" height="9.068" class="cls-12" data-name="Rectangle 210" rx=".374" transform="translate(25.773 .15)"/>
                    <rect id="Rectangle_211-2" width="1.281" height="9.218" class="cls-11" data-name="Rectangle 211" rx=".433" transform="translate(29.707)"/>
                    <rect id="Rectangle_212-2" width=".971" height="9.068" class="cls-12" data-name="Rectangle 212" rx=".374" transform="translate(30.017 .15)"/>
                </g>
                <path id="Path_363-2" d="M185.153 405.979a.754.754 0 0 0-.048-.211 1.53 1.53 0 0 0-.807-.98.912.912 0 0 0-.2-.087 1.445 1.445 0 0 0-.538-.1h-8.648l.317.163a1.931 1.931 0 0 1 1.086 1.643v5.294a1.784 1.784 0 0 1-1.787 1.787h-25.743a1.6 1.6 0 0 0 1.509 1.067h33.265a1.61 1.61 0 0 0 1.614-1.6v-6.745a1.862 1.862 0 0 0-.02-.231z" class="cls-13" data-name="Path 363" transform="translate(-148.689 -404.605)"/>
            </g>
            <g id="Group_397" data-name="Group 397" transform="translate(35.159)">
                <path id="Path_362-3" d="M185.169 406.21v6.745a1.61 1.61 0 0 1-1.614 1.6H150.29a1.6 1.6 0 0 1-1.509-1.067 1.41 1.41 0 0 1-.1-.538v-6.74a1.607 1.607 0 0 1 1.6-1.6h33.265a1.444 1.444 0 0 1 .538.1.912.912 0 0 1 .2.087 1.53 1.53 0 0 1 .807.98.754.754 0 0 1 .048.211 1.865 1.865 0 0 1 .03.222z" class="cls-6" data-name="Path 362" transform="translate(-148.685 -404.605)"/>
                <path id="Rectangle_192-3" d="M1.558 0h32.208a1.558 1.558 0 0 1 1.558 1.558v5.691a1.669 1.669 0 0 1-1.669 1.669H1.558A1.558 1.558 0 0 1 0 7.36v-5.8A1.558 1.558 0 0 1 1.558 0z" class="cls-7" data-name="Rectangle 192" transform="translate(1.158 1.038)"/>
                <rect id="Rectangle_193-3" width="2.002" height="7.607" class="cls-8" data-name="Rectangle 193" rx=".51" transform="translate(4.464 .637)"/>
                <rect id="Rectangle_194-3" width="2.002" height="7.607" class="cls-9" data-name="Rectangle 194" rx=".51" transform="translate(.46 .637)"/>
                <path id="Rectangle_195-3" d="M.51 0h.981A.511.511 0 0 1 2 .511V7.1a.51.51 0 0 1-.51.51H.51A.51.51 0 0 1 0 7.1V.51A.51.51 0 0 1 .51 0z" class="cls-8" data-name="Rectangle 195" transform="translate(8.767 .637)"/>
                <rect id="Rectangle_196-3" width="2.002" height="7.607" class="cls-10" data-name="Rectangle 196" rx=".51" transform="translate(12.951 .637)"/>
                <g id="Group_372-3" data-name="Group 372" transform="translate(2.747 .377)">
                    <rect id="Rectangle_197-3" width="1.281" height="9.218" class="cls-11" data-name="Rectangle 197" rx=".433"/>
                    <rect id="Rectangle_198-3" width=".971" height="9.068" class="cls-12" data-name="Rectangle 198" rx=".374" transform="translate(.31 .15)"/>
                    <rect id="Rectangle_199-3" width="1.281" height="9.218" class="cls-11" data-name="Rectangle 199" rx=".433" transform="translate(4.244)"/>
                    <rect id="Rectangle_200-3" width=".971" height="9.068" class="cls-12" data-name="Rectangle 200" rx=".374" transform="translate(4.554 .15)"/>
                    <rect id="Rectangle_201-3" width="1.281" height="9.218" class="cls-11" data-name="Rectangle 201" rx=".433" transform="translate(8.488)"/>
                    <rect id="Rectangle_202-3" width=".971" height="9.068" class="cls-12" data-name="Rectangle 202" rx=".374" transform="translate(8.798 .15)"/>
                    <rect id="Rectangle_203-3" width="1.281" height="9.218" class="cls-11" data-name="Rectangle 203" rx=".433" transform="translate(12.731)"/>
                    <rect id="Rectangle_204-3" width=".971" height="9.068" class="cls-12" data-name="Rectangle 204" rx=".374" transform="translate(13.042 .15)"/>
                    <rect id="Rectangle_205-3" width="1.281" height="9.218" class="cls-11" data-name="Rectangle 205" rx=".433" transform="translate(16.975)"/>
                    <rect id="Rectangle_206-3" width=".971" height="9.068" class="cls-12" data-name="Rectangle 206" rx=".374" transform="translate(17.285 .15)"/>
                    <rect id="Rectangle_207-3" width="1.281" height="9.218" class="cls-11" data-name="Rectangle 207" rx=".433" transform="translate(21.219)"/>
                    <rect id="Rectangle_208-3" width=".971" height="9.068" class="cls-12" data-name="Rectangle 208" rx=".374" transform="translate(21.529 .15)"/>
                    <rect id="Rectangle_209-3" width="1.281" height="9.218" class="cls-11" data-name="Rectangle 209" rx=".433" transform="translate(25.463)"/>
                    <rect id="Rectangle_210-3" width=".971" height="9.068" class="cls-12" data-name="Rectangle 210" rx=".374" transform="translate(25.773 .15)"/>
                    <rect id="Rectangle_211-3" width="1.281" height="9.218" class="cls-11" data-name="Rectangle 211" rx=".433" transform="translate(29.707)"/>
                    <rect id="Rectangle_212-3" width=".971" height="9.068" class="cls-12" data-name="Rectangle 212" rx=".374" transform="translate(30.017 .15)"/>
                </g>
                <path id="Path_363-3" d="M185.153 405.979a.754.754 0 0 0-.048-.211 1.53 1.53 0 0 0-.807-.98.912.912 0 0 0-.2-.087 1.445 1.445 0 0 0-.538-.1h-8.648l.317.163a1.931 1.931 0 0 1 1.086 1.643v5.294a1.784 1.784 0 0 1-1.787 1.787h-25.743a1.6 1.6 0 0 0 1.509 1.067h33.265a1.61 1.61 0 0 0 1.614-1.6v-6.745a1.862 1.862 0 0 0-.02-.231z" class="cls-13" data-name="Path 363" transform="translate(-148.689 -404.605)"/>
            </g>
            <g id="Group_375-2" data-name="Group 375" transform="translate(37.52 19.833)">
                <path id="Path_364-2" d="M183.626 395.851v6.749a1.61 1.61 0 0 1-1.614 1.6h-33.265a1.6 1.6 0 0 1-1.509-1.067 1.41 1.41 0 0 1-.1-.538v-6.745a1.607 1.607 0 0 1 1.6-1.6h33.265a1.444 1.444 0 0 1 .538.1.913.913 0 0 1 .2.086 1.53 1.53 0 0 1 .807.98.754.754 0 0 1 .048.211 1.861 1.861 0 0 1 .03.224z" class="cls-6" data-name="Path 364" transform="translate(-147.142 -394.246)"/>
                <path id="Rectangle_213-2" d="M1.558 0h32.208a1.558 1.558 0 0 1 1.558 1.558V7.25a1.668 1.668 0 0 1-1.668 1.668H1.558A1.558 1.558 0 0 1 0 7.36v-5.8A1.558 1.558 0 0 1 1.558 0z" class="cls-7" data-name="Rectangle 213" transform="translate(1.157 1.037)"/>
                <path id="Rectangle_214-2" d="M.511 0h.981A.51.51 0 0 1 2 .51V7.1a.51.51 0 0 1-.51.51H.51A.51.51 0 0 1 0 7.1V.511A.511.511 0 0 1 .511 0z" class="cls-8" data-name="Rectangle 214" transform="translate(4.463 .637)"/>
                <path id="Rectangle_215-2" d="M.511 0h.981A.51.51 0 0 1 2 .51V7.1a.51.51 0 0 1-.51.51H.51A.51.51 0 0 1 0 7.1V.511A.511.511 0 0 1 .511 0z" class="cls-9" data-name="Rectangle 215" transform="translate(.459 .637)"/>
                <path id="Rectangle_216-2" d="M.511 0h.981A.511.511 0 0 1 2 .511V7.1a.51.51 0 0 1-.51.51H.51A.51.51 0 0 1 0 7.1V.511A.511.511 0 0 1 .511 0z" class="cls-8" data-name="Rectangle 216" transform="translate(8.767 .637)"/>
                <path id="Rectangle_217-2" d="M.511 0h.981A.51.51 0 0 1 2 .51V7.1a.51.51 0 0 1-.51.51H.51A.51.51 0 0 1 0 7.1V.511A.511.511 0 0 1 .511 0z" class="cls-10" data-name="Rectangle 217" transform="translate(12.951 .637)"/>
                <g id="Group_374-2" data-name="Group 374" transform="translate(2.746 .377)">
                    <rect id="Rectangle_218-2" width="1.281" height="9.218" class="cls-11" data-name="Rectangle 218" rx=".433"/>
                    <rect id="Rectangle_219-2" width=".971" height="9.068" class="cls-12" data-name="Rectangle 219" rx=".374" transform="translate(.31 .15)"/>
                    <rect id="Rectangle_220-2" width="1.281" height="9.218" class="cls-11" data-name="Rectangle 220" rx=".433" transform="translate(4.244)"/>
                    <rect id="Rectangle_221-2" width=".971" height="9.068" class="cls-12" data-name="Rectangle 221" rx=".374" transform="translate(4.554 .15)"/>
                    <rect id="Rectangle_222-2" width="1.281" height="9.218" class="cls-11" data-name="Rectangle 222" rx=".433" transform="translate(8.488)"/>
                    <rect id="Rectangle_223-2" width=".971" height="9.068" class="cls-12" data-name="Rectangle 223" rx=".374" transform="translate(8.798 .15)"/>
                    <rect id="Rectangle_224-2" width="1.281" height="9.218" class="cls-11" data-name="Rectangle 224" rx=".433" transform="translate(12.731)"/>
                    <rect id="Rectangle_225-2" width=".971" height="9.068" class="cls-12" data-name="Rectangle 225" rx=".374" transform="translate(13.042 .15)"/>
                    <rect id="Rectangle_226-2" width="1.281" height="9.218" class="cls-11" data-name="Rectangle 226" rx=".433" transform="translate(16.975)"/>
                    <rect id="Rectangle_227-2" width=".971" height="9.068" class="cls-12" data-name="Rectangle 227" rx=".374" transform="translate(17.285 .15)"/>
                    <rect id="Rectangle_228-2" width="1.281" height="9.218" class="cls-11" data-name="Rectangle 228" rx=".433" transform="translate(21.219)"/>
                    <rect id="Rectangle_229-2" width=".971" height="9.068" class="cls-12" data-name="Rectangle 229" rx=".374" transform="translate(21.529 .15)"/>
                    <rect id="Rectangle_230-2" width="1.281" height="9.218" class="cls-11" data-name="Rectangle 230" rx=".433" transform="translate(25.463)"/>
                    <rect id="Rectangle_231-2" width=".971" height="9.068" class="cls-12" data-name="Rectangle 231" rx=".374" transform="translate(25.773 .15)"/>
                    <rect id="Rectangle_232-2" width="1.281" height="9.218" class="cls-11" data-name="Rectangle 232" rx=".433" transform="translate(29.706)"/>
                    <rect id="Rectangle_233-2" width=".971" height="9.068" class="cls-12" data-name="Rectangle 233" rx=".374" transform="translate(30.017 .15)"/>
                </g>
                <path id="Path_365-2" d="M183.61 395.62a.754.754 0 0 0-.048-.211 1.53 1.53 0 0 0-.807-.98.913.913 0 0 0-.2-.086 1.444 1.444 0 0 0-.538-.1h-8.648l.317.163a1.931 1.931 0 0 1 1.086 1.643v5.294a1.784 1.784 0 0 1-1.787 1.787h-25.743a1.6 1.6 0 0 0 1.509 1.067h33.265a1.61 1.61 0 0 0 1.614-1.6v-6.745a1.861 1.861 0 0 0-.02-.232z" class="cls-13" data-name="Path 365" transform="translate(-147.146 -394.246)"/>
            </g>
            <g id="Group_377-2" data-name="Group 377" transform="translate(38.097 9.88)">
                <path id="Path_366-2" d="M184.227 385.492v6.745a1.61 1.61 0 0 1-1.614 1.6h-33.265a1.6 1.6 0 0 1-1.509-1.067 1.409 1.409 0 0 1-.1-.538v-6.745a1.607 1.607 0 0 1 1.6-1.6h33.265a1.444 1.444 0 0 1 .538.1.912.912 0 0 1 .2.086 1.53 1.53 0 0 1 .807.98.754.754 0 0 1 .048.211 1.865 1.865 0 0 1 .03.228z" class="cls-6" data-name="Path 366" transform="translate(-147.743 -383.887)"/>
                <path id="Rectangle_234-2" d="M1.558 0h32.208a1.558 1.558 0 0 1 1.558 1.558V7.25a1.668 1.668 0 0 1-1.668 1.668H1.558A1.558 1.558 0 0 1 0 7.36v-5.8A1.558 1.558 0 0 1 1.558 0z" class="cls-7" data-name="Rectangle 234" transform="translate(1.158 1.038)"/>
                <path id="Rectangle_235-2" d="M.51 0h.981A.51.51 0 0 1 2 .51V7.1a.511.511 0 0 1-.511.511H.51A.51.51 0 0 1 0 7.1V.51A.51.51 0 0 1 .51 0z" class="cls-8" data-name="Rectangle 235" transform="translate(4.463 .637)"/>
                <path id="Rectangle_236-2" d="M.51 0h.981A.51.51 0 0 1 2 .51V7.1a.511.511 0 0 1-.511.511H.51A.51.51 0 0 1 0 7.1V.51A.51.51 0 0 1 .51 0z" class="cls-9" data-name="Rectangle 236" transform="translate(.46 .637)"/>
                <path id="Rectangle_237-2" d="M.51 0h.981A.51.51 0 0 1 2 .51V7.1a.511.511 0 0 1-.511.511H.51A.51.51 0 0 1 0 7.1V.51A.51.51 0 0 1 .51 0z" class="cls-8" data-name="Rectangle 237" transform="translate(8.767 .637)"/>
                <path id="Rectangle_238-2" d="M.51 0h.981A.51.51 0 0 1 2 .51V7.1a.511.511 0 0 1-.511.511H.51A.51.51 0 0 1 0 7.1V.51A.51.51 0 0 1 .51 0z" class="cls-10" data-name="Rectangle 238" transform="translate(12.951 .637)"/>
                <g id="Group_376-2" data-name="Group 376" transform="translate(2.746 .377)">
                    <rect id="Rectangle_239-2" width="1.281" height="9.218" class="cls-11" data-name="Rectangle 239" rx=".433"/>
                    <rect id="Rectangle_240-2" width=".971" height="9.068" class="cls-12" data-name="Rectangle 240" rx=".374" transform="translate(.31 .15)"/>
                    <rect id="Rectangle_241-2" width="1.281" height="9.218" class="cls-11" data-name="Rectangle 241" rx=".433" transform="translate(4.244)"/>
                    <rect id="Rectangle_242-2" width=".971" height="9.068" class="cls-12" data-name="Rectangle 242" rx=".374" transform="translate(4.554 .15)"/>
                    <rect id="Rectangle_243-2" width="1.281" height="9.218" class="cls-11" data-name="Rectangle 243" rx=".433" transform="translate(8.488)"/>
                    <rect id="Rectangle_244-2" width=".971" height="9.068" class="cls-12" data-name="Rectangle 244" rx=".374" transform="translate(8.798 .15)"/>
                    <rect id="Rectangle_245-2" width="1.281" height="9.218" class="cls-11" data-name="Rectangle 245" rx=".433" transform="translate(12.731)"/>
                    <rect id="Rectangle_246-2" width=".971" height="9.068" class="cls-12" data-name="Rectangle 246" rx=".374" transform="translate(13.042 .15)"/>
                    <rect id="Rectangle_247-2" width="1.281" height="9.218" class="cls-11" data-name="Rectangle 247" rx=".433" transform="translate(16.975)"/>
                    <rect id="Rectangle_248-2" width=".971" height="9.068" class="cls-12" data-name="Rectangle 248" rx=".374" transform="translate(17.285 .15)"/>
                    <rect id="Rectangle_249-2" width="1.281" height="9.218" class="cls-11" data-name="Rectangle 249" rx=".433" transform="translate(21.219)"/>
                    <rect id="Rectangle_250-2" width=".971" height="9.068" class="cls-12" data-name="Rectangle 250" rx=".374" transform="translate(21.529 .15)"/>
                    <rect id="Rectangle_251-2" width="1.281" height="9.218" class="cls-11" data-name="Rectangle 251" rx=".433" transform="translate(25.463)"/>
                    <rect id="Rectangle_252-2" width=".971" height="9.068" class="cls-12" data-name="Rectangle 252" rx=".374" transform="translate(25.773 .15)"/>
                    <rect id="Rectangle_253-2" width="1.281" height="9.218" class="cls-11" data-name="Rectangle 253" rx=".433" transform="translate(29.707)"/>
                    <rect id="Rectangle_254-2" width=".971" height="9.068" class="cls-12" data-name="Rectangle 254" rx=".374" transform="translate(30.017 .15)"/>
                </g>
                <path id="Path_367-2" d="M184.211 385.261a.754.754 0 0 0-.048-.211 1.53 1.53 0 0 0-.807-.98.911.911 0 0 0-.2-.086 1.444 1.444 0 0 0-.538-.1h-8.648l.317.163a1.931 1.931 0 0 1 1.086 1.643v5.294a1.784 1.784 0 0 1-1.787 1.787h-25.743a1.6 1.6 0 0 0 1.509 1.067h33.265a1.61 1.61 0 0 0 1.614-1.6v-6.745a1.859 1.859 0 0 0-.02-.232z" class="cls-13" data-name="Path 367" transform="translate(-147.747 -383.887)"/>
            </g>
        </g>
    </g>
</svg>
