<svg xmlns="http://www.w3.org/2000/svg" xmlns:xlink="http://www.w3.org/1999/xlink" width="88.704" height="119.19" viewBox="0 0 88.704 119.19">
  <defs>
    <clipPath id="clip-path">
      <path id="Clip_4" data-name="Clip 4" d="M0,0H39.511V.567H0Z" fill="none"/>
    </clipPath>
    <clipPath id="clip-path-2">
      <path id="Clip_9" data-name="Clip 9" d="M0,0H40.581V63.9H0Z" fill="none"/>
    </clipPath>
    <clipPath id="clip-path-3">
      <path id="Clip_12" data-name="Clip 12" d="M0,0H25.677V63.6H0Z" fill="none"/>
    </clipPath>
    <clipPath id="clip-path-4">
      <path id="Clip_15" data-name="Clip 15" d="M0,0H23.032V61.216H0Z" fill="none"/>
    </clipPath>
    <clipPath id="clip-path-5">
      <path id="Clip_23" data-name="Clip 23" d="M6.786.232A9.651,9.651,0,0,1,2.163,2.4h0a1.42,1.42,0,0,0-.842.471h0a.911.911,0,0,0-.388.052h0a1.992,1.992,0,0,0-.909,2.2h0A36.562,36.562,0,0,1,.26,9.7h0q-.009,1.056-.078,2.11h0a14.126,14.126,0,0,0-.134,2.127h0c.279,3.073,4.049,2.226,5.483,1.612h0A17.122,17.122,0,0,0,8.3,13.932h0c1.068-.722,1.4-1.67,1.118-3.263h0a41.366,41.366,0,0,1-.678-8.891h0A1.57,1.57,0,0,0,7.416,0h0a.987.987,0,0,0-.63.232" transform="translate(0)" fill="none"/>
    </clipPath>
  </defs>
  <g id="Group_12" data-name="Group 12" transform="translate(-23 -25)">
    <circle id="Oval" cx="38.438" cy="38.438" r="38.438" transform="translate(28.914 38.798)" fill="#e6e6e6"/>
    <g id="hamil" transform="translate(41.726 25)">
      <g id="Group_53" data-name="Group 53" transform="translate(2.526 0.051)">
        <g id="Group_21" data-name="Group 21" transform="translate(0 9.049)">
          <path id="Fill_1" data-name="Fill 1" d="M9.375,25.189A41.991,41.991,0,0,1,8.8,15.2C9.2,10.283,10.8,6.55,8.606,2.161S2.857.825,2.125,4.608A91.523,91.523,0,0,0,.578,19.817c.056,4.453-1.766,10.593.785,13.015S6.371,40.852,9.74,39.49s5.159-.149,2.88-4.16S9.375,25.189,9.375,25.189" transform="translate(32.148 0)" fill="#422c16"/>
          <g id="Group_5" data-name="Group 5" transform="translate(10.503 93.27)">
            <path id="Clip_4-2" data-name="Clip 4" d="M0,0H39.511V.567H0Z" transform="translate(0 0)" fill="none"/>
            <g id="Group_5-2" data-name="Group 5" transform="translate(0 0)" clip-path="url(#clip-path)">
              <path id="Fill_3" data-name="Fill 3" d="M38.316,17.708a18.131,18.131,0,0,0,.425-11.786C36.788-.661,36.788.02,36.788.02S21.329,2.82,14.82,2.593A32.557,32.557,0,0,1,4.08.55S1.639,3.425.744,9.857.012,17.592.012,17.592Z" transform="translate(0 0)" fill="#17396b"/>
            </g>
          </g>
          <path id="Fill_6" data-name="Fill 6" d="M1.269.282A2.164,2.164,0,0,1,0,.239,1.408,1.408,0,0,0,1.274.314L1.269.282" transform="translate(36.463 35.091)" fill="#422c16"/>
          <g id="Group_10" data-name="Group 10" transform="translate(6.024 29.938)">
            <path id="Clip_9-2" data-name="Clip 9" d="M0,0H40.581V63.9H0Z" transform="translate(0 0)" fill="none"/>
            <g id="Group_10-2" data-name="Group 10" transform="translate(0 0)" clip-path="url(#clip-path-2)">
              <path id="Fill_8" data-name="Fill 8" d="M30.162,1.956c2.753-2.447,1.993-1.9,1.993-1.9a28.7,28.7,0,0,0,3.251,1.677c1.2.454,6.458,1.566,7.652,4.163s-.76,12.434-.76,12.434-2.658.959-2.766,13.57,7.486,25.142,1.736,30.277-8.983,6.866-13.339,6.866-9.438.378-14.726-.832a97.622,97.622,0,0,1-9.456-3.537S-5.326,46.444,4.765,36.517c8.075-7.944,5.093-12.8,7.43-17.738S12.106,8.629,15.31,6.672a19.565,19.565,0,0,0,5.4-5.347,3.958,3.958,0,0,0,3.441,2.907A9.137,9.137,0,0,0,30.162,1.956Z" transform="translate(-2.864 0)" fill="#fff"/>
            </g>
          </g>
          <g id="Group_13" data-name="Group 13" transform="translate(28.593 30.242)">
            <path id="Clip_12-2" data-name="Clip 12" d="M0,0H25.677V63.6H0Z" transform="translate(0 0)" fill="none"/>
            <g id="Group_13-2" data-name="Group 13" transform="translate(0 0)" clip-path="url(#clip-path-3)">
              <path id="Fill_11" data-name="Fill 11" d="M3.556,7.038s-4.442,10-3.4,19.841,3.4,24.981,2.566,38.856c-.209,3.474,2.586,10.386,7.651,9.629S26,73.5,25.669,70.323s-3.635-7.274-5.913-15.3S14.875,43.98,16.013,35.657s2.278-5.448,4.231-14.982S22.523,5.017,15.037,2.1,5.418-1.907,3.556,7.038" transform="translate(0 0)" fill="#1a499c"/>
            </g>
          </g>
          <g id="Group_16" data-name="Group 16" transform="translate(0 32.622)">
            <path id="Clip_15-2" data-name="Clip 15" d="M0,0H23.032V61.216H0Z" transform="translate(0 0)" fill="none"/>
            <g id="Group_16-2" data-name="Group 16" transform="translate(0 0)" clip-path="url(#clip-path-4)">
              <path id="Fill_14" data-name="Fill 14" d="M16.24,18.094c-.187,3.418,2.308,8.431,1.128,8.774C10.047,29,8.107,34.639,7.108,38.928,3.22,55.619,11.4,68.141,11.328,69.8c-.23,5.3-6.065,1.918-8.743-3.394-2.849-5.65-1.134-5.67-2.456-14.147-.565-3.626.64-14.823,5.3-20.4,3.694-4.416,7.856-4.657,7.277-5.851-1.721-3.549-2.929-7.264-.868-11.1s.28-7.163,3.394-10.19,7.454-6.457,7.78-3.733c.213,1.781-1.868,7.061-3.334,10.5C18.9,13.328,16.427,14.676,16.24,18.094Z" transform="translate(0 0)" fill="#1a499c"/>
            </g>
          </g>
          <path id="Fill_17" data-name="Fill 17" d="M4.785.017S-.159,2.06,0,5.465,2.364,22.49,1.468,28.316s-2.6,8.7.325,10.9,3.906,5.6,6.265,5.675a4.438,4.438,0,0,0,4.394-3.935c.163-1.968-1.648-4.892.569-6.583a10.055,10.055,0,0,0,3.5-3.859,11.979,11.979,0,0,0,.607-8.7c-1.1-3.1-.932-.908-4.024-4.465S10.012,5.087,9.524,3.5,7.288-.21,4.785.017" transform="translate(8.802 0.051)" fill="#422c16"/>
          <path id="Fill_19" data-name="Fill 19" d="M9.423,10.669a41.368,41.368,0,0,1-.679-8.891C8.795.407,7.6-.433,6.785.232A9.641,9.641,0,0,1,2.163,2.4a1.419,1.419,0,0,0-.842.471.9.9,0,0,0-.388.052,1.991,1.991,0,0,0-.909,2.2A36.568,36.568,0,0,1,.26,9.7c-.007.7-.032,1.408-.078,2.11a14.175,14.175,0,0,0-.134,2.126c.279,3.073,4.049,2.227,5.483,1.613A17.128,17.128,0,0,0,8.3,13.932c1.068-.722,1.4-1.67,1.118-3.263" transform="translate(23.993 18.794)" fill="#e8c8a6"/>
        </g>
        <g id="Group_24" data-name="Group 24" transform="translate(23.993 27.843)">
          <path id="Clip_23-2" data-name="Clip 23" d="M6.786.232A9.651,9.651,0,0,1,2.163,2.4h0a1.42,1.42,0,0,0-.842.471h0a.911.911,0,0,0-.388.052h0a1.992,1.992,0,0,0-.909,2.2h0A36.562,36.562,0,0,1,.26,9.7h0q-.009,1.056-.078,2.11h0a14.126,14.126,0,0,0-.134,2.127h0c.279,3.073,4.049,2.226,5.483,1.612h0A17.122,17.122,0,0,0,8.3,13.932h0c1.068-.722,1.4-1.67,1.118-3.263h0a41.366,41.366,0,0,1-.678-8.891h0A1.57,1.57,0,0,0,7.416,0h0a.987.987,0,0,0-.63.232" transform="translate(0 0)" fill="none"/>
          <g id="Group_24-2" data-name="Group 24" transform="translate(0 0)" clip-path="url(#clip-path-5)">
            <path id="Fill_22" data-name="Fill 22" d="M12.4,2.286A1.04,1.04,0,0,0,12.165.832a1.689,1.689,0,0,0-.608-.657A1.368,1.368,0,0,0,9.777.609a1.072,1.072,0,0,0-.169.71c-.025.031-.048.065-.071.1a1.458,1.458,0,0,0-.382.242l-.544.473a1.184,1.184,0,0,0-.395.264q-.335.336-.675.668L5.254,5.056l-.706.614C3.311,6.451,1.979,7.119.69,7.772a1.08,1.08,0,0,0-.6,1.249,1.179,1.179,0,0,0,.28,1.3,1.222,1.222,0,0,0,1.755.495c.234-.123.461-.257.683-.4a1.129,1.129,0,0,0,.353-.17c.088-.062.176-.126.263-.189h0l.017-.012q.977-.7,1.937-1.415A41.562,41.562,0,0,0,12.046,3.4,1.079,1.079,0,0,0,12.392,2.3l.009-.012" transform="translate(-2.426 -2.158)" fill="#b74e00"/>
          </g>
        </g>
        <g id="Group_47" data-name="Group 47" transform="translate(0.117)">
          <path id="Fill_25" data-name="Fill 25" d="M0,9.26A47.313,47.313,0,0,0,1.549,21.1c2.722,6.22,8.276,8.3,8.935,8.261,1.9.049,9.256-4.944,9.678-6.886s.5-2.4.5-2.4a1.5,1.5,0,0,0,1.722.615c1.119-.363,3.157-6.03.2-6.377a1.828,1.828,0,0,0-1.794.854s2.033-9.255-.389-10.64S10.462-2.471,4.989,1.259s-4.4,6-4.986,8" transform="translate(13.839 5.361)" fill="#e8c8a6"/>
          <path id="Fill_27" data-name="Fill 27" d="M.57,3.607c-.053,0-.091,0-.1,0A.14.14,0,0,1,.33,3.456.152.152,0,0,1,.488,3.33a.985.985,0,0,0,.633-.145c.128-.129-.13-.42-.133-.423h0a.777.777,0,0,0-.748-.044L.061,2.8.026,2.621A3.075,3.075,0,0,1,.746.353.948.948,0,0,1,1.421,0h.017a.7.7,0,0,1,.518.219,1.308,1.308,0,0,1,.235.937.149.149,0,0,1-.163.121.141.141,0,0,1-.13-.152A1.042,1.042,0,0,0,1.732.4a.405.405,0,0,0-.3-.124H1.42A.691.691,0,0,0,.969.531,2.975,2.975,0,0,0,.3,2.4a1.08,1.08,0,0,1,.9.164c.181.19.392.553.145.8a1.141,1.141,0,0,1-.768.236" transform="translate(34.944 20.604)" fill="#b74e00"/>
          <path id="Fill_29" data-name="Fill 29" d="M1.267,6.106c-.066,0-.135,0-.208,0a1.065,1.065,0,0,1-.905-.441.964.964,0,0,1-.026-1,1.259,1.259,0,0,1,.949-.67A2.449,2.449,0,0,1,2.2,4.045L1.972.144A.141.141,0,0,1,2.111,0a.143.143,0,0,1,.155.13l.253,4.414-.25-.168a1.772,1.772,0,0,0-1.144-.117.966.966,0,0,0-.734.522A.707.707,0,0,0,.4,5.515a.782.782,0,0,0,.666.314A2.834,2.834,0,0,0,2.263,5.7a.154.154,0,0,1,.2.052.131.131,0,0,1-.053.185,2.584,2.584,0,0,1-1.143.173" transform="translate(20.028 19.211)" fill="#b74e00"/>
          <path id="Fill_31" data-name="Fill 31" d="M0,1.908S.7-.094,2.245,0s1.26.241,1.26.241.112.85-.277.879a7.172,7.172,0,0,0-2.365.268A5.873,5.873,0,0,0,0,1.908" transform="translate(15.91 15.802)" fill="#422c16"/>
          <path id="Fill_33" data-name="Fill 33" d="M1.517,2.575a7.229,7.229,0,0,1-1.4-.136A.137.137,0,0,1,0,2.276a.145.145,0,0,1,.175-.105,6.62,6.62,0,0,0,4.049-.459A5.954,5.954,0,0,0,6.338.055.154.154,0,0,1,6.544.027a.131.131,0,0,1,.03.192A6.248,6.248,0,0,1,4.36,1.957a6.676,6.676,0,0,1-2.843.618" transform="translate(22.571 27.501)" fill="#b74e00"/>
          <path id="Fill_35" data-name="Fill 35" d="M.157,8.662S2.67-2.233,14.142.415,25.777,7.679,26.265,8.36s2.766,2.043,2.2,4.389-1.881,5.424-5.5,6.079c-1.653.3-5.306.423-7.589-.583-2.71-1.195-3.751-4.871-6.4-7.869-4.881-5.524-4.306-.2-7.742-.426-1.463-.1-1.325-.5-1.077-1.286" transform="translate(12.854 0)" fill="#422c16"/>
          <path id="Fill_37" data-name="Fill 37" d="M1.565,1.228A2.192,2.192,0,0,1,.1.613.348.348,0,0,1,.126.1a.414.414,0,0,1,.555.02A1.347,1.347,0,0,0,1.749.481a1.125,1.125,0,0,0,.6-.327A.414.414,0,0,1,2.906.125a.348.348,0,0,1,.031.516A1.925,1.925,0,0,1,1.9,1.2a1.88,1.88,0,0,1-.332.03" transform="translate(17.13 20.918)" fill="#422c16"/>
          <path id="Fill_39" data-name="Fill 39" d="M1.543,1.223A2.213,2.213,0,0,1,.111.645.348.348,0,0,1,.119.128.414.414,0,0,1,.675.135,1.337,1.337,0,0,0,1.752.471,1.12,1.12,0,0,0,2.344.129.414.414,0,0,1,2.9.087.348.348,0,0,1,2.944.6a1.918,1.918,0,0,1-1.023.583,1.886,1.886,0,0,1-.378.038" transform="translate(25.392 20.426)" fill="#422c16"/>
          <path id="Fill_41" data-name="Fill 41" d="M6.3,8.409C6.648,7.726,6.925,7,7.2,6.3a8.174,8.174,0,0,0,.654-2.109A4.666,4.666,0,0,0,6.136.574a2.355,2.355,0,0,0-3.588.546,11.385,11.385,0,0,0-1,2.142,1.121,1.121,0,0,0-.632.725A16.869,16.869,0,0,0-.041,8.37c-.023,1.5,1.6,2.08,2.99,2.072A3.674,3.674,0,0,0,6.3,8.409" transform="matrix(0.985, 0.174, -0.174, 0.985, 1.867, 70.976)" fill="#e8c8a6"/>
          <path id="Fill_43" data-name="Fill 43" d="M20.937,2.984A2.084,2.084,0,0,0,19.257.771L19.132.743A17.063,17.063,0,0,0,14.267.034,14.067,14.067,0,0,0,8.5.7a19.049,19.049,0,0,0-5.815,3.62,8.222,8.222,0,0,0-1,.882A7.433,7.433,0,0,0,.849,6.252C.623,6.53.405,6.812.2,7.1a.913.913,0,0,0-.068,1.05,2.893,2.893,0,0,0,0,.515,2.728,2.728,0,0,0,2.741,2.327,7.766,7.766,0,0,0,1.069.018l.015.011c1.043.621,2.038.111,2.96-.437L7.06,10.5l.3-.07c1.518-.359,3.03-.767,4.515-1.23a20.305,20.305,0,0,0,8.58-4.709,1.129,1.129,0,0,0,.3-.509.8.8,0,0,0,.12-.3c.016-.09.028-.18.039-.27a.967.967,0,0,0,.025-.429" transform="translate(11.95 80.173)" fill="#e8c8a6"/>
          <path id="Fill_45" data-name="Fill 45" d="M27.995,31.966c-.018-.06-.039-.117-.058-.175-.089-1.339-.295-2.69-.449-3.994q-.341-2.875-.826-5.731A105.327,105.327,0,0,0,24,10.5a23.708,23.708,0,0,0-2.844-7.024,11.21,11.21,0,0,0-.779-1.721,1.238,1.238,0,0,0-.478-.493A3.532,3.532,0,0,0,15.374.5c-2.091,1.223-2.7,3.931-2.738,6.206a39.063,39.063,0,0,0,1.1,8.171,1.122,1.122,0,0,0,.085.417q.278,1.365.587,2.723a1.166,1.166,0,0,0,.127.551q.34,1.471.707,2.935a1.287,1.287,0,0,0,.114.458q.149.592.3,1.183c.547,2.132,1.115,4.257,1.677,6.385.022.217.047.437.075.656-.2.031-.4.061-.6.1a59.685,59.685,0,0,0-8.657,2.141,15.112,15.112,0,0,0-5.337,2.551,7.381,7.381,0,0,0-1.313.71,1.136,1.136,0,0,0-.393.462,4.606,4.606,0,0,0-.853,4.57A4.763,4.763,0,0,0,4.636,43.8a21.271,21.271,0,0,0,6.066-.725.635.635,0,0,0,.312-.067q1.02-.217,2.036-.465a.671.671,0,0,0,.413-.1q1.1-.275,2.2-.576a.745.745,0,0,0,.343-.094q.444-.122.887-.248c1.6-.452,3.2-.927,4.793-1.4a7.642,7.642,0,0,0,4.42-1.489c.231-.1.461-.2.69-.309a1.5,1.5,0,0,0,.729-1.494c.072-.142.142-.288.207-.441a6.665,6.665,0,0,0,.264-4.429" transform="translate(28.419 43.463)" fill="#1a499c"/>
        </g>
        <g id="Group_52" data-name="Group 52" transform="translate(34.2 59.345)">
          <path id="Fill_48" data-name="Fill 48" d="M11.532,14.755,8.831.1C8.8-.077,8.505,0,8.538.177q1.334,7.235,2.667,14.47a14.871,14.871,0,0,0-5.373,1.161Q2.966,16.831.1,17.859c-.18.065-.1.338.081.272L5.64,16.178a14.956,14.956,0,0,1,5.745-1.244.146.146,0,0,0,.147-.179" transform="translate(0 0)" fill="#fff"/>
          <path id="Fill_50" data-name="Fill 50" d="M9.8.008A50.484,50.484,0,0,1,.145,1.97c-.193.02-.195.3,0,.282A50.88,50.88,0,0,0,9.879.28.142.142,0,1,0,9.8.008" transform="translate(1.527 24.756)" fill="#fff"/>
        </g>
      </g>
    </g>
    <path id="Combined_Shape" data-name="Combined Shape" d="M88.7,75.893H0V0H5.914A38.179,38.179,0,0,0,17.185,27.167,38.177,38.177,0,0,0,44.352,38.438,38.482,38.482,0,0,0,82.79,0H88.7V75.892Z" transform="translate(23 68.297)" fill="#fff"/>
  </g>
</svg>
