<svg width="9" height="16" viewBox="0 0 9 16" fill="none" xmlns="http://www.w3.org/2000/svg">
<path fill-rule="evenodd" clip-rule="evenodd" d="M0.618855 7.08933L7.55773 0.169648C7.78507 -0.0569344 8.15315 -0.0565535 8.38011 0.17082C8.6069 0.398164 8.60631 0.766444 8.37894 0.993203L1.85309 7.50103L8.37917 14.0088C8.60652 14.2356 8.6071 14.6037 8.38035 14.831C8.26657 14.945 8.11752 15.002 7.96847 15.002C7.81979 15.002 7.67133 14.9454 7.55776 14.8322L0.618855 7.91271C0.509359 7.80377 0.447915 7.65551 0.447915 7.50103C0.447915 7.34656 0.509534 7.19847 0.618855 7.08933Z" fill="white"/>
</svg>
