<svg xmlns="http://www.w3.org/2000/svg" width="30.24" height="30.24" viewBox="0 0 30.24 30.24">
  <g id="Group_13" data-name="Group 13" transform="translate(0 30.24)">
    <path id="Shape" d="M-15.12,0A15.12,15.12,0,0,1,0,15.12,15.12,15.12,0,0,1-15.12,30.24,15.12,15.12,0,0,1-30.24,15.12,15.12,15.12,0,0,1-25.811,4.429,15.12,15.12,0,0,1-15.12,0Z" transform="rotate(-180)" fill="#8d96b8" opacity="0.845"/>
    <g id="arrow-ios-forward-outline" transform="translate(6.3 -5.04)">
      <rect id="Rectangle" width="20.16" height="20.16" transform="rotate(-90)" opacity="0"/>
      <path id="Path" d="M-.894,11.339a.951.951,0,0,0,.571-.186A.788.788,0,0,0,0,10.6a.758.758,0,0,0-.2-.592l-4-4.332L-.35,1.341A.756.756,0,0,0-.155.746.791.791,0,0,0-.483.2.955.955,0,0,0-1.164,0a.918.918,0,0,0-.622.318L-6.1,5.172A.75.75,0,0,0-6.1,6.2l4.462,4.849A.937.937,0,0,0-.894,11.339Z" transform="translate(6.3 -3.78) rotate(-180)" fill="#fff"/>
    </g>
  </g>
</svg>
