<svg id="search-outline" xmlns="http://www.w3.org/2000/svg" width="27.692" height="27" viewBox="0 0 27.692 27">
  <rect id="Rectangle" width="27.692" height="27" opacity="0"/>
  <path id="Shape" d="M19.615,20.256a1.173,1.173,0,0,1-.819-.333L14.884,16.1A9.323,9.323,0,0,1,9.243,18H9.23A9.128,9.128,0,0,1,0,9,9.128,9.128,0,0,1,9.23,0a9.128,9.128,0,0,1,9.231,9,8.8,8.8,0,0,1-1.95,5.512l3.923,3.813a1.106,1.106,0,0,1,0,1.6A1.16,1.16,0,0,1,19.615,20.256ZM9.23,2.25A6.846,6.846,0,0,0,2.308,9,6.846,6.846,0,0,0,9.23,15.75,6.846,6.846,0,0,0,16.154,9,6.846,6.846,0,0,0,9.23,2.25Z" transform="translate(3.462 3.375)" fill="#26419e"/>
</svg>
