<svg xmlns="http://www.w3.org/2000/svg" width="37" height="37" viewBox="0 0 37 37">
  <g id="Group_6" data-name="Group 6" transform="translate(1 1)">
    <g id="Oval" fill="none" stroke="#a2b7cf" stroke-miterlimit="10" stroke-width="1">
      <circle cx="17.5" cy="17.5" r="17.5" stroke="none"/>
      <circle cx="17.5" cy="17.5" r="18" fill="none"/>
    </g>
    <g id="facebook" transform="translate(6 6)">
      <rect id="Rectangle" width="24" height="24" transform="translate(24 24) rotate(180)" opacity="0"/>
      <path id="Path" d="M11,.506a.5.5,0,0,0-.5-.5H8a4.77,4.77,0,0,0-5,4.5v2.7H.5a.5.5,0,0,0-.5.5v2.6a.5.5,0,0,0,.5.5H3v6.7a.5.5,0,0,0,.5.5h3a.5.5,0,0,0,.5-.5v-6.7H9.62a.5.5,0,0,0,.49-.37l.72-2.6a.5.5,0,0,0-.48-.63H7v-2.7a1,1,0,0,1,1-.9h2.5a.5.5,0,0,0,.5-.5Z" transform="translate(6 2.994)" fill="#0b1789"/>
    </g>
  </g>
</svg>
