<svg id="youtube" xmlns="http://www.w3.org/2000/svg" width="40.238" height="40.494" viewBox="0 0 40.238 40.494">
  <ellipse id="Oval" cx="20.119" cy="20.247" rx="20.119" ry="20.247" transform="translate(0 0)" fill="#fff"/>
  <path id="Shape" d="M17.37,14.387H3.051A3.065,3.065,0,0,1,0,11.314V3.073A3.065,3.065,0,0,1,3.051,0H17.37a3.066,3.066,0,0,1,3.053,3.073v8.241A3.066,3.066,0,0,1,17.37,14.387ZM8.168,2.93v7.74L14,6.8Z" transform="translate(10.225 13.267)" fill="#26419e"/>
</svg>
