<svg xmlns="http://www.w3.org/2000/svg" width="64" height="65.439" viewBox="0 0 64 65.439">
    <defs>
        <style>
            .cls-3{fill:#2384c6}.cls-2{fill:#1a3491}.cls-8{fill:#b6beca}
        </style>
    </defs>
    <g id="Group_777" data-name="Group 777" transform="translate(-651 -1974.629)">
        <g id="Group_760" data-name="Group 760" transform="translate(-9115.475 -658.371)">
            <ellipse id="Ellipse_39" cx="32" cy="32.5" fill="#2384c6" data-name="Ellipse 39" opacity="0.1" rx="32" ry="32.5" transform="translate(9766.475 2633.371)"/>
        </g>
        <g id="Group_776" data-name="Group 776" transform="translate(512.63 1895.794)">
            <g id="Group_775" data-name="Group 775" transform="translate(151.039 78.835)">
                <g id="Group_761" data-name="Group 761" transform="translate(.972)">
                    <path id="Path_1466" d="M156.1 82.17v58.769a3.335 3.335 0 0 0 3.335 3.335H188.7a3.334 3.334 0 0 0 3.335-3.335V82.17a3.335 3.335 0 0 0-3.335-3.335h-29.263a3.334 3.334 0 0 0-3.337 3.335z" class="cls-2" data-name="Path 1466" transform="translate(-156.102 -78.835)"/>
                </g>
                <g id="Group_762" data-name="Group 762" transform="translate(36.909 9.146)">
                    <path id="Rectangle_450" d="M.972 0v5.308A.972.972 0 0 1 0 4.335V.972A.972.972 0 0 1 .972 0z" class="cls-3" data-name="Rectangle 450" transform="rotate(180 .486 2.654)"/>
                </g>
                <g id="Group_763" data-name="Group 763" transform="translate(0 9.146)">
                    <path id="Rectangle_451" d="M.972 0v5.308A.972.972 0 0 1 0 4.335V.972A.972.972 0 0 1 .972 0z" class="cls-3" data-name="Rectangle 451"/>
                </g>
                <g id="Group_764" data-name="Group 764" transform="translate(36.909 16.109)">
                    <path id="Rectangle_452" d="M.972 0v5.308A.972.972 0 0 1 0 4.335V.972A.972.972 0 0 1 .972 0z" class="cls-3" data-name="Rectangle 452" transform="rotate(180 .486 2.654)"/>
                </g>
                <g id="Group_765" data-name="Group 765" transform="translate(2.637 1.663)">
                    <path id="Path_1467" fill="#fff9ff" d="M197.374 88.964v59.172a1.466 1.466 0 0 1-1.469 1.469h-29.67a1.468 1.468 0 0 1-1.469-1.469V88.964a1.432 1.432 0 0 1 .02-.241 1.477 1.477 0 0 1 .872-1.111 1.436 1.436 0 0 1 .3-.091 1.478 1.478 0 0 1 .282-.027h29.66a1.47 1.47 0 0 1 1.474 1.47z" data-name="Path 1467" transform="translate(-164.766 -87.495)"/>
                </g>
                <path id="Path_1468" fill="#e8f6ff" d="M197.374 88.964v3.941h-32.608v-3.941a1.432 1.432 0 0 1 .02-.241 1.477 1.477 0 0 1 .872-1.111 1.436 1.436 0 0 1 .3-.091 1.478 1.478 0 0 1 .282-.027h29.66a1.47 1.47 0 0 1 1.474 1.47z" data-name="Path 1468" transform="translate(-162.13 -85.832)"/>
                <g id="Group_766" data-name="Group 766" transform="translate(10.492 1.663)">
                    <path id="Path_1469" d="M223.311 87.5l-1.211 1.2a1.433 1.433 0 0 0-.419 1.013 1.433 1.433 0 0 1-1.433 1.432h-11.525a1.433 1.433 0 0 1-1.433-1.432 1.433 1.433 0 0 0-.419-1.013l-1.21-1.209z" class="cls-2" data-name="Path 1469" transform="translate(-205.662 -87.495)"/>
                    <path id="Path_1470" d="M274.353 94.363a.6.6 0 1 1-.6-.6.6.6 0 0 1 .6.6z" class="cls-3" data-name="Path 1470" transform="translate(-260.198 -92.563)"/>
                    <rect id="Rectangle_453" width="9.161" height="1.19" class="cls-3" data-name="Rectangle 453" rx=".595" transform="translate(3.002 1.205)"/>
                </g>
                <g id="Group_767" data-name="Group 767" transform="translate(5.233 8.237)">
                    <text id="Article" fill="#2384c6" font-family="GothamRounded-Bold, Gotham Rounded" font-size="8px" font-weight="700" transform="translate(0 8)">
                        <tspan x="0" y="0">Article</tspan>
                    </text>
                    <path id="Rectangle_454" fill="#727272" d="M0 0H27.918V1.15H0z" data-name="Rectangle 454" transform="translate(0 9.975)"/>
                </g>
                <g id="Group_774" data-name="Group 774" transform="translate(5.212 22.201)">
                    <g id="Group_769" data-name="Group 769">
                        <g id="Group_768" data-name="Group 768">
                            <rect id="Rectangle_455" width="27.897" height="1.215" class="cls-8" data-name="Rectangle 455" rx=".607"/>
                            <path id="Path_1471" d="M205.467 208.12h-26.683a.607.607 0 0 0-.607.607.607.607 0 0 0 .607.607h26.683a.607.607 0 0 0 .607-.607.607.607 0 0 0-.607-.607z" class="cls-8" data-name="Path 1471" transform="translate(-178.177 -205.489)"/>
                            <rect id="Rectangle_456" width="27.897" height="1.215" class="cls-8" data-name="Rectangle 456" rx=".607" transform="translate(0 5.262)"/>
                        </g>
                    </g>
                    <g id="Group_771" data-name="Group 771" transform="translate(.021 8.83)">
                        <g id="Group_770" data-name="Group 770">
                            <path id="Path_1472" d="M190.419 240.394h-11.5a.621.621 0 0 0-.629.6.607.607 0 0 0 .607.617h11.527a.607.607 0 0 0 .607-.607.607.607 0 0 0-.612-.61z" class="cls-8" data-name="Path 1472" transform="translate(-178.285 -240.394)"/>
                            <path id="Path_1473" d="M190.419 254.092h-11.5a.622.622 0 0 0-.629.6.607.607 0 0 0 .607.617h11.527a.607.607 0 0 0 .607-.607.607.607 0 0 0-.612-.61z" class="cls-8" data-name="Path 1473" transform="translate(-178.285 -251.461)"/>
                            <path id="Path_1474" d="M190.419 267.79h-11.5a.622.622 0 0 0-.629.6.607.607 0 0 0 .607.617h11.527a.607.607 0 0 0 .607-.607.607.607 0 0 0-.612-.61z" class="cls-8" data-name="Path 1474" transform="translate(-178.285 -262.528)"/>
                        </g>
                    </g>
                    <rect id="Rectangle_457" width="12.739" height="18.679" class="cls-8" data-name="Rectangle 457" rx="1" transform="translate(.023 18.415)"/>
                    <g id="Group_773" data-name="Group 773" transform="translate(15.197 8.83)">
                        <g id="Group_772" data-name="Group 772">
                            <path id="Path_1475" d="M269.432 240.394h-11.5a.621.621 0 0 0-.629.6.607.607 0 0 0 .607.617h11.527a.607.607 0 0 0 .607-.607.607.607 0 0 0-.612-.61z" class="cls-8" data-name="Path 1475" transform="translate(-257.298 -240.394)"/>
                            <path id="Path_1476" d="M269.432 254.092h-11.5a.622.622 0 0 0-.629.6.607.607 0 0 0 .607.617h11.527a.607.607 0 0 0 .607-.607.607.607 0 0 0-.612-.61z" class="cls-8" data-name="Path 1476" transform="translate(-257.298 -251.461)"/>
                            <path id="Path_1477" d="M269.432 267.79h-11.5a.622.622 0 0 0-.629.6.607.607 0 0 0 .607.617h11.527a.607.607 0 0 0 .607-.607.607.607 0 0 0-.612-.61z" class="cls-8" data-name="Path 1477" transform="translate(-257.298 -262.528)"/>
                        </g>
                    </g>
                    <rect id="Rectangle_458" width="12.739" height="18.679" class="cls-8" data-name="Rectangle 458" rx="1" transform="translate(15.199 18.415)"/>
                </g>
            </g>
        </g>
    </g>
</svg>
