7 0.544669 0.333573 0.109190 0.047550
2 0.286583 0.340058 0.095955 0.031700
2 0.159195 0.174352 0.086028 0.031700
2 0.043388 0.511527 0.079411 0.043228
2 0.893745 0.628963 0.092646 0.038905
3 0.316362 0.424352 0.089337 0.038905
6 0.870584 0.920029 0.125734 0.056196