2 0.337870 0.377522 0.119116 0.037464
2 0.610844 0.337176 0.109190 0.051873
3 0.827570 0.267291 0.092646 0.044669
4 0.268385 0.702450 0.132351 0.044669
7 0.541360 0.453170 0.102572 0.044669
6 0.865621 0.920749 0.122425 0.048991