6 0.868929 0.921470 0.129043 0.044669
7 0.635660 0.449568 0.105881 0.043228
2 0.253496 0.459654 0.089337 0.040346
2 0.235297 0.299712 0.086028 0.040346
2 0.782901 0.253602 0.102572 0.040346
3 0.955145 0.429395 0.089710 0.046110