6 0.868929 0.921470 0.115807 0.050432
2 0.258459 0.202450 0.086028 0.038905
2 0.849077 0.587176 0.089337 0.036023
2 0.116181 0.483429 0.105881 0.044669
3 0.410663 0.377522 0.079411 0.037464
7 0.523161 0.241354 0.105881 0.038905