7 0.238606 0.335014 0.105881 0.041787
2 0.711762 0.687320 0.112499 0.040346
2 0.860657 0.716138 0.092646 0.046110
2 0.033275 0.716138 0.066549 0.040346
2 0.187320 0.115994 0.095955 0.018732
6 0.867275 0.917867 0.125734 0.063401