2 0.097983 0.480548 0.115807 0.047550
2 0.131071 0.274496 0.089337 0.041787
2 0.835842 0.208213 0.115807 0.038905
2 0.609190 0.309078 0.105881 0.041787
7 0.653858 0.355187 0.102572 0.044669
6 0.867275 0.920029 0.138969 0.053314