7 0.729961 0.334294 0.095955 0.046110
2 0.294855 0.430115 0.105881 0.053314
2 0.863966 0.304035 0.112499 0.043228
2 0.804408 0.739193 0.092646 0.034582
4 0.402391 0.676513 0.109190 0.041787
5 0.369303 0.769452 0.102572 0.043228
6 0.865621 0.920749 0.122425 0.054755