7 0.465258 0.332853 0.076102 0.040346
2 0.099637 0.248559 0.079411 0.033141
4 0.432170 0.192363 0.109190 0.038905
4 0.466912 0.708213 0.099264 0.033141
4 0.303127 0.797550 0.122425 0.033141
3 0.175739 0.122478 0.086028 0.025937
6 0.870584 0.921470 0.119116 0.053314