6 0.870584 0.920749 0.132351 0.054755
7 0.724997 0.560519 0.099264 0.037464
2 0.341178 0.710375 0.092646 0.040346
2 0.144306 0.230548 0.095955 0.043228
2 0.683638 0.148415 0.076102 0.037464
3 0.963230 0.124640 0.066176 0.030259