{
	"info": {
		"_postman_id": "86d13a91-3c78-43a0-a087-996491bab05d",
		"name": "HW1",
		"schema": "https://schema.getpostman.com/json/collection/v2.1.0/collection.json"
	},
	"item": [
		{
			"name": "User",
			"item": [
				{
					"name": "Create user",
					"event": [
						{
							"listen": "prerequest",
							"script": {
								"exec": [
									""
								],
								"type": "text/javascript"
							}
						},
						{
							"listen": "test",
							"script": {
								"exec": [
									"console.log(\"Create user\")\r",
									"var jsonData = pm.response.json();\r",
									"var requestData = JSON.parse(pm.request.body.raw);\r",
									"\r",
									"pm.globals.set(\"username\", requestData.username);\r",
									"pm.globals.set(\"userId\", requestData.id);\r",
									"\r",
									"pm.test(\"Status code is 200\", function () {\r",
									"    pm.response.to.have.status(200);\r",
									"});\r",
									" \r",
									"pm.test(\"Returns correct userId\", function () {\r",
									"    pm.expect(parseInt(jsonData.message)).to.eql(pm.globals.get('userId'));\r",
									"    });"
								],
								"type": "text/javascript"
							}
						}
					],
					"request": {
						"method": "POST",
						"header": [
							{
								"key": "Content-Type",
								"value": "application/json"
							}
						],
						"body": {
							"mode": "raw",
							"raw": "{\n    \"id\": {{$randomInt}},\n    \"username\": \"{{$randomWord}}\",\n    \"firstName\": \"id irure sunt ipsum\",\n    \"lastName\": \"officia\",\n    \"email\": \"1\",\n    \"password\": \"g\",\n    \"phone\": \"g\",\n    \"userStatus\": 36308508\n}"
						},
						"url": {
							"raw": "{{baseUrl}}/user",
							"host": [
								"{{baseUrl}}"
							],
							"path": [
								"user"
							]
						},
						"description": "This can only be done by the logged in user."
					},
					"response": [
						{
							"name": "successful operation",
							"originalRequest": {
								"method": "POST",
								"header": [],
								"body": {
									"mode": "raw",
									"raw": "{\n    \"id\": 90655884,\n    \"username\": \"Ut\",\n    \"firstName\": \"id irure sunt ipsum\",\n    \"lastName\": \"officia\",\n    \"email\": \"occaecat\",\n    \"password\": \"est nostrud\",\n    \"phone\": \"do nisi\",\n    \"userStatus\": 36308508\n}"
								},
								"url": {
									"raw": "{{baseUrl}}/user",
									"host": [
										"{{baseUrl}}"
									],
									"path": [
										"user"
									]
								}
							},
							"status": "Internal Server Error",
							"code": 500,
							"_postman_previewlanguage": "text",
							"header": [
								{
									"key": "Content-Type",
									"value": "text/plain"
								}
							],
							"cookie": [],
							"body": ""
						}
					]
				},
				{
					"name": "Updated user",
					"event": [
						{
							"listen": "test",
							"script": {
								"exec": [
									"console.log(\"Update user\")\r",
									"var jsonData = pm.response.json();\r",
									"var requestData = JSON.parse(pm.request.body.raw);\r",
									"\r",
									"pm.test(\"Status code is 200\", function () {\r",
									"    pm.response.to.have.status(200);\r",
									"});\r",
									"\r",
									"pm.test(\"Returns correct userId\", function () {\r",
									"    pm.expect(jsonData.message).to.include(pm.globals.get('userId'));\r",
									"});"
								],
								"type": "text/javascript"
							}
						},
						{
							"listen": "prerequest",
							"script": {
								"exec": [
									""
								],
								"type": "text/javascript"
							}
						}
					],
					"request": {
						"method": "PUT",
						"header": [
							{
								"key": "Content-Type",
								"value": "application/json"
							}
						],
						"body": {
							"mode": "raw",
							"raw": "{\n    \"id\": {{userId}},\n    \"username\": \"{{username}}\",\n    \"firstName\": \"{{$randomFirstName}}\",\n    \"lastName\": \"{{$randomLastName}}\",\n    \"email\": \"1\",\n    \"password\": \"g\",\n    \"phone\": \"g\",\n    \"userStatus\": {{userStatus}}\n}"
						},
						"url": {
							"raw": "{{baseUrl}}/user/{{username}}",
							"host": [
								"{{baseUrl}}"
							],
							"path": [
								"user",
								"{{username}}"
							]
						},
						"description": "This can only be done by the logged in user."
					},
					"response": [
						{
							"name": "Invalid user supplied",
							"originalRequest": {
								"method": "PUT",
								"header": [],
								"body": {
									"mode": "raw",
									"raw": "{\n    \"id\": 90655884,\n    \"username\": \"Ut\",\n    \"firstName\": \"id irure sunt ipsum\",\n    \"lastName\": \"officia\",\n    \"email\": \"occaecat\",\n    \"password\": \"est nostrud\",\n    \"phone\": \"do nisi\",\n    \"userStatus\": 36308508\n}"
								},
								"url": {
									"raw": "{{baseUrl}}/user/:username",
									"host": [
										"{{baseUrl}}"
									],
									"path": [
										"user",
										":username"
									],
									"variable": [
										{
											"key": "username"
										}
									]
								}
							},
							"status": "Bad Request",
							"code": 400,
							"_postman_previewlanguage": "text",
							"header": [
								{
									"key": "Content-Type",
									"value": "text/plain"
								}
							],
							"cookie": [],
							"body": ""
						},
						{
							"name": "User not found",
							"originalRequest": {
								"method": "PUT",
								"header": [],
								"body": {
									"mode": "raw",
									"raw": "{\n    \"id\": 90655884,\n    \"username\": \"Ut\",\n    \"firstName\": \"id irure sunt ipsum\",\n    \"lastName\": \"officia\",\n    \"email\": \"occaecat\",\n    \"password\": \"est nostrud\",\n    \"phone\": \"do nisi\",\n    \"userStatus\": 36308508\n}"
								},
								"url": {
									"raw": "{{baseUrl}}/user/:username",
									"host": [
										"{{baseUrl}}"
									],
									"path": [
										"user",
										":username"
									],
									"variable": [
										{
											"key": "username"
										}
									]
								}
							},
							"status": "Not Found",
							"code": 404,
							"_postman_previewlanguage": "text",
							"header": [
								{
									"key": "Content-Type",
									"value": "text/plain"
								}
							],
							"cookie": [],
							"body": ""
						}
					]
				},
				{
					"name": "Delete user",
					"event": [
						{
							"listen": "test",
							"script": {
								"exec": [
									"console.log(\"Delete user\")\r",
									"var jsonData = pm.response.json();\r",
									"\r",
									"pm.test(\"Status code is 200\", function () {\r",
									"    pm.response.to.have.status(200);\r",
									"});\r",
									" \r",
									"pm.test(\"Returns correct username\", function () {\r",
									"    pm.expect(jsonData.message).to.include(pm.globals.get('username'));\r",
									"    });"
								],
								"type": "text/javascript"
							}
						}
					],
					"request": {
						"method": "DELETE",
						"header": [],
						"url": {
							"raw": "{{baseUrl}}/user/{{username}}",
							"host": [
								"{{baseUrl}}"
							],
							"path": [
								"user",
								"{{username}}"
							]
						},
						"description": "This can only be done by the logged in user."
					},
					"response": [
						{
							"name": "Invalid username supplied",
							"originalRequest": {
								"method": "DELETE",
								"header": [],
								"url": {
									"raw": "{{baseUrl}}/user/:username",
									"host": [
										"{{baseUrl}}"
									],
									"path": [
										"user",
										":username"
									],
									"variable": [
										{
											"key": "username"
										}
									]
								}
							},
							"status": "Bad Request",
							"code": 400,
							"_postman_previewlanguage": "text",
							"header": [
								{
									"key": "Content-Type",
									"value": "text/plain"
								}
							],
							"cookie": [],
							"body": ""
						},
						{
							"name": "User not found",
							"originalRequest": {
								"method": "DELETE",
								"header": [],
								"url": {
									"raw": "{{baseUrl}}/user/:username",
									"host": [
										"{{baseUrl}}"
									],
									"path": [
										"user",
										":username"
									],
									"variable": [
										{
											"key": "username"
										}
									]
								}
							},
							"status": "Not Found",
							"code": 404,
							"_postman_previewlanguage": "text",
							"header": [
								{
									"key": "Content-Type",
									"value": "text/plain"
								}
							],
							"cookie": [],
							"body": ""
						}
					]
				}
			]
		}
	],
	"event": [
		{
			"listen": "prerequest",
			"script": {
				"type": "text/javascript",
				"exec": [
					""
				]
			}
		},
		{
			"listen": "test",
			"script": {
				"type": "text/javascript",
				"exec": [
					""
				]
			}
		}
	],
	"variable": [
		{
			"key": "baseUrl",
			"value": "https://petstore.swagger.io/v2"
		}
	]
}