v 0.500000 -0.500000 0.000000
v 0.500000 0.500000 0.000000
v 0.472909 -0.500000 0.162350
v 0.472909 0.500000 0.162350
v 0.000000 -0.500000 0.000000
v 0.000000 0.500000 0.000000
v 0.394570 -0.500000 0.307106
v 0.394570 0.500000 0.307106
v 0.273474 -0.500000 0.418583
v 0.273474 0.500000 0.418583
v 0.122743 -0.500000 0.484700
v 0.122743 0.500000 0.484700
v -0.041290 -0.500000 0.498292
v -0.041290 0.500000 0.498292
v -0.200848 -0.500000 0.457887
v -0.200848 0.500000 0.457887
v -0.338641 -0.500000 0.367862
v -0.338641 0.500000 0.367862
v -0.439737 -0.500000 0.237974
v -0.439737 0.500000 0.237974
v -0.493181 -0.500000 0.082297
v -0.493181 0.500000 0.082297
v -0.493181 -0.500000 -0.082297
v -0.493181 0.500000 -0.082297
v -0.439737 -0.500000 -0.237974
v -0.439737 0.500000 -0.237974
v -0.338641 -0.500000 -0.367862
v -0.338641 0.500000 -0.367862
v -0.200848 -0.500000 -0.457887
v -0.200848 0.500000 -0.457887
v -0.041290 -0.500000 -0.498292
v -0.041290 0.500000 -0.498292
v 0.122743 -0.500000 -0.484700
v 0.122743 0.500000 -0.484700
v 0.273474 -0.500000 -0.418583
v 0.273474 0.500000 -0.418583
v 0.394571 -0.500000 -0.307106
v 0.394571 0.500000 -0.307106
v 0.472909 -0.500000 -0.162349
v 0.472909 0.500000 -0.162349
v 0.500000 -0.500000 0.000001
v 0.500000 0.500000 0.000001
vt 0.000000 0.000000
vt 0.000000 1.000000
vt 0.052632 0.000000
vt 0.052632 1.000000
vt 0.026316 0.000000
vt 0.026316 1.000000
vt 0.105263 0.000000
vt 0.105263 1.000000
vt 0.078947 0.000000
vt 0.078947 1.000000
vt 0.157895 0.000000
vt 0.157895 1.000000
vt 0.131579 0.000000
vt 0.131579 1.000000
vt 0.210526 0.000000
vt 0.210526 1.000000
vt 0.184211 0.000000
vt 0.184211 1.000000
vt 0.263158 0.000000
vt 0.263158 1.000000
vt 0.236842 0.000000
vt 0.236842 1.000000
vt 0.315789 0.000000
vt 0.315789 1.000000
vt 0.289474 0.000000
vt 0.289474 1.000000
vt 0.368421 0.000000
vt 0.368421 1.000000
vt 0.342105 0.000000
vt 0.342105 1.000000
vt 0.421053 0.000000
vt 0.421053 1.000000
vt 0.394737 0.000000
vt 0.394737 1.000000
vt 0.473684 0.000000
vt 0.473684 1.000000
vt 0.447368 0.000000
vt 0.447368 1.000000
vt 0.526316 0.000000
vt 0.526316 1.000000
vt 0.500000 0.000000
vt 0.500000 1.000000
vt 0.578947 0.000000
vt 0.578947 1.000000
vt 0.552632 0.000000
vt 0.552632 1.000000
vt 0.631579 0.000000
vt 0.631579 1.000000
vt 0.605263 0.000000
vt 0.605263 1.000000
vt 0.684211 0.000000
vt 0.684211 1.000000
vt 0.657895 0.000000
vt 0.657895 1.000000
vt 0.736842 0.000000
vt 0.736842 1.000000
vt 0.710526 0.000000
vt 0.710526 1.000000
vt 0.789474 0.000000
vt 0.789474 1.000000
vt 0.763158 0.000000
vt 0.763158 1.000000
vt 0.842105 0.000000
vt 0.842105 1.000000
vt 0.815790 0.000000
vt 0.815790 1.000000
vt 0.894737 0.000000
vt 0.894737 1.000000
vt 0.868421 0.000000
vt 0.868421 1.000000
vt 0.947369 0.000000
vt 0.947369 1.000000
vt 0.921053 0.000000
vt 0.921053 1.000000
vt 1.000000 0.000000
vt 1.000000 1.000000
vt 0.973684 0.000000
vt 0.973684 1.000000
vn 0.827630 -0.559383 -0.046035
vn 0.827630 0.559383 0.046036
vn 0.797735 -0.559383 0.225190
vn 0.767839 0.559383 0.312272
vn 0.000000 -1.000000 0.000000
vn 0.000000 1.000000 0.000000
vn 0.681392 -0.559383 0.472012
vn 0.624841 0.559383 0.544670
vn 0.491210 -0.559383 0.667685
vn 0.414131 0.559383 0.718043
vn 0.247798 -0.559383 0.791004
vn 0.158544 0.559383 0.813606
vn -0.022467 -0.559383 0.828605
vn -0.114224 0.559383 0.821002
vn -0.290297 -0.559383 0.776414
vn -0.374613 0.559383 0.739429
vn -0.526669 -0.559383 0.640086
vn -0.594408 0.559383 0.577728
vn -0.705968 -0.559383 0.434396
vn -0.749790 0.559383 0.353421
vn -0.808765 -0.559383 0.181631
vn -0.823920 0.559383 0.090816
vn -0.823920 -0.559383 -0.090816
vn -0.808765 0.559383 -0.181631
vn -0.749790 -0.559383 -0.353421
vn -0.705968 0.559383 -0.434396
vn -0.594408 -0.559383 -0.577728
vn -0.526669 0.559383 -0.640086
vn -0.374613 -0.559383 -0.739429
vn -0.290297 0.559383 -0.776414
vn -0.114223 -0.559383 -0.821002
vn -0.022466 0.559383 -0.828605
vn 0.158545 -0.559383 -0.813606
vn 0.247799 0.559383 -0.791004
vn 0.414132 -0.559383 -0.718043
vn 0.491211 0.559383 -0.667685
vn 0.624841 -0.559383 -0.544669
vn 0.681393 0.559383 -0.472012
vn 0.767839 -0.559383 -0.312271
vn 0.797735 0.559383 -0.225189
vta -0.014512 -0.103318 0.994542
vta -0.089804 0.051010 0.994652
vta -0.238024 0.051013 0.969919
vta -0.309200 -0.103321 0.945368
vta 0.561274 0.824842 0.067881
vta 0.603009 0.740021 -0.297909
vta 1.000000 0.000000 0.000000
vta 0.561274 -0.824841 -0.067883
vta 0.640643 -0.670446 -0.374272
vta -0.336655 -0.103322 0.935942
vta -0.407902 0.051014 0.911599
vta -0.540061 0.051009 0.840078
vta -0.599410 -0.103318 0.793746
vta 0.731919 0.520767 -0.439428
vta 0.780752 -0.447677 -0.435902
vta -0.622313 -0.103319 0.775920
vta -0.681796 0.051011 0.729762
vta -0.783571 0.051012 0.619204
vta -0.824660 -0.103321 0.556113
vta 0.871041 0.315455 -0.376531
vta 0.910217 -0.254508 -0.326696
vta -0.840535 -0.103319 0.531814
vta -0.881807 0.051011 0.468843
vta -0.942170 0.051012 0.331229
vta -0.960547 -0.103321 0.258214
vta 0.968812 0.143076 -0.202319
vta 0.987352 -0.089823 -0.130645
vta -0.967672 -0.103320 0.230077
vta -0.986262 0.051012 0.157116
vta -0.998671 0.051011 0.007359
vta -0.992344 -0.103320 -0.067666
vta 0.999748 -0.012571 0.018621
vta 0.993455 0.064316 0.094396
vta -0.989947 -0.103318 -0.096590
vta -0.983839 0.051010 -0.171634
vta -0.946950 0.051013 -0.317306
vta -0.916605 -0.103322 -0.386211
vta 0.956937 -0.169695 0.235533
vta 0.927181 0.226010 0.298755
vta -0.904945 -0.103321 -0.412794
vta -0.874802 0.051013 -0.481788
vta -0.792612 0.051011 -0.607589
vta -0.741537 -0.103319 -0.662908
vta 0.850070 -0.346571 0.396571
vta 0.804164 0.413475 0.427035
vta -0.721879 -0.103320 -0.684262
vta -0.670967 0.051011 -0.739730
vta -0.552383 0.051011 -0.832028
vta -0.486113 -0.103320 -0.867767
vta 0.708244 -0.557586 0.433000
vta 0.661676 0.633874 0.400485
vta -0.460587 -0.103320 -0.881581
vta -0.394422 0.051011 -0.917513
vta -0.252294 0.051012 -0.966305
vta -0.178011 -0.103320 -0.978589
vta 0.588132 -0.769231 0.249768
vta 0.566707 0.813272 0.132034
vta -0.149382 -0.103320 -0.983367
vta -0.075135 0.051011 -0.995868
vta 0.075135 0.051011 -0.995868
vta 0.149382 -0.103320 -0.983367
vta 0.566707 -0.813272 -0.132034
vta 0.588132 0.769231 -0.249768
vta 0.178011 -0.103320 -0.978589
vta 0.252294 0.051012 -0.966305
vta 0.394422 0.051011 -0.917513
vta 0.460587 -0.103320 -0.881581
vta 0.661676 -0.633874 -0.400485
vta 0.708244 0.557586 -0.433000
vta 0.486113 -0.103320 -0.867767
vta 0.552383 0.051011 -0.832028
vta 0.670967 0.051011 -0.739730
vta 0.721879 -0.103320 -0.684262
vta 0.804164 -0.413475 -0.427035
vta 0.850070 0.346571 -0.396571
vta 0.741537 -0.103319 -0.662908
vta 0.792612 0.051011 -0.607589
vta 0.874802 0.051013 -0.481788
vta 0.904945 -0.103321 -0.412794
vta 0.927181 -0.226010 -0.298755
vta 0.956937 0.169695 -0.235533
vta 0.916605 -0.103322 -0.386211
vta 0.946950 0.051013 -0.317306
vta 0.983840 0.051010 -0.171633
vta 0.989947 -0.103318 -0.096590
vta 0.993455 -0.064315 -0.094395
vta 0.999748 0.012570 -0.018620
vta 0.992344 -0.103319 -0.067665
vta 0.998671 0.051011 0.007360
vta 0.986262 0.051012 0.157117
vta 0.967672 -0.103321 0.230078
vta 0.987352 0.089823 0.130646
vta 0.968811 -0.143077 0.202320
vta 0.960547 -0.103320 0.258215
vta 0.942170 0.051012 0.331230
vta 0.881807 0.051011 0.468843
vta 0.840535 -0.103320 0.531815
vta 0.910217 0.254509 0.326696
vta 0.871041 -0.315456 0.376531
vta 0.824660 -0.103318 0.556112
vta 0.783572 0.051010 0.619204
vta 0.681796 0.051013 0.729761
vta 0.622313 -0.103322 0.775920
vta 0.780752 0.447678 0.435902
vta 0.731918 -0.520768 0.439428
vta 0.599407 -0.103321 0.793748
vta 0.540059 0.051012 0.840080
vta 0.407899 0.051011 0.911601
vta 0.336652 -0.103319 0.935944
vta 0.640643 0.670446 0.374271
vta 0.603008 -0.740021 0.297908
vta 0.309199 -0.103320 0.945368
vta 0.238024 0.051012 0.969919
vta 0.089803 0.051011 0.994652
vta 0.014511 -0.103319 0.994542
vbi 0.561086 0.822445 0.093627
vbi -0.554043 0.827338 -0.092452
vbi 0.554043 0.827338 0.092452
vbi -0.561087 0.822445 -0.093627
vbi -0.000000 0.082018 -0.996631
vbi 0.000000 0.373444 0.927653
vbi -0.000000 0.000000 1.000000
vbi 0.000000 0.082021 -0.996631
vbi 0.000000 0.000000 -1.000000
vbi 0.000000 0.487436 -0.873159
vbi 0.500283 0.822445 0.270743
vbi -0.494003 0.827338 -0.267344
vbi 0.494002 0.827338 0.267344
vbi -0.500282 0.822445 -0.270742
vbi 0.000000 0.644897 0.764270
vbi 0.000000 0.697622 -0.716466
vbi 0.385269 0.822445 0.418512
vbi -0.380432 0.827339 -0.413258
vbi 0.380432 0.827338 0.413259
vbi -0.385269 0.822445 -0.418512
vbi 0.000000 0.766537 0.642201
vbi -0.000000 0.788870 -0.614560
vbi 0.228503 0.822445 0.520932
vbi -0.225635 0.827338 -0.514393
vbi 0.225635 0.827338 0.514393
vbi -0.228503 0.822445 -0.520933
vbi 0.000000 0.816468 0.577391
vbi 0.000000 0.824028 -0.566549
vbi 0.046974 0.822445 0.566902
vbi -0.046385 0.827338 -0.559786
vbi 0.046385 0.827338 0.559786
vbi -0.046974 0.822445 -0.566902
vbi 0.000000 0.828814 0.559524
vbi 0.000000 0.826411 -0.563068
vbi -0.139641 0.822445 0.551438
vbi 0.137888 0.827338 -0.544516
vbi -0.137888 0.827338 0.544517
vbi 0.139641 0.822445 -0.551439
vbi 0.000000 0.811354 0.584556
vbi 0.000000 0.797502 -0.603316
vbi -0.311129 0.822445 0.476217
vbi 0.307224 0.827338 -0.470239
vbi -0.307224 0.827338 0.470239
vbi 0.311129 0.822445 -0.476217
vbi 0.000000 0.752980 0.658043
vbi -0.000000 0.718421 -0.695608
vbi -0.448898 0.822445 0.349392
vbi 0.443263 0.827338 -0.345006
vbi -0.443263 0.827338 0.345006
vbi 0.448898 0.822445 -0.349392
vbi 0.000000 0.613343 0.789817
vbi -0.000000 0.534130 -0.845403
vbi -0.538023 0.822445 0.184704
vbi 0.531269 0.827338 -0.182385
vbi -0.531269 0.827338 0.182385
vbi 0.538023 0.822445 -0.184704
vbi 0.000000 0.308827 0.951118
vbi 0.000000 0.160251 -0.987076
vbi -0.568845 0.822445 -0.000000
vbi 0.561704 0.827338 -0.000000
vbi -0.561704 0.827338 -0.000000
vbi 0.568845 0.822445 -0.000000
vbi -0.000000 0.308827 0.951118
vbi -0.538023 0.822445 -0.184704
vbi 0.531269 0.827338 0.182385
vbi -0.531269 0.827338 -0.182385
vbi 0.538023 0.822445 0.184704
vbi 0.000000 0.534130 -0.845403
vbi -0.448898 0.822445 -0.349392
vbi 0.443263 0.827338 0.345006
vbi -0.443263 0.827338 -0.345006
vbi 0.448898 0.822445 0.349392
vbi 0.000000 0.718421 -0.695608
vbi -0.311129 0.822445 -0.476217
vbi 0.307224 0.827338 0.470239
vbi -0.307224 0.827338 -0.470239
vbi 0.311130 0.822445 0.476217
vbi -0.139641 0.822445 -0.551439
vbi 0.137888 0.827338 0.544517
vbi -0.137888 0.827338 -0.544516
vbi 0.139641 0.822445 0.551438
vbi 0.000000 0.826411 -0.563068
vbi -0.000000 0.828814 0.559524
vbi 0.046974 0.822445 -0.566902
vbi -0.046385 0.827338 0.559786
vbi 0.046385 0.827338 -0.559786
vbi -0.046974 0.822445 0.566902
vbi -0.000000 0.824028 -0.566549
vbi -0.000000 0.816468 0.577391
vbi 0.228503 0.822445 -0.520932
vbi -0.225635 0.827338 0.514393
vbi 0.225635 0.827338 -0.514393
vbi -0.228503 0.822445 0.520932
vbi -0.000000 0.766537 0.642201
vbi 0.385267 0.822445 -0.418513
vbi -0.380430 0.827339 0.413260
vbi 0.380431 0.827338 -0.413260
vbi -0.385267 0.822445 0.418514
vbi -0.000000 0.697621 -0.716467
vbi 0.000000 0.644897 0.764269
vbi 0.500285 0.822445 -0.270739
vbi -0.494005 0.827338 0.267340
vbi 0.494005 0.827338 -0.267340
vbi -0.500284 0.822445 0.270738
vbi -0.000000 0.487434 -0.873160
vbi -0.000000 0.373442 0.927653
vbi 0.561087 0.822445 -0.093627
vbi -0.554043 0.827338 0.092452
vbi 0.554043 0.827338 -0.092452
vbi -0.561086 0.822445 0.093627
f 1/1/1/1/1 2/2/2/2/2 3/3/3/3/3
f 3/3/3/3/3 2/2/2/2/2 4/4/4/4/4
f 1/1/1/5/5 3/3/3/6/6 5/5/5/7/7
f 2/2/2/8/8 6/6/6/7/9 4/4/4/9/10
f 3/3/3/10/11 4/4/4/11/12 7/7/7/12/13
f 7/7/7/12/13 4/4/4/11/12 8/8/8/13/14
f 3/3/3/6/6 7/7/7/14/15 5/9/5/7/7
f 4/4/4/9/10 6/10/6/7/9 8/8/8/15/16
f 7/7/7/16/17 8/8/8/17/18 9/11/9/18/19
f 9/11/9/18/19 8/8/8/17/18 10/12/10/19/20
f 7/7/7/14/15 9/11/9/20/21 5/13/5/7/7
f 8/8/8/15/16 6/14/6/7/9 10/12/10/21/22
f 9/11/9/22/23 10/12/10/23/24 11/15/11/24/25
f 11/15/11/24/25 10/12/10/23/24 12/16/12/25/26
f 9/11/9/20/21 11/15/11/26/27 5/17/5/7/7
f 10/12/10/21/22 6/18/6/7/9 12/16/12/27/28
f 11/15/11/28/29 12/16/12/29/30 13/19/13/30/31
f 13/19/13/30/31 12/16/12/29/30 14/20/14/31/32
f 11/15/11/26/27 13/19/13/32/33 5/21/5/7/7
f 12/16/12/27/28 6/22/6/7/9 14/20/14/33/34
f 13/19/13/34/35 14/20/14/35/36 15/23/15/36/37
f 15/23/15/36/37 14/20/14/35/36 16/24/16/37/38
f 13/19/13/32/33 15/23/15/38/39 5/25/5/7/7
f 14/20/14/33/34 6/26/6/7/9 16/24/16/39/40
f 15/23/15/40/41 16/24/16/41/42 17/27/17/42/43
f 17/27/17/42/43 16/24/16/41/42 18/28/18/43/44
f 15/23/15/38/39 17/27/17/44/45 5/29/5/7/7
f 16/24/16/39/40 6/30/6/7/9 18/28/18/45/46
f 17/27/17/46/47 18/28/18/47/48 19/31/19/48/49
f 19/31/19/48/49 18/28/18/47/48 20/32/20/49/50
f 17/27/17/44/45 19/31/19/50/51 5/33/5/7/7
f 18/28/18/45/46 6/34/6/7/9 20/32/20/51/52
f 19/31/19/52/53 20/32/20/53/54 21/35/21/54/55
f 21/35/21/54/55 20/32/20/53/54 22/36/22/55/56
f 19/31/19/50/51 21/35/21/56/57 5/37/5/7/7
f 20/32/20/51/52 6/38/6/7/9 22/36/22/57/58
f 21/35/21/58/59 22/36/22/59/60 23/39/23/60/61
f 23/39/23/60/61 22/36/22/59/60 24/40/24/61/62
f 21/35/21/56/57 23/39/23/62/58 5/41/5/7/7
f 22/36/22/57/58 6/42/6/7/9 24/40/24/63/63
f 23/39/23/64/64 24/40/24/65/65 25/43/25/66/66
f 25/43/25/66/66 24/40/24/65/65 26/44/26/67/67
f 23/39/23/62/58 25/43/25/68/68 5/45/5/7/7
f 24/40/24/63/63 6/46/6/7/9 26/44/26/69/51
f 25/43/25/70/69 26/44/26/71/70 27/47/27/72/71
f 27/47/27/72/71 26/44/26/71/70 28/48/28/73/72
f 25/43/25/68/68 27/47/27/74/73 5/49/5/7/7
f 26/44/26/69/51 6/50/6/7/9 28/48/28/75/45
f 27/47/27/76/74 28/48/28/77/75 29/51/29/78/76
f 29/51/29/78/76 28/48/28/77/75 30/52/30/79/77
f 27/47/27/74/73 29/51/29/80/40 5/53/5/7/7
f 28/48/28/75/45 6/54/6/7/9 30/52/30/81/39
f 29/51/29/82/78 30/52/30/83/79 31/55/31/84/80
f 31/55/31/84/80 30/52/30/83/79 32/56/32/85/81
f 29/51/29/80/40 31/55/31/86/82 5/57/5/7/7
f 30/52/30/81/39 6/58/6/7/9 32/56/32/87/83
f 31/55/31/88/84 32/56/32/89/85 33/59/33/90/86
f 33/59/33/90/86 32/56/32/89/85 34/60/34/91/87
f 31/55/31/86/82 33/59/33/92/88 5/61/5/7/7
f 32/56/32/87/83 6/62/6/7/9 34/60/34/93/89
f 33/59/33/94/90 34/60/34/95/91 35/63/35/96/92
f 35/63/35/96/92 34/60/34/95/91 36/64/36/97/93
f 33/59/33/92/88 35/63/35/98/22 5/65/5/7/7
f 34/60/34/93/89 6/66/6/7/9 36/64/36/99/94
f 35/63/35/100/95 36/64/36/101/96 37/67/37/102/97
f 37/67/37/102/97 36/64/36/101/96 38/68/38/103/98
f 35/63/35/98/22 37/67/37/104/99 5/69/5/7/7
f 36/64/36/99/94 6/70/6/7/9 38/68/38/105/100
f 37/67/37/106/101 38/68/38/107/102 39/71/39/108/103
f 39/71/39/108/103 38/68/38/107/102 40/72/40/109/104
f 37/67/37/104/99 39/71/39/110/105 5/73/5/7/7
f 38/68/38/105/100 6/74/6/7/9 40/72/40/111/106
f 39/71/39/112/107 40/72/40/113/108 41/75/1/114/109
f 41/75/1/114/109 40/72/40/113/108 42/76/2/115/110
f 39/71/39/110/105 41/75/1/5/5 5/77/5/7/7
f 40/72/40/111/106 6/78/6/7/9 42/76/2/8/8
