v 0 0.5 0
v 0.161744 0.469846 0.0555269
v 0.17101 0.469846 0
v 0 0.5 0
v 0.134951 0.469846 0.105037
v 0.161744 0.469846 0.0555269
v 0 0.5 0
v 0.0935337 0.469846 0.143164
v 0.134951 0.469846 0.105037
v 0 0.5 0
v 0.0419805 0.469846 0.165777
v 0.0935337 0.469846 0.143164
v 0 0.5 0
v -0.0141219 0.469846 0.170426
v 0.0419805 0.469846 0.165777
v 0 0.5 0
v -0.068694 0.469846 0.156607
v -0.0141219 0.469846 0.170426
v 0 0.5 0
v -0.115822 0.469846 0.125816
v -0.068694 0.469846 0.156607
v 0 0.5 0
v -0.150399 0.469846 0.0813918
v -0.115822 0.469846 0.125816
v 0 0.5 0
v -0.168678 0.469846 0.0281473
v -0.150399 0.469846 0.0813918
v 0 0.5 0
v -0.168678 0.469846 -0.0281473
v -0.168678 0.469846 0.0281473
v 0 0.5 0
v -0.150399 0.469846 -0.0813918
v -0.168678 0.469846 -0.0281473
v 0 0.5 0
v -0.115822 0.469846 -0.125816
v -0.150399 0.469846 -0.0813918
v 0 0.5 0
v -0.068694 0.469846 -0.156607
v -0.115822 0.469846 -0.125816
v 0 0.5 0
v -0.0141218 0.469846 -0.170426
v -0.068694 0.469846 -0.156607
v 0 0.5 0
v 0.0419806 0.469846 -0.165777
v -0.0141218 0.469846 -0.170426
v 0 0.5 0
v 0.0935338 0.469846 -0.143164
v 0.0419806 0.469846 -0.165777
v 0 0.5 0
v 0.134951 0.469846 -0.105036
v 0.0935338 0.469846 -0.143164
v 0 0.5 0
v 0.161744 0.469846 -0.0555267
v 0.134951 0.469846 -0.105036
v 0 0.5 0
v 0.17101 0.469846 2.74532e-07
v 0.161744 0.469846 -0.0555267
v 0.17101 0.469846 0
v 0.161744 0.469846 0.0555269
v 0.321394 0.383022 0
v 0.321394 0.383022 0
v 0.161744 0.469846 0.0555269
v 0.30398 0.383022 0.104356
v 0.161744 0.469846 0.0555269
v 0.134951 0.469846 0.105037
v 0.30398 0.383022 0.104356
v 0.30398 0.383022 0.104356
v 0.134951 0.469846 0.105037
v 0.253625 0.383022 0.197404
v 0.134951 0.469846 0.105037
v 0.0935337 0.469846 0.143164
v 0.253625 0.383022 0.197404
v 0.253625 0.383022 0.197404
v 0.0935337 0.469846 0.143164
v 0.175786 0.383022 0.26906
v 0.0935337 0.469846 0.143164
v 0.0419805 0.469846 0.165777
v 0.175786 0.383022 0.26906
v 0.175786 0.383022 0.26906
v 0.0419805 0.469846 0.165777
v 0.0788975 0.383022 0.311559
v 0.0419805 0.469846 0.165777
v -0.0141219 0.469846 0.170426
v 0.0788975 0.383022 0.311559
v 0.0788975 0.383022 0.311559
v -0.0141219 0.469846 0.170426
v -0.0265405 0.383022 0.320296
v -0.0141219 0.469846 0.170426
v -0.068694 0.469846 0.156607
v -0.0265405 0.383022 0.320296
v -0.0265405 0.383022 0.320296
v -0.068694 0.469846 0.156607
v -0.129102 0.383022 0.294324
v -0.068694 0.469846 0.156607
v -0.115822 0.469846 0.125816
v -0.129102 0.383022 0.294324
v -0.129102 0.383022 0.294324
v -0.115822 0.469846 0.125816
v -0.217674 0.383022 0.236457
v -0.115822 0.469846 0.125816
v -0.150399 0.469846 0.0813918
v -0.217674 0.383022 0.236457
v -0.217674 0.383022 0.236457
v -0.150399 0.469846 0.0813918
v -0.282657 0.383022 0.152967
v -0.150399 0.469846 0.0813918
v -0.168678 0.469846 0.0281473
v -0.282657 0.383022 0.152967
v -0.282657 0.383022 0.152967
v -0.168678 0.469846 0.0281473
v -0.31701 0.383022 0.0528997
v -0.168678 0.469846 0.0281473
v -0.168678 0.469846 -0.0281473
v -0.31701 0.383022 0.0528997
v -0.31701 0.383022 0.0528997
v -0.168678 0.469846 -0.0281473
v -0.31701 0.383022 -0.0528997
v -0.168678 0.469846 -0.0281473
v -0.150399 0.469846 -0.0813918
v -0.31701 0.383022 -0.0528997
v -0.31701 0.383022 -0.0528997
v -0.150399 0.469846 -0.0813918
v -0.282657 0.383022 -0.152967
v -0.150399 0.469846 -0.0813918
v -0.115822 0.469846 -0.125816
v -0.282657 0.383022 -0.152967
v -0.282657 0.383022 -0.152967
v -0.115822 0.469846 -0.125816
v -0.217674 0.383022 -0.236457
v -0.115822 0.469846 -0.125816
v -0.068694 0.469846 -0.156607
v -0.217674 0.383022 -0.236457
v -0.217674 0.383022 -0.236457
v -0.068694 0.469846 -0.156607
v -0.129102 0.383022 -0.294324
v -0.068694 0.469846 -0.156607
v -0.0141218 0.469846 -0.170426
v -0.129102 0.383022 -0.294324
v -0.129102 0.383022 -0.294324
v -0.0141218 0.469846 -0.170426
v -0.0265404 0.383022 -0.320296
v -0.0141218 0.469846 -0.170426
v 0.0419806 0.469846 -0.165777
v -0.0265404 0.383022 -0.320296
v -0.0265404 0.383022 -0.320296
v 0.0419806 0.469846 -0.165777
v 0.0788977 0.383022 -0.311559
v 0.0419806 0.469846 -0.165777
v 0.0935338 0.469846 -0.143164
v 0.0788977 0.383022 -0.311559
v 0.0788977 0.383022 -0.311559
v 0.0935338 0.469846 -0.143164
v 0.175786 0.383022 -0.26906
v 0.0935338 0.469846 -0.143164
v 0.134951 0.469846 -0.105036
v 0.175786 0.383022 -0.26906
v 0.175786 0.383022 -0.26906
v 0.134951 0.469846 -0.105036
v 0.253625 0.383022 -0.197404
v 0.134951 0.469846 -0.105036
v 0.161744 0.469846 -0.0555267
v 0.253625 0.383022 -0.197404
v 0.253625 0.383022 -0.197404
v 0.161744 0.469846 -0.0555267
v 0.30398 0.383022 -0.104356
v 0.161744 0.469846 -0.0555267
v 0.17101 0.469846 2.74532e-07
v 0.30398 0.383022 -0.104356
v 0.30398 0.383022 -0.104356
v 0.17101 0.469846 2.74532e-07
v 0.321394 0.383022 5.15952e-07
v 0.321394 0.383022 0
v 0.30398 0.383022 0.104356
v 0.433013 0.25 0
v 0.433013 0.25 0
v 0.30398 0.383022 0.104356
v 0.409551 0.25 0.140599
v 0.30398 0.383022 0.104356
v 0.253625 0.383022 0.197404
v 0.409551 0.25 0.140599
v 0.409551 0.25 0.140599
v 0.253625 0.383022 0.197404
v 0.341708 0.25 0.265962
v 0.253625 0.383022 0.197404
v 0.175786 0.383022 0.26906
v 0.341708 0.25 0.265962
v 0.341708 0.25 0.265962
v 0.175786 0.383022 0.26906
v 0.236836 0.25 0.362504
v 0.175786 0.383022 0.26906
v 0.0788975 0.383022 0.311559
v 0.236836 0.25 0.362504
v 0.236836 0.25 0.362504
v 0.0788975 0.383022 0.311559
v 0.106298 0.25 0.419763
v 0.0788975 0.383022 0.311559
v -0.0265405 0.383022 0.320296
v 0.106298 0.25 0.419763
v 0.106298 0.25 0.419763
v -0.0265405 0.383022 0.320296
v -0.0357579 0.25 0.431534
v -0.0265405 0.383022 0.320296
v -0.129102 0.383022 0.294324
v -0.0357579 0.25 0.431534
v -0.0357579 0.25 0.431534
v -0.129102 0.383022 0.294324
v -0.173939 0.25 0.396541
v -0.129102 0.383022 0.294324
v -0.217674 0.383022 0.236457
v -0.173939 0.25 0.396541
v -0.173939 0.25 0.396541
v -0.217674 0.383022 0.236457
v -0.293272 0.25 0.318578
v -0.217674 0.383022 0.236457
v -0.282657 0.383022 0.152967
v -0.293272 0.25 0.318578
v -0.293272 0.25 0.318578
v -0.282657 0.383022 0.152967
v -0.380823 0.25 0.206091
v -0.282657 0.383022 0.152967
v -0.31701 0.383022 0.0528997
v -0.380823 0.25 0.206091
v -0.380823 0.25 0.206091
v -0.31701 0.383022 0.0528997
v -0.427107 0.25 0.0712716
v -0.31701 0.383022 0.0528997
v -0.31701 0.383022 -0.0528997
v -0.427107 0.25 0.0712716
v -0.427107 0.25 0.0712716
v -0.31701 0.383022 -0.0528997
v -0.427107 0.25 -0.0712715
v -0.31701 0.383022 -0.0528997
v -0.282657 0.383022 -0.152967
v -0.427107 0.25 -0.0712715
v -0.427107 0.25 -0.0712715
v -0.282657 0.383022 -0.152967
v -0.380823 0.25 -0.206091
v -0.282657 0.383022 -0.152967
v -0.217674 0.383022 -0.236457
v -0.380823 0.25 -0.206091
v -0.380823 0.25 -0.206091
v -0.217674 0.383022 -0.236457
v -0.293272 0.25 -0.318578
v -0.217674 0.383022 -0.236457
v -0.129102 0.383022 -0.294324
v -0.293272 0.25 -0.318578
v -0.293272 0.25 -0.318578
v -0.129102 0.383022 -0.294324
v -0.173939 0.25 -0.396542
v -0.129102 0.383022 -0.294324
v -0.0265404 0.383022 -0.320296
v -0.173939 0.25 -0.396542
v -0.173939 0.25 -0.396542
v -0.0265404 0.383022 -0.320296
v -0.0357577 0.25 -0.431534
v -0.0265404 0.383022 -0.320296
v 0.0788977 0.383022 -0.311559
v -0.0357577 0.25 -0.431534
v -0.0357577 0.25 -0.431534
v 0.0788977 0.383022 -0.311559
v 0.106299 0.25 -0.419763
v 0.0788977 0.383022 -0.311559
v 0.175786 0.383022 -0.26906
v 0.106299 0.25 -0.419763
v 0.106299 0.25 -0.419763
v 0.175786 0.383022 -0.26906
v 0.236836 0.25 -0.362503
v 0.175786 0.383022 -0.26906
v 0.253625 0.383022 -0.197404
v 0.236836 0.25 -0.362503
v 0.236836 0.25 -0.362503
v 0.253625 0.383022 -0.197404
v 0.341708 0.25 -0.265961
v 0.253625 0.383022 -0.197404
v 0.30398 0.383022 -0.104356
v 0.341708 0.25 -0.265961
v 0.341708 0.25 -0.265961
v 0.30398 0.383022 -0.104356
v 0.409551 0.25 -0.140598
v 0.30398 0.383022 -0.104356
v 0.321394 0.383022 5.15952e-07
v 0.409551 0.25 -0.140598
v 0.409551 0.25 -0.140598
v 0.321394 0.383022 5.15952e-07
v 0.433013 0.25 6.9514e-07
v 0.433013 0.25 0
v 0.409551 0.25 0.140599
v 0.492404 0.0868241 0
v 0.492404 0.0868241 0
v 0.409551 0.25 0.140599
v 0.465724 0.0868241 0.159883
v 0.409551 0.25 0.140599
v 0.341708 0.25 0.265962
v 0.465724 0.0868241 0.159883
v 0.465724 0.0868241 0.159883
v 0.341708 0.25 0.265962
v 0.388576 0.0868241 0.302441
v 0.341708 0.25 0.265962
v 0.236836 0.25 0.362504
v 0.388576 0.0868241 0.302441
v 0.388576 0.0868241 0.302441
v 0.236836 0.25 0.362504
v 0.269319 0.0868241 0.412224
v 0.236836 0.25 0.362504
v 0.106298 0.25 0.419763
v 0.269319 0.0868241 0.412224
v 0.269319 0.0868241 0.412224
v 0.106298 0.25 0.419763
v 0.120878 0.0868241 0.477336
v 0.106298 0.25 0.419763
v -0.0357579 0.25 0.431534
v 0.120878 0.0868241 0.477336
v 0.120878 0.0868241 0.477336
v -0.0357579 0.25 0.431534
v -0.0406624 0.0868241 0.490722
v -0.0357579 0.25 0.431534
v -0.173939 0.25 0.396541
v -0.0406624 0.0868241 0.490722
v -0.0406624 0.0868241 0.490722
v -0.173939 0.25 0.396541
v -0.197796 0.0868241 0.45093
v -0.173939 0.25 0.396541
v -0.293272 0.25 0.318578
v -0.197796 0.0868241 0.45093
v -0.197796 0.0868241 0.45093
v -0.293272 0.25 0.318578
v -0.333496 0.0868241 0.362273
v -0.293272 0.25 0.318578
v -0.380823 0.25 0.206091
v -0.333496 0.0868241 0.362273
v -0.333496 0.0868241 0.362273
v -0.380823 0.25 0.206091
v -0.433056 0.0868241 0.234358
v -0.380823 0.25 0.206091
v -0.427107 0.25 0.0712716
v -0.433056 0.0868241 0.234358
v -0.433056 0.0868241 0.234358
v -0.427107 0.25 0.0712716
v -0.485688 0.0868241 0.081047
v -0.427107 0.25 0.0712716
v -0.427107 0.25 -0.0712715
v -0.485688 0.0868241 0.081047
v -0.485688 0.0868241 0.081047
v -0.427107 0.25 -0.0712715
v -0.485688 0.0868241 -0.081047
v -0.427107 0.25 -0.0712715
v -0.380823 0.25 -0.206091
v -0.485688 0.0868241 -0.081047
v -0.485688 0.0868241 -0.081047
v -0.380823 0.25 -0.206091
v -0.433056 0.0868241 -0.234358
v -0.380823 0.25 -0.206091
v -0.293272 0.25 -0.318578
v -0.433056 0.0868241 -0.234358
v -0.433056 0.0868241 -0.234358
v -0.293272 0.25 -0.318578
v -0.333496 0.0868241 -0.362273
v -0.293272 0.25 -0.318578
v -0.173939 0.25 -0.396542
v -0.333496 0.0868241 -0.362273
v -0.333496 0.0868241 -0.362273
v -0.173939 0.25 -0.396542
v -0.197796 0.0868241 -0.45093
v -0.173939 0.25 -0.396542
v -0.0357577 0.25 -0.431534
v -0.197796 0.0868241 -0.45093
v -0.197796 0.0868241 -0.45093
v -0.0357577 0.25 -0.431534
v -0.0406622 0.0868241 -0.490722
v -0.0357577 0.25 -0.431534
v 0.106299 0.25 -0.419763
v -0.0406622 0.0868241 -0.490722
v -0.0406622 0.0868241 -0.490722
v 0.106299 0.25 -0.419763
v 0.120878 0.0868241 -0.477336
v 0.106299 0.25 -0.419763
v 0.236836 0.25 -0.362503
v 0.120878 0.0868241 -0.477336
v 0.120878 0.0868241 -0.477336
v 0.236836 0.25 -0.362503
v 0.26932 0.0868241 -0.412224
v 0.236836 0.25 -0.362503
v 0.341708 0.25 -0.265961
v 0.26932 0.0868241 -0.412224
v 0.26932 0.0868241 -0.412224
v 0.341708 0.25 -0.265961
v 0.388576 0.0868241 -0.30244
v 0.341708 0.25 -0.265961
v 0.409551 0.25 -0.140598
v 0.388576 0.0868241 -0.30244
v 0.388576 0.0868241 -0.30244
v 0.409551 0.25 -0.140598
v 0.465724 0.0868241 -0.159883
v 0.409551 0.25 -0.140598
v 0.433013 0.25 6.9514e-07
v 0.465724 0.0868241 -0.159883
v 0.465724 0.0868241 -0.159883
v 0.433013 0.25 6.9514e-07
v 0.492404 0.0868241 7.90484e-07
v 0.492404 0.0868241 0
v 0.465724 0.0868241 0.159883
v 0.492404 -0.086824 0
v 0.492404 -0.086824 0
v 0.465724 0.0868241 0.159883
v 0.465724 -0.086824 0.159883
v 0.465724 0.0868241 0.159883
v 0.388576 0.0868241 0.302441
v 0.465724 -0.086824 0.159883
v 0.465724 -0.086824 0.159883
v 0.388576 0.0868241 0.302441
v 0.388576 -0.086824 0.302441
v 0.388576 0.0868241 0.302441
v 0.269319 0.0868241 0.412224
v 0.388576 -0.086824 0.302441
v 0.388576 -0.086824 0.302441
v 0.269319 0.0868241 0.412224
v 0.269319 -0.086824 0.412224
v 0.269319 0.0868241 0.412224
v 0.120878 0.0868241 0.477336
v 0.269319 -0.086824 0.412224
v 0.269319 -0.086824 0.412224
v 0.120878 0.0868241 0.477336
v 0.120878 -0.086824 0.477336
v 0.120878 0.0868241 0.477336
v -0.0406624 0.0868241 0.490722
v 0.120878 -0.086824 0.477336
v 0.120878 -0.086824 0.477336
v -0.0406624 0.0868241 0.490722
v -0.0406624 -0.086824 0.490722
v -0.0406624 0.0868241 0.490722
v -0.197796 0.0868241 0.45093
v -0.0406624 -0.086824 0.490722
v -0.0406624 -0.086824 0.490722
v -0.197796 0.0868241 0.45093
v -0.197796 -0.086824 0.45093
v -0.197796 0.0868241 0.45093
v -0.333496 0.0868241 0.362273
v -0.197796 -0.086824 0.45093
v -0.197796 -0.086824 0.45093
v -0.333496 0.0868241 0.362273
v -0.333496 -0.086824 0.362273
v -0.333496 0.0868241 0.362273
v -0.433056 0.0868241 0.234358
v -0.333496 -0.086824 0.362273
v -0.333496 -0.086824 0.362273
v -0.433056 0.0868241 0.234358
v -0.433056 -0.086824 0.234358
v -0.433056 0.0868241 0.234358
v -0.485688 0.0868241 0.081047
v -0.433056 -0.086824 0.234358
v -0.433056 -0.086824 0.234358
v -0.485688 0.0868241 0.081047
v -0.485688 -0.086824 0.081047
v -0.485688 0.0868241 0.081047
v -0.485688 0.0868241 -0.081047
v -0.485688 -0.086824 0.081047
v -0.485688 -0.086824 0.081047
v -0.485688 0.0868241 -0.081047
v -0.485688 -0.086824 -0.081047
v -0.485688 0.0868241 -0.081047
v -0.433056 0.0868241 -0.234358
v -0.485688 -0.086824 -0.081047
v -0.485688 -0.086824 -0.081047
v -0.433056 0.0868241 -0.234358
v -0.433056 -0.086824 -0.234358
v -0.433056 0.0868241 -0.234358
v -0.333496 0.0868241 -0.362273
v -0.433056 -0.086824 -0.234358
v -0.433056 -0.086824 -0.234358
v -0.333496 0.0868241 -0.362273
v -0.333496 -0.086824 -0.362273
v -0.333496 0.0868241 -0.362273
v -0.197796 0.0868241 -0.45093
v -0.333496 -0.086824 -0.362273
v -0.333496 -0.086824 -0.362273
v -0.197796 0.0868241 -0.45093
v -0.197796 -0.086824 -0.45093
v -0.197796 0.0868241 -0.45093
v -0.0406622 0.0868241 -0.490722
v -0.197796 -0.086824 -0.45093
v -0.197796 -0.086824 -0.45093
v -0.0406622 0.0868241 -0.490722
v -0.0406622 -0.086824 -0.490722
v -0.0406622 0.0868241 -0.490722
v 0.120878 0.0868241 -0.477336
v -0.0406622 -0.086824 -0.490722
v -0.0406622 -0.086824 -0.490722
v 0.120878 0.0868241 -0.477336
v 0.120878 -0.086824 -0.477336
v 0.120878 0.0868241 -0.477336
v 0.26932 0.0868241 -0.412224
v 0.120878 -0.086824 -0.477336
v 0.120878 -0.086824 -0.477336
v 0.26932 0.0868241 -0.412224
v 0.26932 -0.086824 -0.412224
v 0.26932 0.0868241 -0.412224
v 0.388576 0.0868241 -0.30244
v 0.26932 -0.086824 -0.412224
v 0.26932 -0.086824 -0.412224
v 0.388576 0.0868241 -0.30244
v 0.388576 -0.086824 -0.30244
v 0.388576 0.0868241 -0.30244
v 0.465724 0.0868241 -0.159883
v 0.388576 -0.086824 -0.30244
v 0.388576 -0.086824 -0.30244
v 0.465724 0.0868241 -0.159883
v 0.465724 -0.086824 -0.159883
v 0.465724 0.0868241 -0.159883
v 0.492404 0.0868241 7.90484e-07
v 0.465724 -0.086824 -0.159883
v 0.465724 -0.086824 -0.159883
v 0.492404 0.0868241 7.90484e-07
v 0.492404 -0.086824 7.90484e-07
v 0.492404 -0.086824 0
v 0.465724 -0.086824 0.159883
v 0.433013 -0.25 0
v 0.433013 -0.25 0
v 0.465724 -0.086824 0.159883
v 0.409551 -0.25 0.140599
v 0.465724 -0.086824 0.159883
v 0.388576 -0.086824 0.302441
v 0.409551 -0.25 0.140599
v 0.409551 -0.25 0.140599
v 0.388576 -0.086824 0.302441
v 0.341708 -0.25 0.265962
v 0.388576 -0.086824 0.302441
v 0.269319 -0.086824 0.412224
v 0.341708 -0.25 0.265962
v 0.341708 -0.25 0.265962
v 0.269319 -0.086824 0.412224
v 0.236836 -0.25 0.362504
v 0.269319 -0.086824 0.412224
v 0.120878 -0.086824 0.477336
v 0.236836 -0.25 0.362504
v 0.236836 -0.25 0.362504
v 0.120878 -0.086824 0.477336
v 0.106298 -0.25 0.419763
v 0.120878 -0.086824 0.477336
v -0.0406624 -0.086824 0.490722
v 0.106298 -0.25 0.419763
v 0.106298 -0.25 0.419763
v -0.0406624 -0.086824 0.490722
v -0.0357579 -0.25 0.431534
v -0.0406624 -0.086824 0.490722
v -0.197796 -0.086824 0.45093
v -0.0357579 -0.25 0.431534
v -0.0357579 -0.25 0.431534
v -0.197796 -0.086824 0.45093
v -0.173939 -0.25 0.396542
v -0.197796 -0.086824 0.45093
v -0.333496 -0.086824 0.362273
v -0.173939 -0.25 0.396542
v -0.173939 -0.25 0.396542
v -0.333496 -0.086824 0.362273
v -0.293272 -0.25 0.318578
v -0.333496 -0.086824 0.362273
v -0.433056 -0.086824 0.234358
v -0.293272 -0.25 0.318578
v -0.293272 -0.25 0.318578
v -0.433056 -0.086824 0.234358
v -0.380823 -0.25 0.206091
v -0.433056 -0.086824 0.234358
v -0.485688 -0.086824 0.081047
v -0.380823 -0.25 0.206091
v -0.380823 -0.25 0.206091
v -0.485688 -0.086824 0.081047
v -0.427107 -0.25 0.0712716
v -0.485688 -0.086824 0.081047
v -0.485688 -0.086824 -0.081047
v -0.427107 -0.25 0.0712716
v -0.427107 -0.25 0.0712716
v -0.485688 -0.086824 -0.081047
v -0.427107 -0.25 -0.0712715
v -0.485688 -0.086824 -0.081047
v -0.433056 -0.086824 -0.234358
v -0.427107 -0.25 -0.0712715
v -0.427107 -0.25 -0.0712715
v -0.433056 -0.086824 -0.234358
v -0.380823 -0.25 -0.206091
v -0.433056 -0.086824 -0.234358
v -0.333496 -0.086824 -0.362273
v -0.380823 -0.25 -0.206091
v -0.380823 -0.25 -0.206091
v -0.333496 -0.086824 -0.362273
v -0.293272 -0.25 -0.318578
v -0.333496 -0.086824 -0.362273
v -0.197796 -0.086824 -0.45093
v -0.293272 -0.25 -0.318578
v -0.293272 -0.25 -0.318578
v -0.197796 -0.086824 -0.45093
v -0.173939 -0.25 -0.396542
v -0.197796 -0.086824 -0.45093
v -0.0406622 -0.086824 -0.490722
v -0.173939 -0.25 -0.396542
v -0.173939 -0.25 -0.396542
v -0.0406622 -0.086824 -0.490722
v -0.0357577 -0.25 -0.431534
v -0.0406622 -0.086824 -0.490722
v 0.120878 -0.086824 -0.477336
v -0.0357577 -0.25 -0.431534
v -0.0357577 -0.25 -0.431534
v 0.120878 -0.086824 -0.477336
v 0.106299 -0.25 -0.419763
v 0.120878 -0.086824 -0.477336
v 0.26932 -0.086824 -0.412224
v 0.106299 -0.25 -0.419763
v 0.106299 -0.25 -0.419763
v 0.26932 -0.086824 -0.412224
v 0.236836 -0.25 -0.362504
v 0.26932 -0.086824 -0.412224
v 0.388576 -0.086824 -0.30244
v 0.236836 -0.25 -0.362504
v 0.236836 -0.25 -0.362504
v 0.388576 -0.086824 -0.30244
v 0.341708 -0.25 -0.265962
v 0.388576 -0.086824 -0.30244
v 0.465724 -0.086824 -0.159883
v 0.341708 -0.25 -0.265962
v 0.341708 -0.25 -0.265962
v 0.465724 -0.086824 -0.159883
v 0.409551 -0.25 -0.140598
v 0.465724 -0.086824 -0.159883
v 0.492404 -0.086824 7.90484e-07
v 0.409551 -0.25 -0.140598
v 0.409551 -0.25 -0.140598
v 0.492404 -0.086824 7.90484e-07
v 0.433013 -0.25 6.9514e-07
v 0.433013 -0.25 0
v 0.409551 -0.25 0.140599
v 0.321394 -0.383022 0
v 0.321394 -0.383022 0
v 0.409551 -0.25 0.140599
v 0.30398 -0.383022 0.104356
v 0.409551 -0.25 0.140599
v 0.341708 -0.25 0.265962
v 0.30398 -0.383022 0.104356
v 0.30398 -0.383022 0.104356
v 0.341708 -0.25 0.265962
v 0.253625 -0.383022 0.197404
v 0.341708 -0.25 0.265962
v 0.236836 -0.25 0.362504
v 0.253625 -0.383022 0.197404
v 0.253625 -0.383022 0.197404
v 0.236836 -0.25 0.362504
v 0.175786 -0.383022 0.26906
v 0.236836 -0.25 0.362504
v 0.106298 -0.25 0.419763
v 0.175786 -0.383022 0.26906
v 0.175786 -0.383022 0.26906
v 0.106298 -0.25 0.419763
v 0.0788976 -0.383022 0.311559
v 0.106298 -0.25 0.419763
v -0.0357579 -0.25 0.431534
v 0.0788976 -0.383022 0.311559
v 0.0788976 -0.383022 0.311559
v -0.0357579 -0.25 0.431534
v -0.0265405 -0.383022 0.320296
v -0.0357579 -0.25 0.431534
v -0.173939 -0.25 0.396542
v -0.0265405 -0.383022 0.320296
v -0.0265405 -0.383022 0.320296
v -0.173939 -0.25 0.396542
v -0.129102 -0.383022 0.294324
v -0.173939 -0.25 0.396542
v -0.293272 -0.25 0.318578
v -0.129102 -0.383022 0.294324
v -0.129102 -0.383022 0.294324
v -0.293272 -0.25 0.318578
v -0.217674 -0.383022 0.236457
v -0.293272 -0.25 0.318578
v -0.380823 -0.25 0.206091
v -0.217674 -0.383022 0.236457
v -0.217674 -0.383022 0.236457
v -0.380823 -0.25 0.206091
v -0.282658 -0.383022 0.152967
v -0.380823 -0.25 0.206091
v -0.427107 -0.25 0.0712716
v -0.282658 -0.383022 0.152967
v -0.282658 -0.383022 0.152967
v -0.427107 -0.25 0.0712716
v -0.317011 -0.383022 0.0528997
v -0.427107 -0.25 0.0712716
v -0.427107 -0.25 -0.0712715
v -0.317011 -0.383022 0.0528997
v -0.317011 -0.383022 0.0528997
v -0.427107 -0.25 -0.0712715
v -0.317011 -0.383022 -0.0528997
v -0.427107 -0.25 -0.0712715
v -0.380823 -0.25 -0.206091
v -0.317011 -0.383022 -0.0528997
v -0.317011 -0.383022 -0.0528997
v -0.380823 -0.25 -0.206091
v -0.282658 -0.383022 -0.152967
v -0.380823 -0.25 -0.206091
v -0.293272 -0.25 -0.318578
v -0.282658 -0.383022 -0.152967
v -0.282658 -0.383022 -0.152967
v -0.293272 -0.25 -0.318578
v -0.217674 -0.383022 -0.236457
v -0.293272 -0.25 -0.318578
v -0.173939 -0.25 -0.396542
v -0.217674 -0.383022 -0.236457
v -0.217674 -0.383022 -0.236457
v -0.173939 -0.25 -0.396542
v -0.129102 -0.383022 -0.294324
v -0.173939 -0.25 -0.396542
v -0.0357577 -0.25 -0.431534
v -0.129102 -0.383022 -0.294324
v -0.129102 -0.383022 -0.294324
v -0.0357577 -0.25 -0.431534
v -0.0265404 -0.383022 -0.320296
v -0.0357577 -0.25 -0.431534
v 0.106299 -0.25 -0.419763
v -0.0265404 -0.383022 -0.320296
v -0.0265404 -0.383022 -0.320296
v 0.106299 -0.25 -0.419763
v 0.0788978 -0.383022 -0.311559
v 0.106299 -0.25 -0.419763
v 0.236836 -0.25 -0.362504
v 0.0788978 -0.383022 -0.311559
v 0.0788978 -0.383022 -0.311559
v 0.236836 -0.25 -0.362504
v 0.175786 -0.383022 -0.26906
v 0.236836 -0.25 -0.362504
v 0.341708 -0.25 -0.265962
v 0.175786 -0.383022 -0.26906
v 0.175786 -0.383022 -0.26906
v 0.341708 -0.25 -0.265962
v 0.253625 -0.383022 -0.197404
v 0.341708 -0.25 -0.265962
v 0.409551 -0.25 -0.140598
v 0.253625 -0.383022 -0.197404
v 0.253625 -0.383022 -0.197404
v 0.409551 -0.25 -0.140598
v 0.30398 -0.383022 -0.104356
v 0.409551 -0.25 -0.140598
v 0.433013 -0.25 6.9514e-07
v 0.30398 -0.383022 -0.104356
v 0.30398 -0.383022 -0.104356
v 0.433013 -0.25 6.9514e-07
v 0.321394 -0.383022 5.15952e-07
v 0.321394 -0.383022 0
v 0.30398 -0.383022 0.104356
v 0.17101 -0.469846 0
v 0.17101 -0.469846 0
v 0.30398 -0.383022 0.104356
v 0.161744 -0.469846 0.0555269
v 0.30398 -0.383022 0.104356
v 0.253625 -0.383022 0.197404
v 0.161744 -0.469846 0.0555269
v 0.161744 -0.469846 0.0555269
v 0.253625 -0.383022 0.197404
v 0.134951 -0.469846 0.105037
v 0.253625 -0.383022 0.197404
v 0.175786 -0.383022 0.26906
v 0.134951 -0.469846 0.105037
v 0.134951 -0.469846 0.105037
v 0.175786 -0.383022 0.26906
v 0.0935338 -0.469846 0.143164
v 0.175786 -0.383022 0.26906
v 0.0788976 -0.383022 0.311559
v 0.0935338 -0.469846 0.143164
v 0.0935338 -0.469846 0.143164
v 0.0788976 -0.383022 0.311559
v 0.0419805 -0.469846 0.165777
v 0.0788976 -0.383022 0.311559
v -0.0265405 -0.383022 0.320296
v 0.0419805 -0.469846 0.165777
v 0.0419805 -0.469846 0.165777
v -0.0265405 -0.383022 0.320296
v -0.0141219 -0.469846 0.170426
v -0.0265405 -0.383022 0.320296
v -0.129102 -0.383022 0.294324
v -0.0141219 -0.469846 0.170426
v -0.0141219 -0.469846 0.170426
v -0.129102 -0.383022 0.294324
v -0.068694 -0.469846 0.156607
v -0.129102 -0.383022 0.294324
v -0.217674 -0.383022 0.236457
v -0.068694 -0.469846 0.156607
v -0.068694 -0.469846 0.156607
v -0.217674 -0.383022 0.236457
v -0.115822 -0.469846 0.125816
v -0.217674 -0.383022 0.236457
v -0.282658 -0.383022 0.152967
v -0.115822 -0.469846 0.125816
v -0.115822 -0.469846 0.125816
v -0.282658 -0.383022 0.152967
v -0.150399 -0.469846 0.0813919
v -0.282658 -0.383022 0.152967
v -0.317011 -0.383022 0.0528997
v -0.150399 -0.469846 0.0813919
v -0.150399 -0.469846 0.0813919
v -0.317011 -0.383022 0.0528997
v -0.168678 -0.469846 0.0281474
v -0.317011 -0.383022 0.0528997
v -0.317011 -0.383022 -0.0528997
v -0.168678 -0.469846 0.0281474
v -0.168678 -0.469846 0.0281474
v -0.317011 -0.383022 -0.0528997
v -0.168678 -0.469846 -0.0281474
v -0.317011 -0.383022 -0.0528997
v -0.282658 -0.383022 -0.152967
v -0.168678 -0.469846 -0.0281474
v -0.168678 -0.469846 -0.0281474
v -0.282658 -0.383022 -0.152967
v -0.150399 -0.469846 -0.0813919
v -0.282658 -0.383022 -0.152967
v -0.217674 -0.383022 -0.236457
v -0.150399 -0.469846 -0.0813919
v -0.150399 -0.469846 -0.0813919
v -0.217674 -0.383022 -0.236457
v -0.115822 -0.469846 -0.125816
v -0.217674 -0.383022 -0.236457
v -0.129102 -0.383022 -0.294324
v -0.115822 -0.469846 -0.125816
v -0.115822 -0.469846 -0.125816
v -0.129102 -0.383022 -0.294324
v -0.068694 -0.469846 -0.156607
v -0.129102 -0.383022 -0.294324
v -0.0265404 -0.383022 -0.320296
v -0.068694 -0.469846 -0.156607
v -0.068694 -0.469846 -0.156607
v -0.0265404 -0.383022 -0.320296
v -0.0141218 -0.469846 -0.170426
v -0.0265404 -0.383022 -0.320296
v 0.0788978 -0.383022 -0.311559
v -0.0141218 -0.469846 -0.170426
v -0.0141218 -0.469846 -0.170426
v 0.0788978 -0.383022 -0.311559
v 0.0419806 -0.469846 -0.165777
v 0.0788978 -0.383022 -0.311559
v 0.175786 -0.383022 -0.26906
v 0.0419806 -0.469846 -0.165777
v 0.0419806 -0.469846 -0.165777
v 0.175786 -0.383022 -0.26906
v 0.0935339 -0.469846 -0.143164
v 0.175786 -0.383022 -0.26906
v 0.253625 -0.383022 -0.197404
v 0.0935339 -0.469846 -0.143164
v 0.0935339 -0.469846 -0.143164
v 0.253625 -0.383022 -0.197404
v 0.134951 -0.469846 -0.105037
v 0.253625 -0.383022 -0.197404
v 0.30398 -0.383022 -0.104356
v 0.134951 -0.469846 -0.105037
v 0.134951 -0.469846 -0.105037
v 0.30398 -0.383022 -0.104356
v 0.161745 -0.469846 -0.0555267
v 0.30398 -0.383022 -0.104356
v 0.321394 -0.383022 5.15952e-07
v 0.161745 -0.469846 -0.0555267
v 0.161745 -0.469846 -0.0555267
v 0.321394 -0.383022 5.15952e-07
v 0.17101 -0.469846 2.74533e-07
v 0 -0.5 0
v 0.17101 -0.469846 0
v 0.161744 -0.469846 0.0555269
v 0 -0.5 0
v 0.161744 -0.469846 0.0555269
v 0.134951 -0.469846 0.105037
v 0 -0.5 0
v 0.134951 -0.469846 0.105037
v 0.0935338 -0.469846 0.143164
v 0 -0.5 0
v 0.0935338 -0.469846 0.143164
v 0.0419805 -0.469846 0.165777
v 0 -0.5 0
v 0.0419805 -0.469846 0.165777
v -0.0141219 -0.469846 0.170426
v 0 -0.5 0
v -0.0141219 -0.469846 0.170426
v -0.068694 -0.469846 0.156607
v 0 -0.5 0
v -0.068694 -0.469846 0.156607
v -0.115822 -0.469846 0.125816
v 0 -0.5 0
v -0.115822 -0.469846 0.125816
v -0.150399 -0.469846 0.0813919
v 0 -0.5 0
v -0.150399 -0.469846 0.0813919
v -0.168678 -0.469846 0.0281474
v 0 -0.5 0
v -0.168678 -0.469846 0.0281474
v -0.168678 -0.469846 -0.0281474
v 0 -0.5 0
v -0.168678 -0.469846 -0.0281474
v -0.150399 -0.469846 -0.0813919
v 0 -0.5 0
v -0.150399 -0.469846 -0.0813919
v -0.115822 -0.469846 -0.125816
v 0 -0.5 0
v -0.115822 -0.469846 -0.125816
v -0.068694 -0.469846 -0.156607
v 0 -0.5 0
v -0.068694 -0.469846 -0.156607
v -0.0141218 -0.469846 -0.170426
v 0 -0.5 0
v -0.0141218 -0.469846 -0.170426
v 0.0419806 -0.469846 -0.165777
v 0 -0.5 0
v 0.0419806 -0.469846 -0.165777
v 0.0935339 -0.469846 -0.143164
v 0 -0.5 0
v 0.0935339 -0.469846 -0.143164
v 0.134951 -0.469846 -0.105037
v 0 -0.5 0
v 0.134951 -0.469846 -0.105037
v 0.161745 -0.469846 -0.0555267
v 0 -0.5 0
v 0.161745 -0.469846 -0.0555267
v 0.17101 -0.469846 2.74533e-07
v 0 0 0
v 0 0 0
v 0 0 0
v 0 0 0
v 0 0 0
v 0 0 0
v 0 0 0
v 0 0 0
v 0 0 0
v 0 0 0
v 0 0 0
v 0 0 0
v 0 0 0
v 0 0 0
v 0 0 0
v 0 0 0
v 0 0 0
v 0 0 0
v 0 0 0
v 0 0 0
v 0 0 0
v 0 0 0
v 0 0 0
v 0 0 0
v 0 0 0
v 0 0 0
v 0 0 0
v 0 0 0
v 0 0 0
v 0 0 0
v 0 0 0
v 0 0 0
v 0 0 0
v 0 0 0
v 0 0 0
v 0 0 0
v 0 0 0
v 0 0 0
v 0 0 0
v 0 0 0
v 0 0 0
v 0 0 0
v 0 0 0
v 0 0 0
v 0 0 0
v 0 0 0
v 0 0 0
v 0 0 0
vt 0.0263158 1
vt 0.0526316 0.969846
vt 0 0.969846
vt 0.0789474 1
vt 0.105263 0.969846
vt 0.0526316 0.969846
vt 0.131579 1
vt 0.157895 0.969846
vt 0.105263 0.969846
vt 0.184211 1
vt 0.210526 0.969846
vt 0.157895 0.969846
vt 0.236842 1
vt 0.263158 0.969846
vt 0.210526 0.969846
vt 0.289474 1
vt 0.315789 0.969846
vt 0.263158 0.969846
vt 0.342105 1
vt 0.368421 0.969846
vt 0.315789 0.969846
vt 0.394737 1
vt 0.421053 0.969846
vt 0.368421 0.969846
vt 0.447368 1
vt 0.473684 0.969846
vt 0.421053 0.969846
vt 0.5 1
vt 0.526316 0.969846
vt 0.473684 0.969846
vt 0.552632 1
vt 0.578947 0.969846
vt 0.526316 0.969846
vt 0.605263 1
vt 0.631579 0.969846
vt 0.578947 0.969846
vt 0.657895 1
vt 0.684211 0.969846
vt 0.631579 0.969846
vt 0.710526 1
vt 0.736842 0.969846
vt 0.684211 0.969846
vt 0.763158 1
vt 0.789474 0.969846
vt 0.736842 0.969846
vt 0.81579 1
vt 0.842105 0.969846
vt 0.789474 0.969846
vt 0.868421 1
vt 0.894737 0.969846
vt 0.842105 0.969846
vt 0.921053 1
vt 0.947369 0.969846
vt 0.894737 0.969846
vt 0.973684 1
vt 1 0.969846
vt 0.947369 0.969846
vt 0 0.969846
vt 0.0526316 0.969846
vt 0 0.883022
vt 0 0.883022
vt 0.0526316 0.969846
vt 0.0526316 0.883022
vt 0.0526316 0.969846
vt 0.105263 0.969846
vt 0.0526316 0.883022
vt 0.0526316 0.883022
vt 0.105263 0.969846
vt 0.105263 0.883022
vt 0.105263 0.969846
vt 0.157895 0.969846
vt 0.105263 0.883022
vt 0.105263 0.883022
vt 0.157895 0.969846
vt 0.157895 0.883022
vt 0.157895 0.969846
vt 0.210526 0.969846
vt 0.157895 0.883022
vt 0.157895 0.883022
vt 0.210526 0.969846
vt 0.210526 0.883022
vt 0.210526 0.969846
vt 0.263158 0.969846
vt 0.210526 0.883022
vt 0.210526 0.883022
vt 0.263158 0.969846
vt 0.263158 0.883022
vt 0.263158 0.969846
vt 0.315789 0.969846
vt 0.263158 0.883022
vt 0.263158 0.883022
vt 0.315789 0.969846
vt 0.315789 0.883022
vt 0.315789 0.969846
vt 0.368421 0.969846
vt 0.315789 0.883022
vt 0.315789 0.883022
vt 0.368421 0.969846
vt 0.368421 0.883022
vt 0.368421 0.969846
vt 0.421053 0.969846
vt 0.368421 0.883022
vt 0.368421 0.883022
vt 0.421053 0.969846
vt 0.421053 0.883022
vt 0.421053 0.969846
vt 0.473684 0.969846
vt 0.421053 0.883022
vt 0.421053 0.883022
vt 0.473684 0.969846
vt 0.473684 0.883022
vt 0.473684 0.969846
vt 0.526316 0.969846
vt 0.473684 0.883022
vt 0.473684 0.883022
vt 0.526316 0.969846
vt 0.526316 0.883022
vt 0.526316 0.969846
vt 0.578947 0.969846
vt 0.526316 0.883022
vt 0.526316 0.883022
vt 0.578947 0.969846
vt 0.578947 0.883022
vt 0.578947 0.969846
vt 0.631579 0.969846
vt 0.578947 0.883022
vt 0.578947 0.883022
vt 0.631579 0.969846
vt 0.631579 0.883022
vt 0.631579 0.969846
vt 0.684211 0.969846
vt 0.631579 0.883022
vt 0.631579 0.883022
vt 0.684211 0.969846
vt 0.684211 0.883022
vt 0.684211 0.969846
vt 0.736842 0.969846
vt 0.684211 0.883022
vt 0.684211 0.883022
vt 0.736842 0.969846
vt 0.736842 0.883022
vt 0.736842 0.969846
vt 0.789474 0.969846
vt 0.736842 0.883022
vt 0.736842 0.883022
vt 0.789474 0.969846
vt 0.789474 0.883022
vt 0.789474 0.969846
vt 0.842105 0.969846
vt 0.789474 0.883022
vt 0.789474 0.883022
vt 0.842105 0.969846
vt 0.842105 0.883022
vt 0.842105 0.969846
vt 0.894737 0.969846
vt 0.842105 0.883022
vt 0.842105 0.883022
vt 0.894737 0.969846
vt 0.894737 0.883022
vt 0.894737 0.969846
vt 0.947369 0.969846
vt 0.894737 0.883022
vt 0.894737 0.883022
vt 0.947369 0.969846
vt 0.947369 0.883022
vt 0.947369 0.969846
vt 1 0.969846
vt 0.947369 0.883022
vt 0.947369 0.883022
vt 1 0.969846
vt 1 0.883022
vt 0 0.883022
vt 0.0526316 0.883022
vt 0 0.75
vt 0 0.75
vt 0.0526316 0.883022
vt 0.0526316 0.75
vt 0.0526316 0.883022
vt 0.105263 0.883022
vt 0.0526316 0.75
vt 0.0526316 0.75
vt 0.105263 0.883022
vt 0.105263 0.75
vt 0.105263 0.883022
vt 0.157895 0.883022
vt 0.105263 0.75
vt 0.105263 0.75
vt 0.157895 0.883022
vt 0.157895 0.75
vt 0.157895 0.883022
vt 0.210526 0.883022
vt 0.157895 0.75
vt 0.157895 0.75
vt 0.210526 0.883022
vt 0.210526 0.75
vt 0.210526 0.883022
vt 0.263158 0.883022
vt 0.210526 0.75
vt 0.210526 0.75
vt 0.263158 0.883022
vt 0.263158 0.75
vt 0.263158 0.883022
vt 0.315789 0.883022
vt 0.263158 0.75
vt 0.263158 0.75
vt 0.315789 0.883022
vt 0.315789 0.75
vt 0.315789 0.883022
vt 0.368421 0.883022
vt 0.315789 0.75
vt 0.315789 0.75
vt 0.368421 0.883022
vt 0.368421 0.75
vt 0.368421 0.883022
vt 0.421053 0.883022
vt 0.368421 0.75
vt 0.368421 0.75
vt 0.421053 0.883022
vt 0.421053 0.75
vt 0.421053 0.883022
vt 0.473684 0.883022
vt 0.421053 0.75
vt 0.421053 0.75
vt 0.473684 0.883022
vt 0.473684 0.75
vt 0.473684 0.883022
vt 0.526316 0.883022
vt 0.473684 0.75
vt 0.473684 0.75
vt 0.526316 0.883022
vt 0.526316 0.75
vt 0.526316 0.883022
vt 0.578947 0.883022
vt 0.526316 0.75
vt 0.526316 0.75
vt 0.578947 0.883022
vt 0.578947 0.75
vt 0.578947 0.883022
vt 0.631579 0.883022
vt 0.578947 0.75
vt 0.578947 0.75
vt 0.631579 0.883022
vt 0.631579 0.75
vt 0.631579 0.883022
vt 0.684211 0.883022
vt 0.631579 0.75
vt 0.631579 0.75
vt 0.684211 0.883022
vt 0.684211 0.75
vt 0.684211 0.883022
vt 0.736842 0.883022
vt 0.684211 0.75
vt 0.684211 0.75
vt 0.736842 0.883022
vt 0.736842 0.75
vt 0.736842 0.883022
vt 0.789474 0.883022
vt 0.736842 0.75
vt 0.736842 0.75
vt 0.789474 0.883022
vt 0.789474 0.75
vt 0.789474 0.883022
vt 0.842105 0.883022
vt 0.789474 0.75
vt 0.789474 0.75
vt 0.842105 0.883022
vt 0.842105 0.75
vt 0.842105 0.883022
vt 0.894737 0.883022
vt 0.842105 0.75
vt 0.842105 0.75
vt 0.894737 0.883022
vt 0.894737 0.75
vt 0.894737 0.883022
vt 0.947369 0.883022
vt 0.894737 0.75
vt 0.894737 0.75
vt 0.947369 0.883022
vt 0.947369 0.75
vt 0.947369 0.883022
vt 1 0.883022
vt 0.947369 0.75
vt 0.947369 0.75
vt 1 0.883022
vt 1 0.75
vt 0 0.75
vt 0.0526316 0.75
vt 0 0.586824
vt 0 0.586824
vt 0.0526316 0.75
vt 0.0526316 0.586824
vt 0.0526316 0.75
vt 0.105263 0.75
vt 0.0526316 0.586824
vt 0.0526316 0.586824
vt 0.105263 0.75
vt 0.105263 0.586824
vt 0.105263 0.75
vt 0.157895 0.75
vt 0.105263 0.586824
vt 0.105263 0.586824
vt 0.157895 0.75
vt 0.157895 0.586824
vt 0.157895 0.75
vt 0.210526 0.75
vt 0.157895 0.586824
vt 0.157895 0.586824
vt 0.210526 0.75
vt 0.210526 0.586824
vt 0.210526 0.75
vt 0.263158 0.75
vt 0.210526 0.586824
vt 0.210526 0.586824
vt 0.263158 0.75
vt 0.263158 0.586824
vt 0.263158 0.75
vt 0.315789 0.75
vt 0.263158 0.586824
vt 0.263158 0.586824
vt 0.315789 0.75
vt 0.315789 0.586824
vt 0.315789 0.75
vt 0.368421 0.75
vt 0.315789 0.586824
vt 0.315789 0.586824
vt 0.368421 0.75
vt 0.368421 0.586824
vt 0.368421 0.75
vt 0.421053 0.75
vt 0.368421 0.586824
vt 0.368421 0.586824
vt 0.421053 0.75
vt 0.421053 0.586824
vt 0.421053 0.75
vt 0.473684 0.75
vt 0.421053 0.586824
vt 0.421053 0.586824
vt 0.473684 0.75
vt 0.473684 0.586824
vt 0.473684 0.75
vt 0.526316 0.75
vt 0.473684 0.586824
vt 0.473684 0.586824
vt 0.526316 0.75
vt 0.526316 0.586824
vt 0.526316 0.75
vt 0.578947 0.75
vt 0.526316 0.586824
vt 0.526316 0.586824
vt 0.578947 0.75
vt 0.578947 0.586824
vt 0.578947 0.75
vt 0.631579 0.75
vt 0.578947 0.586824
vt 0.578947 0.586824
vt 0.631579 0.75
vt 0.631579 0.586824
vt 0.631579 0.75
vt 0.684211 0.75
vt 0.631579 0.586824
vt 0.631579 0.586824
vt 0.684211 0.75
vt 0.684211 0.586824
vt 0.684211 0.75
vt 0.736842 0.75
vt 0.684211 0.586824
vt 0.684211 0.586824
vt 0.736842 0.75
vt 0.736842 0.586824
vt 0.736842 0.75
vt 0.789474 0.75
vt 0.736842 0.586824
vt 0.736842 0.586824
vt 0.789474 0.75
vt 0.789474 0.586824
vt 0.789474 0.75
vt 0.842105 0.75
vt 0.789474 0.586824
vt 0.789474 0.586824
vt 0.842105 0.75
vt 0.842105 0.586824
vt 0.842105 0.75
vt 0.894737 0.75
vt 0.842105 0.586824
vt 0.842105 0.586824
vt 0.894737 0.75
vt 0.894737 0.586824
vt 0.894737 0.75
vt 0.947369 0.75
vt 0.894737 0.586824
vt 0.894737 0.586824
vt 0.947369 0.75
vt 0.947369 0.586824
vt 0.947369 0.75
vt 1 0.75
vt 0.947369 0.586824
vt 0.947369 0.586824
vt 1 0.75
vt 1 0.586824
vt 0 0.586824
vt 0.0526316 0.586824
vt 0 0.413176
vt 0 0.413176
vt 0.0526316 0.586824
vt 0.0526316 0.413176
vt 0.0526316 0.586824
vt 0.105263 0.586824
vt 0.0526316 0.413176
vt 0.0526316 0.413176
vt 0.105263 0.586824
vt 0.105263 0.413176
vt 0.105263 0.586824
vt 0.157895 0.586824
vt 0.105263 0.413176
vt 0.105263 0.413176
vt 0.157895 0.586824
vt 0.157895 0.413176
vt 0.157895 0.586824
vt 0.210526 0.586824
vt 0.157895 0.413176
vt 0.157895 0.413176
vt 0.210526 0.586824
vt 0.210526 0.413176
vt 0.210526 0.586824
vt 0.263158 0.586824
vt 0.210526 0.413176
vt 0.210526 0.413176
vt 0.263158 0.586824
vt 0.263158 0.413176
vt 0.263158 0.586824
vt 0.315789 0.586824
vt 0.263158 0.413176
vt 0.263158 0.413176
vt 0.315789 0.586824
vt 0.315789 0.413176
vt 0.315789 0.586824
vt 0.368421 0.586824
vt 0.315789 0.413176
vt 0.315789 0.413176
vt 0.368421 0.586824
vt 0.368421 0.413176
vt 0.368421 0.586824
vt 0.421053 0.586824
vt 0.368421 0.413176
vt 0.368421 0.413176
vt 0.421053 0.586824
vt 0.421053 0.413176
vt 0.421053 0.586824
vt 0.473684 0.586824
vt 0.421053 0.413176
vt 0.421053 0.413176
vt 0.473684 0.586824
vt 0.473684 0.413176
vt 0.473684 0.586824
vt 0.526316 0.586824
vt 0.473684 0.413176
vt 0.473684 0.413176
vt 0.526316 0.586824
vt 0.526316 0.413176
vt 0.526316 0.586824
vt 0.578947 0.586824
vt 0.526316 0.413176
vt 0.526316 0.413176
vt 0.578947 0.586824
vt 0.578947 0.413176
vt 0.578947 0.586824
vt 0.631579 0.586824
vt 0.578947 0.413176
vt 0.578947 0.413176
vt 0.631579 0.586824
vt 0.631579 0.413176
vt 0.631579 0.586824
vt 0.684211 0.586824
vt 0.631579 0.413176
vt 0.631579 0.413176
vt 0.684211 0.586824
vt 0.684211 0.413176
vt 0.684211 0.586824
vt 0.736842 0.586824
vt 0.684211 0.413176
vt 0.684211 0.413176
vt 0.736842 0.586824
vt 0.736842 0.413176
vt 0.736842 0.586824
vt 0.789474 0.586824
vt 0.736842 0.413176
vt 0.736842 0.413176
vt 0.789474 0.586824
vt 0.789474 0.413176
vt 0.789474 0.586824
vt 0.842105 0.586824
vt 0.789474 0.413176
vt 0.789474 0.413176
vt 0.842105 0.586824
vt 0.842105 0.413176
vt 0.842105 0.586824
vt 0.894737 0.586824
vt 0.842105 0.413176
vt 0.842105 0.413176
vt 0.894737 0.586824
vt 0.894737 0.413176
vt 0.894737 0.586824
vt 0.947369 0.586824
vt 0.894737 0.413176
vt 0.894737 0.413176
vt 0.947369 0.586824
vt 0.947369 0.413176
vt 0.947369 0.586824
vt 1 0.586824
vt 0.947369 0.413176
vt 0.947369 0.413176
vt 1 0.586824
vt 1 0.413176
vt 0 0.413176
vt 0.0526316 0.413176
vt 0 0.25
vt 0 0.25
vt 0.0526316 0.413176
vt 0.0526316 0.25
vt 0.0526316 0.413176
vt 0.105263 0.413176
vt 0.0526316 0.25
vt 0.0526316 0.25
vt 0.105263 0.413176
vt 0.105263 0.25
vt 0.105263 0.413176
vt 0.157895 0.413176
vt 0.105263 0.25
vt 0.105263 0.25
vt 0.157895 0.413176
vt 0.157895 0.25
vt 0.157895 0.413176
vt 0.210526 0.413176
vt 0.157895 0.25
vt 0.157895 0.25
vt 0.210526 0.413176
vt 0.210526 0.25
vt 0.210526 0.413176
vt 0.263158 0.413176
vt 0.210526 0.25
vt 0.210526 0.25
vt 0.263158 0.413176
vt 0.263158 0.25
vt 0.263158 0.413176
vt 0.315789 0.413176
vt 0.263158 0.25
vt 0.263158 0.25
vt 0.315789 0.413176
vt 0.315789 0.25
vt 0.315789 0.413176
vt 0.368421 0.413176
vt 0.315789 0.25
vt 0.315789 0.25
vt 0.368421 0.413176
vt 0.368421 0.25
vt 0.368421 0.413176
vt 0.421053 0.413176
vt 0.368421 0.25
vt 0.368421 0.25
vt 0.421053 0.413176
vt 0.421053 0.25
vt 0.421053 0.413176
vt 0.473684 0.413176
vt 0.421053 0.25
vt 0.421053 0.25
vt 0.473684 0.413176
vt 0.473684 0.25
vt 0.473684 0.413176
vt 0.526316 0.413176
vt 0.473684 0.25
vt 0.473684 0.25
vt 0.526316 0.413176
vt 0.526316 0.25
vt 0.526316 0.413176
vt 0.578947 0.413176
vt 0.526316 0.25
vt 0.526316 0.25
vt 0.578947 0.413176
vt 0.578947 0.25
vt 0.578947 0.413176
vt 0.631579 0.413176
vt 0.578947 0.25
vt 0.578947 0.25
vt 0.631579 0.413176
vt 0.631579 0.25
vt 0.631579 0.413176
vt 0.684211 0.413176
vt 0.631579 0.25
vt 0.631579 0.25
vt 0.684211 0.413176
vt 0.684211 0.25
vt 0.684211 0.413176
vt 0.736842 0.413176
vt 0.684211 0.25
vt 0.684211 0.25
vt 0.736842 0.413176
vt 0.736842 0.25
vt 0.736842 0.413176
vt 0.789474 0.413176
vt 0.736842 0.25
vt 0.736842 0.25
vt 0.789474 0.413176
vt 0.789474 0.25
vt 0.789474 0.413176
vt 0.842105 0.413176
vt 0.789474 0.25
vt 0.789474 0.25
vt 0.842105 0.413176
vt 0.842105 0.25
vt 0.842105 0.413176
vt 0.894737 0.413176
vt 0.842105 0.25
vt 0.842105 0.25
vt 0.894737 0.413176
vt 0.894737 0.25
vt 0.894737 0.413176
vt 0.947369 0.413176
vt 0.894737 0.25
vt 0.894737 0.25
vt 0.947369 0.413176
vt 0.947369 0.25
vt 0.947369 0.413176
vt 1 0.413176
vt 0.947369 0.25
vt 0.947369 0.25
vt 1 0.413176
vt 1 0.25
vt 0 0.25
vt 0.0526316 0.25
vt 0 0.116978
vt 0 0.116978
vt 0.0526316 0.25
vt 0.0526316 0.116978
vt 0.0526316 0.25
vt 0.105263 0.25
vt 0.0526316 0.116978
vt 0.0526316 0.116978
vt 0.105263 0.25
vt 0.105263 0.116978
vt 0.105263 0.25
vt 0.157895 0.25
vt 0.105263 0.116978
vt 0.105263 0.116978
vt 0.157895 0.25
vt 0.157895 0.116978
vt 0.157895 0.25
vt 0.210526 0.25
vt 0.157895 0.116978
vt 0.157895 0.116978
vt 0.210526 0.25
vt 0.210526 0.116978
vt 0.210526 0.25
vt 0.263158 0.25
vt 0.210526 0.116978
vt 0.210526 0.116978
vt 0.263158 0.25
vt 0.263158 0.116978
vt 0.263158 0.25
vt 0.315789 0.25
vt 0.263158 0.116978
vt 0.263158 0.116978
vt 0.315789 0.25
vt 0.315789 0.116978
vt 0.315789 0.25
vt 0.368421 0.25
vt 0.315789 0.116978
vt 0.315789 0.116978
vt 0.368421 0.25
vt 0.368421 0.116978
vt 0.368421 0.25
vt 0.421053 0.25
vt 0.368421 0.116978
vt 0.368421 0.116978
vt 0.421053 0.25
vt 0.421053 0.116978
vt 0.421053 0.25
vt 0.473684 0.25
vt 0.421053 0.116978
vt 0.421053 0.116978
vt 0.473684 0.25
vt 0.473684 0.116978
vt 0.473684 0.25
vt 0.526316 0.25
vt 0.473684 0.116978
vt 0.473684 0.116978
vt 0.526316 0.25
vt 0.526316 0.116978
vt 0.526316 0.25
vt 0.578947 0.25
vt 0.526316 0.116978
vt 0.526316 0.116978
vt 0.578947 0.25
vt 0.578947 0.116978
vt 0.578947 0.25
vt 0.631579 0.25
vt 0.578947 0.116978
vt 0.578947 0.116978
vt 0.631579 0.25
vt 0.631579 0.116978
vt 0.631579 0.25
vt 0.684211 0.25
vt 0.631579 0.116978
vt 0.631579 0.116978
vt 0.684211 0.25
vt 0.684211 0.116978
vt 0.684211 0.25
vt 0.736842 0.25
vt 0.684211 0.116978
vt 0.684211 0.116978
vt 0.736842 0.25
vt 0.736842 0.116978
vt 0.736842 0.25
vt 0.789474 0.25
vt 0.736842 0.116978
vt 0.736842 0.116978
vt 0.789474 0.25
vt 0.789474 0.116978
vt 0.789474 0.25
vt 0.842105 0.25
vt 0.789474 0.116978
vt 0.789474 0.116978
vt 0.842105 0.25
vt 0.842105 0.116978
vt 0.842105 0.25
vt 0.894737 0.25
vt 0.842105 0.116978
vt 0.842105 0.116978
vt 0.894737 0.25
vt 0.894737 0.116978
vt 0.894737 0.25
vt 0.947369 0.25
vt 0.894737 0.116978
vt 0.894737 0.116978
vt 0.947369 0.25
vt 0.947369 0.116978
vt 0.947369 0.25
vt 1 0.25
vt 0.947369 0.116978
vt 0.947369 0.116978
vt 1 0.25
vt 1 0.116978
vt 0 0.116978
vt 0.0526316 0.116978
vt 0 0.0301538
vt 0 0.0301538
vt 0.0526316 0.116978
vt 0.0526316 0.0301538
vt 0.0526316 0.116978
vt 0.105263 0.116978
vt 0.0526316 0.0301538
vt 0.0526316 0.0301538
vt 0.105263 0.116978
vt 0.105263 0.0301538
vt 0.105263 0.116978
vt 0.157895 0.116978
vt 0.105263 0.0301538
vt 0.105263 0.0301538
vt 0.157895 0.116978
vt 0.157895 0.0301538
vt 0.157895 0.116978
vt 0.210526 0.116978
vt 0.157895 0.0301538
vt 0.157895 0.0301538
vt 0.210526 0.116978
vt 0.210526 0.0301538
vt 0.210526 0.116978
vt 0.263158 0.116978
vt 0.210526 0.0301538
vt 0.210526 0.0301538
vt 0.263158 0.116978
vt 0.263158 0.0301538
vt 0.263158 0.116978
vt 0.315789 0.116978
vt 0.263158 0.0301538
vt 0.263158 0.0301538
vt 0.315789 0.116978
vt 0.315789 0.0301538
vt 0.315789 0.116978
vt 0.368421 0.116978
vt 0.315789 0.0301538
vt 0.315789 0.0301538
vt 0.368421 0.116978
vt 0.368421 0.0301538
vt 0.368421 0.116978
vt 0.421053 0.116978
vt 0.368421 0.0301538
vt 0.368421 0.0301538
vt 0.421053 0.116978
vt 0.421053 0.0301538
vt 0.421053 0.116978
vt 0.473684 0.116978
vt 0.421053 0.0301538
vt 0.421053 0.0301538
vt 0.473684 0.116978
vt 0.473684 0.0301538
vt 0.473684 0.116978
vt 0.526316 0.116978
vt 0.473684 0.0301538
vt 0.473684 0.0301538
vt 0.526316 0.116978
vt 0.526316 0.0301538
vt 0.526316 0.116978
vt 0.578947 0.116978
vt 0.526316 0.0301538
vt 0.526316 0.0301538
vt 0.578947 0.116978
vt 0.578947 0.0301538
vt 0.578947 0.116978
vt 0.631579 0.116978
vt 0.578947 0.0301538
vt 0.578947 0.0301538
vt 0.631579 0.116978
vt 0.631579 0.0301538
vt 0.631579 0.116978
vt 0.684211 0.116978
vt 0.631579 0.0301538
vt 0.631579 0.0301538
vt 0.684211 0.116978
vt 0.684211 0.0301538
vt 0.684211 0.116978
vt 0.736842 0.116978
vt 0.684211 0.0301538
vt 0.684211 0.0301538
vt 0.736842 0.116978
vt 0.736842 0.0301538
vt 0.736842 0.116978
vt 0.789474 0.116978
vt 0.736842 0.0301538
vt 0.736842 0.0301538
vt 0.789474 0.116978
vt 0.789474 0.0301538
vt 0.789474 0.116978
vt 0.842105 0.116978
vt 0.789474 0.0301538
vt 0.789474 0.0301538
vt 0.842105 0.116978
vt 0.842105 0.0301538
vt 0.842105 0.116978
vt 0.894737 0.116978
vt 0.842105 0.0301538
vt 0.842105 0.0301538
vt 0.894737 0.116978
vt 0.894737 0.0301538
vt 0.894737 0.116978
vt 0.947369 0.116978
vt 0.894737 0.0301538
vt 0.894737 0.0301538
vt 0.947369 0.116978
vt 0.947369 0.0301538
vt 0.947369 0.116978
vt 1 0.116978
vt 0.947369 0.0301538
vt 0.947369 0.0301538
vt 1 0.116978
vt 1 0.0301538
vt 0.0263158 0
vt 0 0.0301538
vt 0.0526316 0.0301538
vt 0.0789474 0
vt 0.0526316 0.0301538
vt 0.105263 0.0301538
vt 0.131579 0
vt 0.105263 0.0301538
vt 0.157895 0.0301538
vt 0.184211 0
vt 0.157895 0.0301538
vt 0.210526 0.0301538
vt 0.236842 0
vt 0.210526 0.0301538
vt 0.263158 0.0301538
vt 0.289474 0
vt 0.263158 0.0301538
vt 0.315789 0.0301538
vt 0.342105 0
vt 0.315789 0.0301538
vt 0.368421 0.0301538
vt 0.394737 0
vt 0.368421 0.0301538
vt 0.421053 0.0301538
vt 0.447368 0
vt 0.421053 0.0301538
vt 0.473684 0.0301538
vt 0.5 0
vt 0.473684 0.0301538
vt 0.526316 0.0301538
vt 0.552632 0
vt 0.526316 0.0301538
vt 0.578947 0.0301538
vt 0.605263 0
vt 0.578947 0.0301538
vt 0.631579 0.0301538
vt 0.657895 0
vt 0.631579 0.0301538
vt 0.684211 0.0301538
vt 0.710526 0
vt 0.684211 0.0301538
vt 0.736842 0.0301538
vt 0.763158 0
vt 0.736842 0.0301538
vt 0.789474 0.0301538
vt 0.81579 0
vt 0.789474 0.0301538
vt 0.842105 0.0301538
vt 0.868421 0
vt 0.842105 0.0301538
vt 0.894737 0.0301538
vt 0.921053 0
vt 0.894737 0.0301538
vt 0.947369 0.0301538
vt 0.973684 0
vt 0.947369 0.0301538
vt 1 0.0301538
vt 0 0
vt 0 0
vt 0 0
vt 0 0
vt 0 0
vt 0 0
vt 0 0
vt 0 0
vt 0 0
vt 0 0
vt 0 0
vt 0 0
vt 0 0
vt 0 0
vt 0 0
vt 0 0
vt 0 0
vt 0 0
vt 0 0
vt 0 0
vt 0 0
vt 0 0
vt 0 0
vt 0 0
vt 0 0
vt 0 0
vt 0 0
vt 0 0
vt 0 0
vt 0 0
vt 0 0
vt 0 0
vt 0 0
vt 0 0
vt 0 0
vt 0 0
vt 0 0
vt 0 0
vt 0 0
vt 0 0
vt 0 0
vt 0 0
vt 0 0
vt 0 0
vt 0 0
vt 0 0
vt 0 0
vt 0 0
vn 0.173575 0.984395 0.0289646
vn 0.173575 0.984395 0.0289646
vn 0.173575 0.984395 0.0289646
vn 0.154766 0.984395 0.0837551
vn 0.154766 0.984395 0.0837551
vn 0.154766 0.984395 0.0837551
vn 0.119185 0.984395 0.129469
vn 0.119185 0.984395 0.129469
vn 0.119185 0.984395 0.129469
vn 0.0706885 0.984395 0.161154
vn 0.0706885 0.984395 0.161154
vn 0.0706885 0.984395 0.161154
vn 0.0145319 0.984395 0.175374
vn 0.0145319 0.984395 0.175374
vn 0.0145319 0.984395 0.175374
vn -0.0431993 0.984395 0.170591
vn -0.0431993 0.984395 0.170591
vn -0.0431993 0.984395 0.170591
vn -0.0962494 0.984395 0.147321
vn -0.0962494 0.984395 0.147321
vn -0.0962494 0.984395 0.147321
vn -0.138869 0.984395 0.108086
vn -0.138869 0.984395 0.108086
vn -0.138869 0.984395 0.108086
vn -0.166441 0.984395 0.0571391
vn -0.166441 0.984395 0.0571391
vn -0.166441 0.984395 0.0571391
vn -0.175975 0.984394 0
vn -0.175975 0.984394 0
vn -0.175975 0.984394 0
vn -0.16644 0.984394 -0.0571391
vn -0.16644 0.984394 -0.0571391
vn -0.16644 0.984394 -0.0571391
vn -0.138869 0.984394 -0.108086
vn -0.138869 0.984394 -0.108086
vn -0.138869 0.984394 -0.108086
vn -0.0962494 0.984395 -0.147321
vn -0.0962494 0.984395 -0.147321
vn -0.0962494 0.984395 -0.147321
vn -0.0431993 0.984395 -0.170591
vn -0.0431993 0.984395 -0.170591
vn -0.0431993 0.984395 -0.170591
vn 0.014532 0.984395 -0.175374
vn 0.014532 0.984395 -0.175374
vn 0.014532 0.984395 -0.175374
vn 0.0706886 0.984395 -0.161153
vn 0.0706886 0.984395 -0.161153
vn 0.0706886 0.984395 -0.161153
vn 0.119185 0.984395 -0.129469
vn 0.119185 0.984395 -0.129469
vn 0.119185 0.984395 -0.129469
vn 0.154766 0.984395 -0.0837549
vn 0.154766 0.984395 -0.0837549
vn 0.154766 0.984395 -0.0837549
vn 0.173575 0.984395 -0.0289643
vn 0.173575 0.984395 -0.0289643
vn 0.173575 0.984395 -0.0289643
vn 0.498269 0.863027 0.0831463
vn 0.498269 0.863027 0.0831463
vn 0.498269 0.863027 0.0831463
vn 0.498269 0.863027 0.0831463
vn 0.498269 0.863027 0.0831463
vn 0.498269 0.863027 0.0831463
vn 0.444274 0.863027 0.240429
vn 0.444274 0.863027 0.240429
vn 0.444274 0.863027 0.240429
vn 0.444274 0.863027 0.240429
vn 0.444274 0.863027 0.240429
vn 0.444274 0.863027 0.240429
vn 0.342135 0.863027 0.371657
vn 0.342135 0.863027 0.371657
vn 0.342135 0.863027 0.371657
vn 0.342135 0.863027 0.371657
vn 0.342135 0.863027 0.371657
vn 0.342135 0.863027 0.371657
vn 0.20292 0.863027 0.462611
vn 0.20292 0.863027 0.462611
vn 0.20292 0.863027 0.462611
vn 0.20292 0.863027 0.462611
vn 0.20292 0.863027 0.462611
vn 0.20292 0.863027 0.462611
vn 0.0417155 0.863027 0.503433
vn 0.0417155 0.863027 0.503433
vn 0.0417155 0.863027 0.503433
vn 0.0417155 0.863027 0.503433
vn 0.0417155 0.863027 0.503433
vn 0.0417155 0.863027 0.503433
vn -0.124009 0.863027 0.489701
vn -0.124009 0.863027 0.489701
vn -0.124009 0.863027 0.489701
vn -0.124009 0.863027 0.489701
vn -0.124009 0.863027 0.489701
vn -0.124009 0.863027 0.489701
vn -0.276295 0.863027 0.422902
vn -0.276295 0.863027 0.422902
vn -0.276295 0.863027 0.422902
vn -0.276295 0.863027 0.422902
vn -0.276295 0.863027 0.422902
vn -0.276295 0.863027 0.422902
vn -0.398641 0.863027 0.310275
vn -0.398641 0.863027 0.310275
vn -0.398641 0.863027 0.310275
vn -0.398641 0.863027 0.310275
vn -0.398641 0.863027 0.310275
vn -0.398641 0.863027 0.310275
vn -0.477788 0.863027 0.164025
vn -0.477788 0.863027 0.164025
vn -0.477788 0.863027 0.164025
vn -0.477788 0.863027 0.164025
vn -0.477788 0.863027 0.164025
vn -0.477788 0.863027 0.164025
vn -0.505158 0.863027 0
vn -0.505158 0.863027 0
vn -0.505158 0.863027 0
vn -0.505158 0.863027 0
vn -0.505158 0.863027 0
vn -0.505158 0.863027 0
vn -0.477788 0.863027 -0.164025
vn -0.477788 0.863027 -0.164025
vn -0.477788 0.863027 -0.164025
vn -0.477788 0.863027 -0.164025
vn -0.477788 0.863027 -0.164025
vn -0.477788 0.863027 -0.164025
vn -0.398641 0.863027 -0.310275
vn -0.398641 0.863027 -0.310275
vn -0.398641 0.863027 -0.310275
vn -0.398641 0.863027 -0.310275
vn -0.398641 0.863027 -0.310275
vn -0.398641 0.863027 -0.310275
vn -0.276295 0.863027 -0.422902
vn -0.276295 0.863027 -0.422902
vn -0.276295 0.863027 -0.422902
vn -0.276295 0.863027 -0.422902
vn -0.276295 0.863027 -0.422902
vn -0.276295 0.863027 -0.422902
vn -0.124009 0.863027 -0.489701
vn -0.124009 0.863027 -0.489701
vn -0.124009 0.863027 -0.489701
vn -0.124009 0.863027 -0.489701
vn -0.124009 0.863027 -0.489701
vn -0.124009 0.863027 -0.489701
vn 0.0417159 0.863027 -0.503433
vn 0.0417159 0.863027 -0.503433
vn 0.0417159 0.863027 -0.503433
vn 0.0417159 0.863027 -0.503433
vn 0.0417159 0.863027 -0.503433
vn 0.0417159 0.863027 -0.503433
vn 0.20292 0.863027 -0.46261
vn 0.20292 0.863027 -0.46261
vn 0.20292 0.863027 -0.46261
vn 0.20292 0.863027 -0.46261
vn 0.20292 0.863027 -0.46261
vn 0.20292 0.863027 -0.46261
vn 0.342135 0.863027 -0.371657
vn 0.342135 0.863027 -0.371657
vn 0.342135 0.863027 -0.371657
vn 0.342135 0.863027 -0.371657
vn 0.342135 0.863027 -0.371657
vn 0.342135 0.863027 -0.371657
vn 0.444274 0.863027 -0.240428
vn 0.444274 0.863027 -0.240428
vn 0.444274 0.863027 -0.240428
vn 0.444274 0.863027 -0.240428
vn 0.444274 0.863027 -0.240428
vn 0.444274 0.863027 -0.240428
vn 0.498269 0.863027 -0.0831456
vn 0.498269 0.863027 -0.0831456
vn 0.498269 0.863027 -0.0831456
vn 0.498269 0.863027 -0.0831456
vn 0.498269 0.863027 -0.0831456
vn 0.498269 0.863027 -0.0831456
vn 0.759861 0.637599 0.126798
vn 0.759861 0.637599 0.126798
vn 0.759861 0.637599 0.126798
vn 0.759861 0.637599 0.126798
vn 0.759861 0.637599 0.126798
vn 0.759861 0.637599 0.126798
vn 0.677519 0.637599 0.366655
vn 0.677519 0.637599 0.366655
vn 0.677519 0.637599 0.366655
vn 0.677519 0.637599 0.366655
vn 0.677519 0.637599 0.366655
vn 0.677519 0.637599 0.366655
vn 0.521756 0.637599 0.566778
vn 0.521756 0.637599 0.566778
vn 0.521756 0.637599 0.566778
vn 0.521756 0.637599 0.566778
vn 0.521756 0.637599 0.566778
vn 0.521756 0.637599 0.566778
vn 0.309453 0.637599 0.705483
vn 0.309453 0.637599 0.705483
vn 0.309453 0.637599 0.705483
vn 0.309453 0.637599 0.705483
vn 0.309453 0.637599 0.705483
vn 0.309453 0.637599 0.705483
vn 0.0636163 0.637599 0.767737
vn 0.0636163 0.637599 0.767737
vn 0.0636163 0.637599 0.767737
vn 0.0636163 0.637599 0.767737
vn 0.0636163 0.637599 0.767737
vn 0.0636163 0.637599 0.767737
vn -0.189114 0.637599 0.746795
vn -0.189114 0.637599 0.746795
vn -0.189114 0.637599 0.746795
vn -0.189114 0.637599 0.746795
vn -0.189114 0.637599 0.746795
vn -0.189114 0.637599 0.746795
vn -0.421351 0.637599 0.644926
vn -0.421351 0.637599 0.644926
vn -0.421351 0.637599 0.644926
vn -0.421351 0.637599 0.644926
vn -0.421351 0.637599 0.644926
vn -0.421351 0.637599 0.644926
vn -0.607929 0.637599 0.47317
vn -0.607929 0.637599 0.47317
vn -0.607929 0.637599 0.47317
vn -0.607929 0.637599 0.47317
vn -0.607929 0.637599 0.47317
vn -0.607929 0.637599 0.47317
vn -0.728627 0.637599 0.250138
vn -0.728627 0.637599 0.250138
vn -0.728627 0.637599 0.250138
vn -0.728627 0.637599 0.250138
vn -0.728627 0.637599 0.250138
vn -0.728627 0.637599 0.250138
vn -0.770368 0.637599 0
vn -0.770368 0.637599 0
vn -0.770368 0.637599 0
vn -0.770368 0.637599 0
vn -0.770368 0.637599 0
vn -0.770368 0.637599 0
vn -0.728627 0.637599 -0.250138
vn -0.728627 0.637599 -0.250138
vn -0.728627 0.637599 -0.250138
vn -0.728627 0.637599 -0.250138
vn -0.728627 0.637599 -0.250138
vn -0.728627 0.637599 -0.250138
vn -0.607929 0.637599 -0.47317
vn -0.607929 0.637599 -0.47317
vn -0.607929 0.637599 -0.47317
vn -0.607929 0.637599 -0.47317
vn -0.607929 0.637599 -0.47317
vn -0.607929 0.637599 -0.47317
vn -0.421351 0.637599 -0.644926
vn -0.421351 0.637599 -0.644926
vn -0.421351 0.637599 -0.644926
vn -0.421351 0.637599 -0.644926
vn -0.421351 0.637599 -0.644926
vn -0.421351 0.637599 -0.644926
vn -0.189114 0.637599 -0.746795
vn -0.189114 0.637599 -0.746795
vn -0.189114 0.637599 -0.746795
vn -0.189114 0.637599 -0.746795
vn -0.189114 0.637599 -0.746795
vn -0.189114 0.637599 -0.746795
vn 0.0636169 0.637599 -0.767737
vn 0.0636169 0.637599 -0.767737
vn 0.0636169 0.637599 -0.767737
vn 0.0636169 0.637599 -0.767737
vn 0.0636169 0.637599 -0.767737
vn 0.0636169 0.637599 -0.767737
vn 0.309454 0.637599 -0.705482
vn 0.309454 0.637599 -0.705482
vn 0.309454 0.637599 -0.705482
vn 0.309454 0.637599 -0.705482
vn 0.309454 0.637599 -0.705482
vn 0.309454 0.637599 -0.705482
vn 0.521757 0.637599 -0.566778
vn 0.521757 0.637599 -0.566778
vn 0.521757 0.637599 -0.566778
vn 0.521757 0.637599 -0.566778
vn 0.521757 0.637599 -0.566778
vn 0.521757 0.637599 -0.566778
vn 0.677519 0.637599 -0.366654
vn 0.677519 0.637599 -0.366654
vn 0.677519 0.637599 -0.366654
vn 0.677519 0.637599 -0.366654
vn 0.677519 0.637599 -0.366654
vn 0.677519 0.637599 -0.366654
vn 0.759861 0.637599 -0.126797
vn 0.759861 0.637599 -0.126797
vn 0.759861 0.637599 -0.126797
vn 0.759861 0.637599 -0.126797
vn 0.759861 0.637599 -0.126797
vn 0.759861 0.637599 -0.126797
vn 0.928349 0.337891 0.154914
vn 0.928349 0.337891 0.154914
vn 0.928349 0.337891 0.154914
vn 0.928349 0.337891 0.154914
vn 0.928349 0.337891 0.154914
vn 0.928349 0.337891 0.154914
vn 0.827748 0.337891 0.447955
vn 0.827748 0.337891 0.447955
vn 0.827748 0.337891 0.447955
vn 0.827748 0.337891 0.447955
vn 0.827748 0.337891 0.447955
vn 0.827748 0.337891 0.447955
vn 0.637447 0.337891 0.692452
vn 0.637447 0.337891 0.692452
vn 0.637447 0.337891 0.692452
vn 0.637447 0.337891 0.692452
vn 0.637447 0.337891 0.692452
vn 0.637447 0.337891 0.692452
vn 0.37807 0.337891 0.861912
vn 0.37807 0.337891 0.861912
vn 0.37807 0.337891 0.861912
vn 0.37807 0.337891 0.861912
vn 0.37807 0.337891 0.861912
vn 0.37807 0.337891 0.861912
vn 0.0777223 0.337891 0.937971
vn 0.0777223 0.337891 0.937971
vn 0.0777223 0.337891 0.937971
vn 0.0777223 0.337891 0.937971
vn 0.0777223 0.337891 0.937971
vn 0.0777223 0.337891 0.937971
vn -0.231047 0.337891 0.912385
vn -0.231047 0.337891 0.912385
vn -0.231047 0.337891 0.912385
vn -0.231047 0.337891 0.912385
vn -0.231047 0.337891 0.912385
vn -0.231047 0.337891 0.912385
vn -0.514779 0.337891 0.787929
vn -0.514779 0.337891 0.787929
vn -0.514779 0.337891 0.787929
vn -0.514779 0.337891 0.787929
vn -0.514779 0.337891 0.787929
vn -0.514779 0.337891 0.787929
vn -0.742727 0.337891 0.578088
vn -0.742727 0.337891 0.578088
vn -0.742727 0.337891 0.578088
vn -0.742727 0.337891 0.578088
vn -0.742727 0.337891 0.578088
vn -0.742727 0.337891 0.578088
vn -0.890189 0.337891 0.305602
vn -0.890189 0.337891 0.305602
vn -0.890189 0.337891 0.305602
vn -0.890189 0.337891 0.305602
vn -0.890189 0.337891 0.305602
vn -0.890189 0.337891 0.305602
vn -0.941185 0.337891 0
vn -0.941185 0.337891 0
vn -0.941185 0.337891 0
vn -0.941185 0.337891 0
vn -0.941185 0.337891 0
vn -0.941185 0.337891 0
vn -0.890189 0.337891 -0.305602
vn -0.890189 0.337891 -0.305602
vn -0.890189 0.337891 -0.305602
vn -0.890189 0.337891 -0.305602
vn -0.890189 0.337891 -0.305602
vn -0.890189 0.337891 -0.305602
vn -0.742727 0.337891 -0.578088
vn -0.742727 0.337891 -0.578088
vn -0.742727 0.337891 -0.578088
vn -0.742727 0.337891 -0.578088
vn -0.742727 0.337891 -0.578088
vn -0.742727 0.337891 -0.578088
vn -0.514779 0.337891 -0.787929
vn -0.514779 0.337891 -0.787929
vn -0.514779 0.337891 -0.787929
vn -0.514779 0.337891 -0.787929
vn -0.514779 0.337891 -0.787929
vn -0.514779 0.337891 -0.787929
vn -0.231047 0.337891 -0.912385
vn -0.231047 0.337891 -0.912385
vn -0.231047 0.337891 -0.912385
vn -0.231047 0.337891 -0.912385
vn -0.231047 0.337891 -0.912385
vn -0.231047 0.337891 -0.912385
vn 0.077723 0.337891 -0.93797
vn 0.077723 0.337891 -0.93797
vn 0.077723 0.337891 -0.93797
vn 0.077723 0.337891 -0.93797
vn 0.077723 0.337891 -0.93797
vn 0.077723 0.337891 -0.93797
vn 0.37807 0.337891 -0.861912
vn 0.37807 0.337891 -0.861912
vn 0.37807 0.337891 -0.861912
vn 0.37807 0.337891 -0.861912
vn 0.37807 0.337891 -0.861912
vn 0.37807 0.337891 -0.861912
vn 0.637448 0.337891 -0.692452
vn 0.637448 0.337891 -0.692452
vn 0.637448 0.337891 -0.692452
vn 0.637448 0.337891 -0.692452
vn 0.637448 0.337891 -0.692452
vn 0.637448 0.337891 -0.692452
vn 0.827748 0.337891 -0.447954
vn 0.827748 0.337891 -0.447954
vn 0.827748 0.337891 -0.447954
vn 0.827748 0.337891 -0.447954
vn 0.827748 0.337891 -0.447954
vn 0.827748 0.337891 -0.447954
vn 0.928349 0.337891 -0.154912
vn 0.928349 0.337891 -0.154912
vn 0.928349 0.337891 -0.154912
vn 0.928349 0.337891 -0.154912
vn 0.928349 0.337891 -0.154912
vn 0.928349 0.337891 -0.154912
vn 0.986361 1.69284e-07 0.164595
vn 0.986361 1.69284e-07 0.164595
vn 0.986361 1.69284e-07 0.164595
vn 0.986361 1.69284e-07 0.164595
vn 0.986361 1.69284e-07 0.164595
vn 0.986361 1.69284e-07 0.164595
vn 0.879474 1.50939e-07 0.475947
vn 0.879474 1.50939e-07 0.475947
vn 0.879474 1.50939e-07 0.475947
vn 0.879474 1.50939e-07 0.475947
vn 0.879474 1.50939e-07 0.475947
vn 0.879474 1.50939e-07 0.475947
vn 0.677282 1.26268e-07 0.735724
vn 0.677282 1.26268e-07 0.735724
vn 0.677282 1.26268e-07 0.735724
vn 0.677282 1.26268e-07 0.735724
vn 0.677282 1.26268e-07 0.735724
vn 0.677282 1.26268e-07 0.735724
vn 0.401695 0 0.915773
vn 0.401695 0 0.915773
vn 0.401695 0 0.915773
vn 0.401695 0 0.915773
vn 0.401695 0 0.915773
vn 0.401695 0 0.915773
vn 0.0825794 1.74582e-07 0.996584
vn 0.0825794 1.74582e-07 0.996584
vn 0.0825794 1.74582e-07 0.996584
vn 0.0825794 1.74582e-07 0.996584
vn 0.0825794 1.74582e-07 0.996584
vn 0.0825794 1.74582e-07 0.996584
vn -0.245485 1.66373e-07 0.9694
vn -0.245485 1.66373e-07 0.9694
vn -0.245485 1.66373e-07 0.9694
vn -0.245485 1.66373e-07 0.9694
vn -0.245485 1.66373e-07 0.9694
vn -0.245485 1.66373e-07 0.9694
vn -0.546948 1.43679e-07 0.837166
vn -0.546948 1.43679e-07 0.837166
vn -0.546948 1.43679e-07 0.837166
vn -0.546948 1.43679e-07 0.837166
vn -0.546948 1.43679e-07 0.837166
vn -0.546948 1.43679e-07 0.837166
vn -0.789141 0 0.614213
vn -0.789141 0 0.614213
vn -0.789141 0 0.614213
vn -0.789141 0 0.614213
vn -0.789141 0 0.614213
vn -0.789141 0 0.614213
vn -0.945817 1.90189e-07 0.3247
vn -0.945817 1.90189e-07 0.3247
vn -0.945817 1.90189e-07 0.3247
vn -0.945817 1.90189e-07 0.3247
vn -0.945817 1.90189e-07 0.3247
vn -0.945817 1.90189e-07 0.3247
vn -1 1.71625e-07 0
vn -1 1.71625e-07 0
vn -1 1.71625e-07 0
vn -1 1.71625e-07 0
vn -1 1.71625e-07 0
vn -1 1.71625e-07 0
vn -0.945817 1.76257e-07 -0.3247
vn -0.945817 1.76257e-07 -0.3247
vn -0.945817 1.76257e-07 -0.3247
vn -0.945817 1.76257e-07 -0.3247
vn -0.945817 1.76257e-07 -0.3247
vn -0.945817 1.76257e-07 -0.3247
vn -0.789141 1.88143e-07 -0.614212
vn -0.789141 1.88143e-07 -0.614212
vn -0.789141 1.88143e-07 -0.614212
vn -0.789141 1.88143e-07 -0.614212
vn -0.789141 1.88143e-07 -0.614212
vn -0.789141 1.88143e-07 -0.614212
vn -0.546948 -0 -0.837167
vn -0.546948 -0 -0.837167
vn -0.546948 -0 -0.837167
vn -0.546948 -0 -0.837167
vn -0.546948 -0 -0.837167
vn -0.546948 -0 -0.837167
vn -0.245485 1.66373e-07 -0.9694
vn -0.245485 1.66373e-07 -0.9694
vn -0.245485 1.66373e-07 -0.9694
vn -0.245485 1.66373e-07 -0.9694
vn -0.245485 1.66373e-07 -0.9694
vn -0.245485 1.66373e-07 -0.9694
vn 0.0825801 1.71039e-07 -0.996584
vn 0.0825801 1.71039e-07 -0.996584
vn 0.0825801 1.71039e-07 -0.996584
vn 0.0825801 1.71039e-07 -0.996584
vn 0.0825801 1.71039e-07 -0.996584
vn 0.0825801 1.71039e-07 -0.996584
vn 0.401696 1.74405e-07 -0.915773
vn 0.401696 1.74405e-07 -0.915773
vn 0.401696 1.74405e-07 -0.915773
vn 0.401696 1.74405e-07 -0.915773
vn 0.401696 1.74405e-07 -0.915773
vn 0.401696 1.74405e-07 -0.915773
vn 0.677282 2.42507e-07 -0.735723
vn 0.677282 2.42507e-07 -0.735723
vn 0.677282 2.42507e-07 -0.735723
vn 0.677282 2.42507e-07 -0.735723
vn 0.677282 2.42507e-07 -0.735723
vn 0.677282 2.42507e-07 -0.735723
vn 0.879474 8.16842e-08 -0.475946
vn 0.879474 8.16842e-08 -0.475946
vn 0.879474 8.16842e-08 -0.475946
vn 0.879474 8.16842e-08 -0.475946
vn 0.879474 8.16842e-08 -0.475946
vn 0.879474 8.16842e-08 -0.475946
vn 0.986362 1.83408e-07 -0.164593
vn 0.986362 1.83408e-07 -0.164593
vn 0.986362 1.83408e-07 -0.164593
vn 0.986362 1.83408e-07 -0.164593
vn 0.986362 1.83408e-07 -0.164593
vn 0.986362 1.83408e-07 -0.164593
vn 0.928349 -0.337891 0.154914
vn 0.928349 -0.337891 0.154914
vn 0.928349 -0.337891 0.154914
vn 0.928349 -0.337891 0.154914
vn 0.928349 -0.337891 0.154914
vn 0.928349 -0.337891 0.154914
vn 0.827748 -0.337891 0.447955
vn 0.827748 -0.337891 0.447955
vn 0.827748 -0.337891 0.447955
vn 0.827748 -0.337891 0.447955
vn 0.827748 -0.337891 0.447955
vn 0.827748 -0.337891 0.447955
vn 0.637447 -0.337891 0.692452
vn 0.637447 -0.337891 0.692452
vn 0.637447 -0.337891 0.692452
vn 0.637447 -0.337891 0.692452
vn 0.637447 -0.337891 0.692452
vn 0.637447 -0.337891 0.692452
vn 0.37807 -0.337891 0.861912
vn 0.37807 -0.337891 0.861912
vn 0.37807 -0.337891 0.861912
vn 0.37807 -0.337891 0.861912
vn 0.37807 -0.337891 0.861912
vn 0.37807 -0.337891 0.861912
vn 0.0777225 -0.337891 0.937971
vn 0.0777225 -0.337891 0.937971
vn 0.0777225 -0.337891 0.937971
vn 0.0777225 -0.337891 0.937971
vn 0.0777225 -0.337891 0.937971
vn 0.0777225 -0.337891 0.937971
vn -0.231047 -0.337891 0.912385
vn -0.231047 -0.337891 0.912385
vn -0.231047 -0.337891 0.912385
vn -0.231047 -0.337891 0.912385
vn -0.231047 -0.337891 0.912385
vn -0.231047 -0.337891 0.912385
vn -0.51478 -0.337891 0.787929
vn -0.51478 -0.337891 0.787929
vn -0.51478 -0.337891 0.787929
vn -0.51478 -0.337891 0.787929
vn -0.51478 -0.337891 0.787929
vn -0.51478 -0.337891 0.787929
vn -0.742727 -0.337891 0.578088
vn -0.742727 -0.337891 0.578088
vn -0.742727 -0.337891 0.578088
vn -0.742727 -0.337891 0.578088
vn -0.742727 -0.337891 0.578088
vn -0.742727 -0.337891 0.578088
vn -0.890189 -0.337891 0.305602
vn -0.890189 -0.337891 0.305602
vn -0.890189 -0.337891 0.305602
vn -0.890189 -0.337891 0.305602
vn -0.890189 -0.337891 0.305602
vn -0.890189 -0.337891 0.305602
vn -0.941185 -0.337891 -0
vn -0.941185 -0.337891 -0
vn -0.941185 -0.337891 -0
vn -0.941185 -0.337891 -0
vn -0.941185 -0.337891 -0
vn -0.941185 -0.337891 -0
vn -0.890189 -0.337891 -0.305602
vn -0.890189 -0.337891 -0.305602
vn -0.890189 -0.337891 -0.305602
vn -0.890189 -0.337891 -0.305602
vn -0.890189 -0.337891 -0.305602
vn -0.890189 -0.337891 -0.305602
vn -0.742727 -0.337891 -0.578088
vn -0.742727 -0.337891 -0.578088
vn -0.742727 -0.337891 -0.578088
vn -0.742727 -0.337891 -0.578088
vn -0.742727 -0.337891 -0.578088
vn -0.742727 -0.337891 -0.578088
vn -0.514779 -0.337891 -0.787929
vn -0.514779 -0.337891 -0.787929
vn -0.514779 -0.337891 -0.787929
vn -0.514779 -0.337891 -0.787929
vn -0.514779 -0.337891 -0.787929
vn -0.514779 -0.337891 -0.787929
vn -0.231047 -0.337891 -0.912385
vn -0.231047 -0.337891 -0.912385
vn -0.231047 -0.337891 -0.912385
vn -0.231047 -0.337891 -0.912385
vn -0.231047 -0.337891 -0.912385
vn -0.231047 -0.337891 -0.912385
vn 0.0777231 -0.337891 -0.937971
vn 0.0777231 -0.337891 -0.937971
vn 0.0777231 -0.337891 -0.937971
vn 0.0777231 -0.337891 -0.937971
vn 0.0777231 -0.337891 -0.937971
vn 0.0777231 -0.337891 -0.937971
vn 0.37807 -0.337891 -0.861912
vn 0.37807 -0.337891 -0.861912
vn 0.37807 -0.337891 -0.861912
vn 0.37807 -0.337891 -0.861912
vn 0.37807 -0.337891 -0.861912
vn 0.37807 -0.337891 -0.861912
vn 0.637448 -0.337891 -0.692452
vn 0.637448 -0.337891 -0.692452
vn 0.637448 -0.337891 -0.692452
vn 0.637448 -0.337891 -0.692452
vn 0.637448 -0.337891 -0.692452
vn 0.637448 -0.337891 -0.692452
vn 0.827748 -0.337891 -0.447954
vn 0.827748 -0.337891 -0.447954
vn 0.827748 -0.337891 -0.447954
vn 0.827748 -0.337891 -0.447954
vn 0.827748 -0.337891 -0.447954
vn 0.827748 -0.337891 -0.447954
vn 0.928349 -0.337891 -0.154913
vn 0.928349 -0.337891 -0.154913
vn 0.928349 -0.337891 -0.154913
vn 0.928349 -0.337891 -0.154913
vn 0.928349 -0.337891 -0.154913
vn 0.928349 -0.337891 -0.154913
vn 0.759862 -0.637599 0.126798
vn 0.759862 -0.637599 0.126798
vn 0.759862 -0.637599 0.126798
vn 0.759862 -0.637599 0.126798
vn 0.759862 -0.637599 0.126798
vn 0.759862 -0.637599 0.126798
vn 0.677519 -0.637599 0.366655
vn 0.677519 -0.637599 0.366655
vn 0.677519 -0.637599 0.366655
vn 0.677519 -0.637599 0.366655
vn 0.677519 -0.637599 0.366655
vn 0.677519 -0.637599 0.366655
vn 0.521756 -0.637599 0.566778
vn 0.521756 -0.637599 0.566778
vn 0.521756 -0.637599 0.566778
vn 0.521756 -0.637599 0.566778
vn 0.521756 -0.637599 0.566778
vn 0.521756 -0.637599 0.566778
vn 0.309454 -0.637599 0.705483
vn 0.309454 -0.637599 0.705483
vn 0.309454 -0.637599 0.705483
vn 0.309454 -0.637599 0.705483
vn 0.309454 -0.637599 0.705483
vn 0.309454 -0.637599 0.705483
vn 0.0636163 -0.637599 0.767737
vn 0.0636163 -0.637599 0.767737
vn 0.0636163 -0.637599 0.767737
vn 0.0636163 -0.637599 0.767737
vn 0.0636163 -0.637599 0.767737
vn 0.0636163 -0.637599 0.767737
vn -0.189114 -0.637599 0.746795
vn -0.189114 -0.637599 0.746795
vn -0.189114 -0.637599 0.746795
vn -0.189114 -0.637599 0.746795
vn -0.189114 -0.637599 0.746795
vn -0.189114 -0.637599 0.746795
vn -0.421352 -0.637599 0.644927
vn -0.421352 -0.637599 0.644927
vn -0.421352 -0.637599 0.644927
vn -0.421352 -0.637599 0.644927
vn -0.421352 -0.637599 0.644927
vn -0.421352 -0.637599 0.644927
vn -0.607929 -0.637599 0.47317
vn -0.607929 -0.637599 0.47317
vn -0.607929 -0.637599 0.47317
vn -0.607929 -0.637599 0.47317
vn -0.607929 -0.637599 0.47317
vn -0.607929 -0.637599 0.47317
vn -0.728628 -0.637599 0.250138
vn -0.728628 -0.637599 0.250138
vn -0.728628 -0.637599 0.250138
vn -0.728628 -0.637599 0.250138
vn -0.728628 -0.637599 0.250138
vn -0.728628 -0.637599 0.250138
vn -0.770368 -0.637599 -0
vn -0.770368 -0.637599 -0
vn -0.770368 -0.637599 -0
vn -0.770368 -0.637599 -0
vn -0.770368 -0.637599 -0
vn -0.770368 -0.637599 -0
vn -0.728628 -0.637599 -0.250138
vn -0.728628 -0.637599 -0.250138
vn -0.728628 -0.637599 -0.250138
vn -0.728628 -0.637599 -0.250138
vn -0.728628 -0.637599 -0.250138
vn -0.728628 -0.637599 -0.250138
vn -0.607929 -0.637599 -0.47317
vn -0.607929 -0.637599 -0.47317
vn -0.607929 -0.637599 -0.47317
vn -0.607929 -0.637599 -0.47317
vn -0.607929 -0.637599 -0.47317
vn -0.607929 -0.637599 -0.47317
vn -0.421352 -0.637599 -0.644927
vn -0.421352 -0.637599 -0.644927
vn -0.421352 -0.637599 -0.644927
vn -0.421352 -0.637599 -0.644927
vn -0.421352 -0.637599 -0.644927
vn -0.421352 -0.637599 -0.644927
vn -0.189114 -0.637599 -0.746795
vn -0.189114 -0.637599 -0.746795
vn -0.189114 -0.637599 -0.746795
vn -0.189114 -0.637599 -0.746795
vn -0.189114 -0.637599 -0.746795
vn -0.189114 -0.637599 -0.746795
vn 0.0636169 -0.637599 -0.767737
vn 0.0636169 -0.637599 -0.767737
vn 0.0636169 -0.637599 -0.767737
vn 0.0636169 -0.637599 -0.767737
vn 0.0636169 -0.637599 -0.767737
vn 0.0636169 -0.637599 -0.767737
vn 0.309454 -0.637599 -0.705483
vn 0.309454 -0.637599 -0.705483
vn 0.309454 -0.637599 -0.705483
vn 0.309454 -0.637599 -0.705483
vn 0.309454 -0.637599 -0.705483
vn 0.309454 -0.637599 -0.705483
vn 0.521757 -0.637599 -0.566778
vn 0.521757 -0.637599 -0.566778
vn 0.521757 -0.637599 -0.566778
vn 0.521757 -0.637599 -0.566778
vn 0.521757 -0.637599 -0.566778
vn 0.521757 -0.637599 -0.566778
vn 0.677519 -0.637599 -0.366654
vn 0.677519 -0.637599 -0.366654
vn 0.677519 -0.637599 -0.366654
vn 0.677519 -0.637599 -0.366654
vn 0.677519 -0.637599 -0.366654
vn 0.677519 -0.637599 -0.366654
vn 0.759862 -0.637599 -0.126797
vn 0.759862 -0.637599 -0.126797
vn 0.759862 -0.637599 -0.126797
vn 0.759862 -0.637599 -0.126797
vn 0.759862 -0.637599 -0.126797
vn 0.759862 -0.637599 -0.126797
vn 0.498269 -0.863026 0.0831464
vn 0.498269 -0.863026 0.0831464
vn 0.498269 -0.863026 0.0831464
vn 0.498269 -0.863026 0.0831464
vn 0.498269 -0.863026 0.0831464
vn 0.498269 -0.863026 0.0831464
vn 0.444274 -0.863026 0.240429
vn 0.444274 -0.863026 0.240429
vn 0.444274 -0.863026 0.240429
vn 0.444274 -0.863026 0.240429
vn 0.444274 -0.863026 0.240429
vn 0.444274 -0.863026 0.240429
vn 0.342135 -0.863026 0.371657
vn 0.342135 -0.863026 0.371657
vn 0.342135 -0.863026 0.371657
vn 0.342135 -0.863026 0.371657
vn 0.342135 -0.863026 0.371657
vn 0.342135 -0.863026 0.371657
vn 0.20292 -0.863026 0.462611
vn 0.20292 -0.863026 0.462611
vn 0.20292 -0.863026 0.462611
vn 0.20292 -0.863026 0.462611
vn 0.20292 -0.863026 0.462611
vn 0.20292 -0.863026 0.462611
vn 0.0417155 -0.863026 0.503433
vn 0.0417155 -0.863026 0.503433
vn 0.0417155 -0.863026 0.503433
vn 0.0417155 -0.863026 0.503433
vn 0.0417155 -0.863026 0.503433
vn 0.0417155 -0.863026 0.503433
vn -0.124009 -0.863026 0.489701
vn -0.124009 -0.863026 0.489701
vn -0.124009 -0.863026 0.489701
vn -0.124009 -0.863026 0.489701
vn -0.124009 -0.863026 0.489701
vn -0.124009 -0.863026 0.489701
vn -0.276296 -0.863026 0.422902
vn -0.276296 -0.863026 0.422902
vn -0.276296 -0.863026 0.422902
vn -0.276296 -0.863026 0.422902
vn -0.276296 -0.863026 0.422902
vn -0.276296 -0.863026 0.422902
vn -0.398641 -0.863026 0.310275
vn -0.398641 -0.863026 0.310275
vn -0.398641 -0.863026 0.310275
vn -0.398641 -0.863026 0.310275
vn -0.398641 -0.863026 0.310275
vn -0.398641 -0.863026 0.310275
vn -0.477788 -0.863026 0.164025
vn -0.477788 -0.863026 0.164025
vn -0.477788 -0.863026 0.164025
vn -0.477788 -0.863026 0.164025
vn -0.477788 -0.863026 0.164025
vn -0.477788 -0.863026 0.164025
vn -0.505159 -0.863026 -0
vn -0.505159 -0.863026 -0
vn -0.505159 -0.863026 -0
vn -0.505159 -0.863026 -0
vn -0.505159 -0.863026 -0
vn -0.505159 -0.863026 -0
vn -0.477788 -0.863026 -0.164025
vn -0.477788 -0.863026 -0.164025
vn -0.477788 -0.863026 -0.164025
vn -0.477788 -0.863026 -0.164025
vn -0.477788 -0.863026 -0.164025
vn -0.477788 -0.863026 -0.164025
vn -0.398641 -0.863026 -0.310275
vn -0.398641 -0.863026 -0.310275
vn -0.398641 -0.863026 -0.310275
vn -0.398641 -0.863026 -0.310275
vn -0.398641 -0.863026 -0.310275
vn -0.398641 -0.863026 -0.310275
vn -0.276296 -0.863026 -0.422902
vn -0.276296 -0.863026 -0.422902
vn -0.276296 -0.863026 -0.422902
vn -0.276296 -0.863026 -0.422902
vn -0.276296 -0.863026 -0.422902
vn -0.276296 -0.863026 -0.422902
vn -0.124009 -0.863026 -0.489701
vn -0.124009 -0.863026 -0.489701
vn -0.124009 -0.863026 -0.489701
vn -0.124009 -0.863026 -0.489701
vn -0.124009 -0.863026 -0.489701
vn -0.124009 -0.863026 -0.489701
vn 0.0417159 -0.863027 -0.503433
vn 0.0417159 -0.863027 -0.503433
vn 0.0417159 -0.863027 -0.503433
vn 0.0417159 -0.863027 -0.503433
vn 0.0417159 -0.863027 -0.503433
vn 0.0417159 -0.863027 -0.503433
vn 0.20292 -0.863027 -0.462611
vn 0.20292 -0.863027 -0.462611
vn 0.20292 -0.863027 -0.462611
vn 0.20292 -0.863027 -0.462611
vn 0.20292 -0.863027 -0.462611
vn 0.20292 -0.863027 -0.462611
vn 0.342135 -0.863026 -0.371657
vn 0.342135 -0.863026 -0.371657
vn 0.342135 -0.863026 -0.371657
vn 0.342135 -0.863026 -0.371657
vn 0.342135 -0.863026 -0.371657
vn 0.342135 -0.863026 -0.371657
vn 0.444274 -0.863027 -0.240429
vn 0.444274 -0.863027 -0.240429
vn 0.444274 -0.863027 -0.240429
vn 0.444274 -0.863027 -0.240429
vn 0.444274 -0.863027 -0.240429
vn 0.444274 -0.863027 -0.240429
vn 0.498269 -0.863026 -0.0831456
vn 0.498269 -0.863026 -0.0831456
vn 0.498269 -0.863026 -0.0831456
vn 0.498269 -0.863026 -0.0831456
vn 0.498269 -0.863026 -0.0831456
vn 0.498269 -0.863026 -0.0831456
vn 0.173575 -0.984395 0.0289647
vn 0.173575 -0.984395 0.0289647
vn 0.173575 -0.984395 0.0289647
vn 0.154766 -0.984395 0.0837551
vn 0.154766 -0.984395 0.0837551
vn 0.154766 -0.984395 0.0837551
vn 0.119185 -0.984395 0.129469
vn 0.119185 -0.984395 0.129469
vn 0.119185 -0.984395 0.129469
vn 0.0706886 -0.984395 0.161154
vn 0.0706886 -0.984395 0.161154
vn 0.0706886 -0.984395 0.161154
vn 0.0145319 -0.984395 0.175375
vn 0.0145319 -0.984395 0.175375
vn 0.0145319 -0.984395 0.175375
vn -0.0431995 -0.984395 0.170591
vn -0.0431995 -0.984395 0.170591
vn -0.0431995 -0.984395 0.170591
vn -0.0962495 -0.984395 0.147321
vn -0.0962495 -0.984395 0.147321
vn -0.0962495 -0.984395 0.147321
vn -0.138869 -0.984395 0.108086
vn -0.138869 -0.984395 0.108086
vn -0.138869 -0.984395 0.108086
vn -0.166441 -0.984395 0.0571392
vn -0.166441 -0.984395 0.0571392
vn -0.166441 -0.984395 0.0571392
vn -0.175976 -0.984395 0
vn -0.175976 -0.984395 0
vn -0.175976 -0.984395 0
vn -0.166441 -0.984395 -0.0571392
vn -0.166441 -0.984395 -0.0571392
vn -0.166441 -0.984395 -0.0571392
vn -0.138869 -0.984395 -0.108086
vn -0.138869 -0.984395 -0.108086
vn -0.138869 -0.984395 -0.108086
vn -0.0962495 -0.984395 -0.147321
vn -0.0962495 -0.984395 -0.147321
vn -0.0962495 -0.984395 -0.147321
vn -0.0431994 -0.984395 -0.170591
vn -0.0431994 -0.984395 -0.170591
vn -0.0431994 -0.984395 -0.170591
vn 0.0145321 -0.984394 -0.175375
vn 0.0145321 -0.984394 -0.175375
vn 0.0145321 -0.984394 -0.175375
vn 0.0706887 -0.984395 -0.161154
vn 0.0706887 -0.984395 -0.161154
vn 0.0706887 -0.984395 -0.161154
vn 0.119185 -0.984395 -0.129469
vn 0.119185 -0.984395 -0.129469
vn 0.119185 -0.984395 -0.129469
vn 0.154766 -0.984394 -0.083755
vn 0.154766 -0.984394 -0.083755
vn 0.154766 -0.984394 -0.083755
vn 0.173576 -0.984394 -0.0289643
vn 0.173576 -0.984394 -0.0289643
vn 0.173576 -0.984394 -0.0289643
vn 0 0 0
vn 0 0 0
vn 0 0 0
vn 0 0 0
vn 0 0 0
vn 0 0 0
vn 0 0 0
vn 0 0 0
vn 0 0 0
vn 0 0 0
vn 0 0 0
vn 0 0 0
vn 0 0 0
vn 0 0 0
vn 0 0 0
vn 0 0 0
vn 0 0 0
vn 0 0 0
vn 0 0 0
vn 0 0 0
vn 0 0 0
vn 0 0 0
vn 0 0 0
vn 0 0 0
vn 0 0 0
vn 0 0 0
vn 0 0 0
vn 0 0 0
vn 0 0 0
vn 0 0 0
vn 0 0 0
vn 0 0 0
vn 0 0 0
vn 0 0 0
vn 0 0 0
vn 0 0 0
vn 0 0 0
vn 0 0 0
vn 0 0 0
vn 0 0 0
vn 0 0 0
vn 0 0 0
vn 0 0 0
vn 0 0 0
vn 0 0 0
vn 0 0 0
vn 0 0 0
vn 0 0 0
f 1/1/1 2/2/2 3/3/3
f 4/4/4 5/5/5 6/6/6
f 7/7/7 8/8/8 9/9/9
f 10/10/10 11/11/11 12/12/12
f 13/13/13 14/14/14 15/15/15
f 16/16/16 17/17/17 18/18/18
f 19/19/19 20/20/20 21/21/21
f 22/22/22 23/23/23 24/24/24
f 25/25/25 26/26/26 27/27/27
f 28/28/28 29/29/29 30/30/30
f 31/31/31 32/32/32 33/33/33
f 34/34/34 35/35/35 36/36/36
f 37/37/37 38/38/38 39/39/39
f 40/40/40 41/41/41 42/42/42
f 43/43/43 44/44/44 45/45/45
f 46/46/46 47/47/47 48/48/48
f 49/49/49 50/50/50 51/51/51
f 52/52/52 53/53/53 54/54/54
f 55/55/55 56/56/56 57/57/57
f 58/58/58 59/59/59 60/60/60
f 61/61/61 62/62/62 63/63/63
f 64/64/64 65/65/65 66/66/66
f 67/67/67 68/68/68 69/69/69
f 70/70/70 71/71/71 72/72/72
f 73/73/73 74/74/74 75/75/75
f 76/76/76 77/77/77 78/78/78
f 79/79/79 80/80/80 81/81/81
f 82/82/82 83/83/83 84/84/84
f 85/85/85 86/86/86 87/87/87
f 88/88/88 89/89/89 90/90/90
f 91/91/91 92/92/92 93/93/93
f 94/94/94 95/95/95 96/96/96
f 97/97/97 98/98/98 99/99/99
f 100/100/100 101/101/101 102/102/102
f 103/103/103 104/104/104 105/105/105
f 106/106/106 107/107/107 108/108/108
f 109/109/109 110/110/110 111/111/111
f 112/112/112 113/113/113 114/114/114
f 115/115/115 116/116/116 117/117/117
f 118/118/118 119/119/119 120/120/120
f 121/121/121 122/122/122 123/123/123
f 124/124/124 125/125/125 126/126/126
f 127/127/127 128/128/128 129/129/129
f 130/130/130 131/131/131 132/132/132
f 133/133/133 134/134/134 135/135/135
f 136/136/136 137/137/137 138/138/138
f 139/139/139 140/140/140 141/141/141
f 142/142/142 143/143/143 144/144/144
f 145/145/145 146/146/146 147/147/147
f 148/148/148 149/149/149 150/150/150
f 151/151/151 152/152/152 153/153/153
f 154/154/154 155/155/155 156/156/156
f 157/157/157 158/158/158 159/159/159
f 160/160/160 161/161/161 162/162/162
f 163/163/163 164/164/164 165/165/165
f 166/166/166 167/167/167 168/168/168
f 169/169/169 170/170/170 171/171/171
f 172/172/172 173/173/173 174/174/174
f 175/175/175 176/176/176 177/177/177
f 178/178/178 179/179/179 180/180/180
f 181/181/181 182/182/182 183/183/183
f 184/184/184 185/185/185 186/186/186
f 187/187/187 188/188/188 189/189/189
f 190/190/190 191/191/191 192/192/192
f 193/193/193 194/194/194 195/195/195
f 196/196/196 197/197/197 198/198/198
f 199/199/199 200/200/200 201/201/201
f 202/202/202 203/203/203 204/204/204
f 205/205/205 206/206/206 207/207/207
f 208/208/208 209/209/209 210/210/210
f 211/211/211 212/212/212 213/213/213
f 214/214/214 215/215/215 216/216/216
f 217/217/217 218/218/218 219/219/219
f 220/220/220 221/221/221 222/222/222
f 223/223/223 224/224/224 225/225/225
f 226/226/226 227/227/227 228/228/228
f 229/229/229 230/230/230 231/231/231
f 232/232/232 233/233/233 234/234/234
f 235/235/235 236/236/236 237/237/237
f 238/238/238 239/239/239 240/240/240
f 241/241/241 242/242/242 243/243/243
f 244/244/244 245/245/245 246/246/246
f 247/247/247 248/248/248 249/249/249
f 250/250/250 251/251/251 252/252/252
f 253/253/253 254/254/254 255/255/255
f 256/256/256 257/257/257 258/258/258
f 259/259/259 260/260/260 261/261/261
f 262/262/262 263/263/263 264/264/264
f 265/265/265 266/266/266 267/267/267
f 268/268/268 269/269/269 270/270/270
f 271/271/271 272/272/272 273/273/273
f 274/274/274 275/275/275 276/276/276
f 277/277/277 278/278/278 279/279/279
f 280/280/280 281/281/281 282/282/282
f 283/283/283 284/284/284 285/285/285
f 286/286/286 287/287/287 288/288/288
f 289/289/289 290/290/290 291/291/291
f 292/292/292 293/293/293 294/294/294
f 295/295/295 296/296/296 297/297/297
f 298/298/298 299/299/299 300/300/300
f 301/301/301 302/302/302 303/303/303
f 304/304/304 305/305/305 306/306/306
f 307/307/307 308/308/308 309/309/309
f 310/310/310 311/311/311 312/312/312
f 313/313/313 314/314/314 315/315/315
f 316/316/316 317/317/317 318/318/318
f 319/319/319 320/320/320 321/321/321
f 322/322/322 323/323/323 324/324/324
f 325/325/325 326/326/326 327/327/327
f 328/328/328 329/329/329 330/330/330
f 331/331/331 332/332/332 333/333/333
f 334/334/334 335/335/335 336/336/336
f 337/337/337 338/338/338 339/339/339
f 340/340/340 341/341/341 342/342/342
f 343/343/343 344/344/344 345/345/345
f 346/346/346 347/347/347 348/348/348
f 349/349/349 350/350/350 351/351/351
f 352/352/352 353/353/353 354/354/354
f 355/355/355 356/356/356 357/357/357
f 358/358/358 359/359/359 360/360/360
f 361/361/361 362/362/362 363/363/363
f 364/364/364 365/365/365 366/366/366
f 367/367/367 368/368/368 369/369/369
f 370/370/370 371/371/371 372/372/372
f 373/373/373 374/374/374 375/375/375
f 376/376/376 377/377/377 378/378/378
f 379/379/379 380/380/380 381/381/381
f 382/382/382 383/383/383 384/384/384
f 385/385/385 386/386/386 387/387/387
f 388/388/388 389/389/389 390/390/390
f 391/391/391 392/392/392 393/393/393
f 394/394/394 395/395/395 396/396/396
f 397/397/397 398/398/398 399/399/399
f 400/400/400 401/401/401 402/402/402
f 403/403/403 404/404/404 405/405/405
f 406/406/406 407/407/407 408/408/408
f 409/409/409 410/410/410 411/411/411
f 412/412/412 413/413/413 414/414/414
f 415/415/415 416/416/416 417/417/417
f 418/418/418 419/419/419 420/420/420
f 421/421/421 422/422/422 423/423/423
f 424/424/424 425/425/425 426/426/426
f 427/427/427 428/428/428 429/429/429
f 430/430/430 431/431/431 432/432/432
f 433/433/433 434/434/434 435/435/435
f 436/436/436 437/437/437 438/438/438
f 439/439/439 440/440/440 441/441/441
f 442/442/442 443/443/443 444/444/444
f 445/445/445 446/446/446 447/447/447
f 448/448/448 449/449/449 450/450/450
f 451/451/451 452/452/452 453/453/453
f 454/454/454 455/455/455 456/456/456
f 457/457/457 458/458/458 459/459/459
f 460/460/460 461/461/461 462/462/462
f 463/463/463 464/464/464 465/465/465
f 466/466/466 467/467/467 468/468/468
f 469/469/469 470/470/470 471/471/471
f 472/472/472 473/473/473 474/474/474
f 475/475/475 476/476/476 477/477/477
f 478/478/478 479/479/479 480/480/480
f 481/481/481 482/482/482 483/483/483
f 484/484/484 485/485/485 486/486/486
f 487/487/487 488/488/488 489/489/489
f 490/490/490 491/491/491 492/492/492
f 493/493/493 494/494/494 495/495/495
f 496/496/496 497/497/497 498/498/498
f 499/499/499 500/500/500 501/501/501
f 502/502/502 503/503/503 504/504/504
f 505/505/505 506/506/506 507/507/507
f 508/508/508 509/509/509 510/510/510
f 511/511/511 512/512/512 513/513/513
f 514/514/514 515/515/515 516/516/516
f 517/517/517 518/518/518 519/519/519
f 520/520/520 521/521/521 522/522/522
f 523/523/523 524/524/524 525/525/525
f 526/526/526 527/527/527 528/528/528
f 529/529/529 530/530/530 531/531/531
f 532/532/532 533/533/533 534/534/534
f 535/535/535 536/536/536 537/537/537
f 538/538/538 539/539/539 540/540/540
f 541/541/541 542/542/542 543/543/543
f 544/544/544 545/545/545 546/546/546
f 547/547/547 548/548/548 549/549/549
f 550/550/550 551/551/551 552/552/552
f 553/553/553 554/554/554 555/555/555
f 556/556/556 557/557/557 558/558/558
f 559/559/559 560/560/560 561/561/561
f 562/562/562 563/563/563 564/564/564
f 565/565/565 566/566/566 567/567/567
f 568/568/568 569/569/569 570/570/570
f 571/571/571 572/572/572 573/573/573
f 574/574/574 575/575/575 576/576/576
f 577/577/577 578/578/578 579/579/579
f 580/580/580 581/581/581 582/582/582
f 583/583/583 584/584/584 585/585/585
f 586/586/586 587/587/587 588/588/588
f 589/589/589 590/590/590 591/591/591
f 592/592/592 593/593/593 594/594/594
f 595/595/595 596/596/596 597/597/597
f 598/598/598 599/599/599 600/600/600
f 601/601/601 602/602/602 603/603/603
f 604/604/604 605/605/605 606/606/606
f 607/607/607 608/608/608 609/609/609
f 610/610/610 611/611/611 612/612/612
f 613/613/613 614/614/614 615/615/615
f 616/616/616 617/617/617 618/618/618
f 619/619/619 620/620/620 621/621/621
f 622/622/622 623/623/623 624/624/624
f 625/625/625 626/626/626 627/627/627
f 628/628/628 629/629/629 630/630/630
f 631/631/631 632/632/632 633/633/633
f 634/634/634 635/635/635 636/636/636
f 637/637/637 638/638/638 639/639/639
f 640/640/640 641/641/641 642/642/642
f 643/643/643 644/644/644 645/645/645
f 646/646/646 647/647/647 648/648/648
f 649/649/649 650/650/650 651/651/651
f 652/652/652 653/653/653 654/654/654
f 655/655/655 656/656/656 657/657/657
f 658/658/658 659/659/659 660/660/660
f 661/661/661 662/662/662 663/663/663
f 664/664/664 665/665/665 666/666/666
f 667/667/667 668/668/668 669/669/669
f 670/670/670 671/671/671 672/672/672
f 673/673/673 674/674/674 675/675/675
f 676/676/676 677/677/677 678/678/678
f 679/679/679 680/680/680 681/681/681
f 682/682/682 683/683/683 684/684/684
f 685/685/685 686/686/686 687/687/687
f 688/688/688 689/689/689 690/690/690
f 691/691/691 692/692/692 693/693/693
f 694/694/694 695/695/695 696/696/696
f 697/697/697 698/698/698 699/699/699
f 700/700/700 701/701/701 702/702/702
f 703/703/703 704/704/704 705/705/705
f 706/706/706 707/707/707 708/708/708
f 709/709/709 710/710/710 711/711/711
f 712/712/712 713/713/713 714/714/714
f 715/715/715 716/716/716 717/717/717
f 718/718/718 719/719/719 720/720/720
f 721/721/721 722/722/722 723/723/723
f 724/724/724 725/725/725 726/726/726
f 727/727/727 728/728/728 729/729/729
f 730/730/730 731/731/731 732/732/732
f 733/733/733 734/734/734 735/735/735
f 736/736/736 737/737/737 738/738/738
f 739/739/739 740/740/740 741/741/741
f 742/742/742 743/743/743 744/744/744
f 745/745/745 746/746/746 747/747/747
f 748/748/748 749/749/749 750/750/750
f 751/751/751 752/752/752 753/753/753
f 754/754/754 755/755/755 756/756/756
f 757/757/757 758/758/758 759/759/759
f 760/760/760 761/761/761 762/762/762
f 763/763/763 764/764/764 765/765/765
f 766/766/766 767/767/767 768/768/768
f 769/769/769 770/770/770 771/771/771
f 772/772/772 773/773/773 774/774/774
f 775/775/775 776/776/776 777/777/777
f 778/778/778 779/779/779 780/780/780
f 781/781/781 782/782/782 783/783/783
f 784/784/784 785/785/785 786/786/786
f 787/787/787 788/788/788 789/789/789
f 790/790/790 791/791/791 792/792/792
f 793/793/793 794/794/794 795/795/795
f 796/796/796 797/797/797 798/798/798
f 799/799/799 800/800/800 801/801/801
f 802/802/802 803/803/803 804/804/804
f 805/805/805 806/806/806 807/807/807
f 808/808/808 809/809/809 810/810/810
f 811/811/811 812/812/812 813/813/813
f 814/814/814 815/815/815 816/816/816
f 817/817/817 818/818/818 819/819/819
f 820/820/820 821/821/821 822/822/822
f 823/823/823 824/824/824 825/825/825
f 826/826/826 827/827/827 828/828/828
f 829/829/829 830/830/830 831/831/831
f 832/832/832 833/833/833 834/834/834
f 835/835/835 836/836/836 837/837/837
f 838/838/838 839/839/839 840/840/840
f 841/841/841 842/842/842 843/843/843
f 844/844/844 845/845/845 846/846/846
f 847/847/847 848/848/848 849/849/849
f 850/850/850 851/851/851 852/852/852
f 853/853/853 854/854/854 855/855/855
f 856/856/856 857/857/857 858/858/858
f 859/859/859 860/860/860 861/861/861
f 862/862/862 863/863/863 864/864/864
f 865/865/865 866/866/866 867/867/867
f 868/868/868 869/869/869 870/870/870
f 871/871/871 872/872/872 873/873/873
f 874/874/874 875/875/875 876/876/876
f 877/877/877 878/878/878 879/879/879
f 880/880/880 881/881/881 882/882/882
f 883/883/883 884/884/884 885/885/885
f 886/886/886 887/887/887 888/888/888
f 889/889/889 890/890/890 891/891/891
f 892/892/892 893/893/893 894/894/894
f 895/895/895 896/896/896 897/897/897
f 898/898/898 899/899/899 900/900/900
f 901/901/901 902/902/902 903/903/903
f 904/904/904 905/905/905 906/906/906
f 907/907/907 908/908/908 909/909/909
f 910/910/910 911/911/911 912/912/912
f 913/913/913 914/914/914 915/915/915
f 916/916/916 917/917/917 918/918/918
f 919/919/919 920/920/920 921/921/921
f 922/922/922 923/923/923 924/924/924
f 925/925/925 926/926/926 927/927/927
f 928/928/928 929/929/929 930/930/930
f 931/931/931 932/932/932 933/933/933
f 934/934/934 935/935/935 936/936/936
f 937/937/937 938/938/938 939/939/939
f 940/940/940 941/941/941 942/942/942
f 943/943/943 944/944/944 945/945/945
f 946/946/946 947/947/947 948/948/948
f 949/949/949 950/950/950 951/951/951
f 952/952/952 953/953/953 954/954/954
f 955/955/955 956/956/956 957/957/957
f 958/958/958 959/959/959 960/960/960
