v 0.5 -0.5 0
v 0.5 0.5 0
v 0.472909 -0.5 0.16235
v 0.472909 -0.5 0.16235
v 0.5 0.5 0
v 0.472909 0.5 0.16235
v 0.5 -0.5 0
v 0.472909 -0.5 0.16235
v 0 -0.5 0
v 0.5 0.5 0
v 0 0.5 0
v 0.472909 0.5 0.16235
v 0.472909 -0.5 0.16235
v 0.472909 0.5 0.16235
v 0.39457 -0.5 0.307106
v 0.39457 -0.5 0.307106
v 0.472909 0.5 0.16235
v 0.39457 0.5 0.307106
v 0.472909 -0.5 0.16235
v 0.39457 -0.5 0.307106
v 0 -0.5 0
v 0.472909 0.5 0.16235
v 0 0.5 0
v 0.39457 0.5 0.307106
v 0.39457 -0.5 0.307106
v 0.39457 0.5 0.307106
v 0.273474 -0.5 0.418583
v 0.273474 -0.5 0.418583
v 0.39457 0.5 0.307106
v 0.273474 0.5 0.418583
v 0.39457 -0.5 0.307106
v 0.273474 -0.5 0.418583
v 0 -0.5 0
v 0.39457 0.5 0.307106
v 0 0.5 0
v 0.273474 0.5 0.418583
v 0.273474 -0.5 0.418583
v 0.273474 0.5 0.418583
v 0.122743 -0.5 0.4847
v 0.122743 -0.5 0.4847
v 0.273474 0.5 0.418583
v 0.122743 0.5 0.4847
v 0.273474 -0.5 0.418583
v 0.122743 -0.5 0.4847
v 0 -0.5 0
v 0.273474 0.5 0.418583
v 0 0.5 0
v 0.122743 0.5 0.4847
v 0.122743 -0.5 0.4847
v 0.122743 0.5 0.4847
v -0.0412897 -0.5 0.498292
v -0.0412897 -0.5 0.498292
v 0.122743 0.5 0.4847
v -0.0412897 0.5 0.498292
v 0.122743 -0.5 0.4847
v -0.0412897 -0.5 0.498292
v 0 -0.5 0
v 0.122743 0.5 0.4847
v 0 0.5 0
v -0.0412897 0.5 0.498292
v -0.0412897 -0.5 0.498292
v -0.0412897 0.5 0.498292
v -0.200848 -0.5 0.457887
v -0.200848 -0.5 0.457887
v -0.0412897 0.5 0.498292
v -0.200848 0.5 0.457887
v -0.0412897 -0.5 0.498292
v -0.200848 -0.5 0.457887
v 0 -0.5 0
v -0.0412897 0.5 0.498292
v 0 0.5 0
v -0.200848 0.5 0.457887
v -0.200848 -0.5 0.457887
v -0.200848 0.5 0.457887
v -0.338641 -0.5 0.367862
v -0.338641 -0.5 0.367862
v -0.200848 0.5 0.457887
v -0.338641 0.5 0.367862
v -0.200848 -0.5 0.457887
v -0.338641 -0.5 0.367862
v 0 -0.5 0
v -0.200848 0.5 0.457887
v 0 0.5 0
v -0.338641 0.5 0.367862
v -0.338641 -0.5 0.367862
v -0.338641 0.5 0.367862
v -0.439737 -0.5 0.237974
v -0.439737 -0.5 0.237974
v -0.338641 0.5 0.367862
v -0.439737 0.5 0.237974
v -0.338641 -0.5 0.367862
v -0.439737 -0.5 0.237974
v 0 -0.5 0
v -0.338641 0.5 0.367862
v 0 0.5 0
v -0.439737 0.5 0.237974
v -0.439737 -0.5 0.237974
v -0.439737 0.5 0.237974
v -0.493181 -0.5 0.0822973
v -0.493181 -0.5 0.0822973
v -0.439737 0.5 0.237974
v -0.493181 0.5 0.0822973
v -0.439737 -0.5 0.237974
v -0.493181 -0.5 0.0822973
v 0 -0.5 0
v -0.439737 0.5 0.237974
v 0 0.5 0
v -0.493181 0.5 0.0822973
v -0.493181 -0.5 0.0822973
v -0.493181 0.5 0.0822973
v -0.493181 -0.5 -0.0822973
v -0.493181 -0.5 -0.0822973
v -0.493181 0.5 0.0822973
v -0.493181 0.5 -0.0822973
v -0.493181 -0.5 0.0822973
v -0.493181 -0.5 -0.0822973
v 0 -0.5 0
v -0.493181 0.5 0.0822973
v 0 0.5 0
v -0.493181 0.5 -0.0822973
v -0.493181 -0.5 -0.0822973
v -0.493181 0.5 -0.0822973
v -0.439737 -0.5 -0.237974
v -0.439737 -0.5 -0.237974
v -0.493181 0.5 -0.0822973
v -0.439737 0.5 -0.237974
v -0.493181 -0.5 -0.0822973
v -0.439737 -0.5 -0.237974
v 0 -0.5 0
v -0.493181 0.5 -0.0822973
v 0 0.5 0
v -0.439737 0.5 -0.237974
v -0.439737 -0.5 -0.237974
v -0.439737 0.5 -0.237974
v -0.338641 -0.5 -0.367862
v -0.338641 -0.5 -0.367862
v -0.439737 0.5 -0.237974
v -0.338641 0.5 -0.367862
v -0.439737 -0.5 -0.237974
v -0.338641 -0.5 -0.367862
v 0 -0.5 0
v -0.439737 0.5 -0.237974
v 0 0.5 0
v -0.338641 0.5 -0.367862
v -0.338641 -0.5 -0.367862
v -0.338641 0.5 -0.367862
v -0.200848 -0.5 -0.457887
v -0.200848 -0.5 -0.457887
v -0.338641 0.5 -0.367862
v -0.200848 0.5 -0.457887
v -0.338641 -0.5 -0.367862
v -0.200848 -0.5 -0.457887
v 0 -0.5 0
v -0.338641 0.5 -0.367862
v 0 0.5 0
v -0.200848 0.5 -0.457887
v -0.200848 -0.5 -0.457887
v -0.200848 0.5 -0.457887
v -0.0412895 -0.5 -0.498292
v -0.0412895 -0.5 -0.498292
v -0.200848 0.5 -0.457887
v -0.0412895 0.5 -0.498292
v -0.200848 -0.5 -0.457887
v -0.0412895 -0.5 -0.498292
v 0 -0.5 0
v -0.200848 0.5 -0.457887
v 0 0.5 0
v -0.0412895 0.5 -0.498292
v -0.0412895 -0.5 -0.498292
v -0.0412895 0.5 -0.498292
v 0.122743 -0.5 -0.4847
v 0.122743 -0.5 -0.4847
v -0.0412895 0.5 -0.498292
v 0.122743 0.5 -0.4847
v -0.0412895 -0.5 -0.498292
v 0.122743 -0.5 -0.4847
v 0 -0.5 0
v -0.0412895 0.5 -0.498292
v 0 0.5 0
v 0.122743 0.5 -0.4847
v 0.122743 -0.5 -0.4847
v 0.122743 0.5 -0.4847
v 0.273474 -0.5 -0.418583
v 0.273474 -0.5 -0.418583
v 0.122743 0.5 -0.4847
v 0.273474 0.5 -0.418583
v 0.122743 -0.5 -0.4847
v 0.273474 -0.5 -0.418583
v 0 -0.5 0
v 0.122743 0.5 -0.4847
v 0 0.5 0
v 0.273474 0.5 -0.418583
v 0.273474 -0.5 -0.418583
v 0.273474 0.5 -0.418583
v 0.394571 -0.5 -0.307106
v 0.394571 -0.5 -0.307106
v 0.273474 0.5 -0.418583
v 0.394571 0.5 -0.307106
v 0.273474 -0.5 -0.418583
v 0.394571 -0.5 -0.307106
v 0 -0.5 0
v 0.273474 0.5 -0.418583
v 0 0.5 0
v 0.394571 0.5 -0.307106
v 0.394571 -0.5 -0.307106
v 0.394571 0.5 -0.307106
v 0.472909 -0.5 -0.162349
v 0.472909 -0.5 -0.162349
v 0.394571 0.5 -0.307106
v 0.472909 0.5 -0.162349
v 0.394571 -0.5 -0.307106
v 0.472909 -0.5 -0.162349
v 0 -0.5 0
v 0.394571 0.5 -0.307106
v 0 0.5 0
v 0.472909 0.5 -0.162349
v 0.472909 -0.5 -0.162349
v 0.472909 0.5 -0.162349
v 0.5 -0.5 8.02679e-07
v 0.5 -0.5 8.02679e-07
v 0.472909 0.5 -0.162349
v 0.5 0.5 8.02679e-07
v 0.472909 -0.5 -0.162349
v 0.5 -0.5 8.02679e-07
v 0 -0.5 0
v 0.472909 0.5 -0.162349
v 0 0.5 0
v 0.5 0.5 8.02679e-07
vt 0 0
vt 0 1
vt 0.0526316 0
vt 0.0526316 0
vt 0 1
vt 0.0526316 1
vt 0 0
vt 0.0526316 0
vt 0.0263158 0
vt 0 1
vt 0.0263158 1
vt 0.0526316 1
vt 0.0526316 0
vt 0.0526316 1
vt 0.105263 0
vt 0.105263 0
vt 0.0526316 1
vt 0.105263 1
vt 0.0526316 0
vt 0.105263 0
vt 0.0789474 0
vt 0.0526316 1
vt 0.0789474 1
vt 0.105263 1
vt 0.105263 0
vt 0.105263 1
vt 0.157895 0
vt 0.157895 0
vt 0.105263 1
vt 0.157895 1
vt 0.105263 0
vt 0.157895 0
vt 0.131579 0
vt 0.105263 1
vt 0.131579 1
vt 0.157895 1
vt 0.157895 0
vt 0.157895 1
vt 0.210526 0
vt 0.210526 0
vt 0.157895 1
vt 0.210526 1
vt 0.157895 0
vt 0.210526 0
vt 0.184211 0
vt 0.157895 1
vt 0.184211 1
vt 0.210526 1
vt 0.210526 0
vt 0.210526 1
vt 0.263158 0
vt 0.263158 0
vt 0.210526 1
vt 0.263158 1
vt 0.210526 0
vt 0.263158 0
vt 0.236842 0
vt 0.210526 1
vt 0.236842 1
vt 0.263158 1
vt 0.263158 0
vt 0.263158 1
vt 0.315789 0
vt 0.315789 0
vt 0.263158 1
vt 0.315789 1
vt 0.263158 0
vt 0.315789 0
vt 0.289474 0
vt 0.263158 1
vt 0.289474 1
vt 0.315789 1
vt 0.315789 0
vt 0.315789 1
vt 0.368421 0
vt 0.368421 0
vt 0.315789 1
vt 0.368421 1
vt 0.315789 0
vt 0.368421 0
vt 0.342105 0
vt 0.315789 1
vt 0.342105 1
vt 0.368421 1
vt 0.368421 0
vt 0.368421 1
vt 0.421053 0
vt 0.421053 0
vt 0.368421 1
vt 0.421053 1
vt 0.368421 0
vt 0.421053 0
vt 0.394737 0
vt 0.368421 1
vt 0.394737 1
vt 0.421053 1
vt 0.421053 0
vt 0.421053 1
vt 0.473684 0
vt 0.473684 0
vt 0.421053 1
vt 0.473684 1
vt 0.421053 0
vt 0.473684 0
vt 0.447368 0
vt 0.421053 1
vt 0.447368 1
vt 0.473684 1
vt 0.473684 0
vt 0.473684 1
vt 0.526316 0
vt 0.526316 0
vt 0.473684 1
vt 0.526316 1
vt 0.473684 0
vt 0.526316 0
vt 0.5 0
vt 0.473684 1
vt 0.5 1
vt 0.526316 1
vt 0.526316 0
vt 0.526316 1
vt 0.578947 0
vt 0.578947 0
vt 0.526316 1
vt 0.578947 1
vt 0.526316 0
vt 0.578947 0
vt 0.552632 0
vt 0.526316 1
vt 0.552632 1
vt 0.578947 1
vt 0.578947 0
vt 0.578947 1
vt 0.631579 0
vt 0.631579 0
vt 0.578947 1
vt 0.631579 1
vt 0.578947 0
vt 0.631579 0
vt 0.605263 0
vt 0.578947 1
vt 0.605263 1
vt 0.631579 1
vt 0.631579 0
vt 0.631579 1
vt 0.684211 0
vt 0.684211 0
vt 0.631579 1
vt 0.684211 1
vt 0.631579 0
vt 0.684211 0
vt 0.657895 0
vt 0.631579 1
vt 0.657895 1
vt 0.684211 1
vt 0.684211 0
vt 0.684211 1
vt 0.736842 0
vt 0.736842 0
vt 0.684211 1
vt 0.736842 1
vt 0.684211 0
vt 0.736842 0
vt 0.710526 0
vt 0.684211 1
vt 0.710526 1
vt 0.736842 1
vt 0.736842 0
vt 0.736842 1
vt 0.789474 0
vt 0.789474 0
vt 0.736842 1
vt 0.789474 1
vt 0.736842 0
vt 0.789474 0
vt 0.763158 0
vt 0.736842 1
vt 0.763158 1
vt 0.789474 1
vt 0.789474 0
vt 0.789474 1
vt 0.842105 0
vt 0.842105 0
vt 0.789474 1
vt 0.842105 1
vt 0.789474 0
vt 0.842105 0
vt 0.81579 0
vt 0.789474 1
vt 0.81579 1
vt 0.842105 1
vt 0.842105 0
vt 0.842105 1
vt 0.894737 0
vt 0.894737 0
vt 0.842105 1
vt 0.894737 1
vt 0.842105 0
vt 0.894737 0
vt 0.868421 0
vt 0.842105 1
vt 0.868421 1
vt 0.894737 1
vt 0.894737 0
vt 0.894737 1
vt 0.947369 0
vt 0.947369 0
vt 0.894737 1
vt 0.947369 1
vt 0.894737 0
vt 0.947369 0
vt 0.921053 0
vt 0.894737 1
vt 0.921053 1
vt 0.947369 1
vt 0.947369 0
vt 0.947369 1
vt 1 0
vt 1 0
vt 0.947369 1
vt 1 1
vt 0.947369 0
vt 1 0
vt 0.973684 0
vt 0.947369 1
vt 0.973684 1
vt 1 1
vn 0.82763 -0.559383 -0.0460348
vn 0.82763 0.559383 0.0460361
vn 0.797735 -0.559383 0.22519
vn 0.797735 -0.559383 0.22519
vn 0.82763 0.559383 0.0460361
vn 0.767839 0.559383 0.312272
vn 0.82763 -0.559383 -0.0460348
vn 0.797735 -0.559383 0.22519
vn 0 -1 0
vn 0.82763 0.559383 0.0460361
vn 0 1 0
vn 0.767839 0.559383 0.312272
vn 0.797735 -0.559383 0.22519
vn 0.767839 0.559383 0.312272
vn 0.681392 -0.559383 0.472012
vn 0.681392 -0.559383 0.472012
vn 0.767839 0.559383 0.312272
vn 0.624841 0.559383 0.54467
vn 0.797735 -0.559383 0.22519
vn 0.681392 -0.559383 0.472012
vn 0 -1 0
vn 0.767839 0.559383 0.312272
vn 0 1 0
vn 0.624841 0.559383 0.54467
vn 0.681392 -0.559383 0.472012
vn 0.624841 0.559383 0.54467
vn 0.49121 -0.559383 0.667685
vn 0.49121 -0.559383 0.667685
vn 0.624841 0.559383 0.54467
vn 0.414131 0.559383 0.718043
vn 0.681392 -0.559383 0.472012
vn 0.49121 -0.559383 0.667685
vn 0 -1 0
vn 0.624841 0.559383 0.54467
vn 0 1 0
vn 0.414131 0.559383 0.718043
vn 0.49121 -0.559383 0.667685
vn 0.414131 0.559383 0.718043
vn 0.247798 -0.559383 0.791004
vn 0.247798 -0.559383 0.791004
vn 0.414131 0.559383 0.718043
vn 0.158544 0.559383 0.813606
vn 0.49121 -0.559383 0.667685
vn 0.247798 -0.559383 0.791004
vn 0 -1 0
vn 0.414131 0.559383 0.718043
vn 0 1 0
vn 0.158544 0.559383 0.813606
vn 0.247798 -0.559383 0.791004
vn 0.158544 0.559383 0.813606
vn -0.0224668 -0.559383 0.828605
vn -0.0224668 -0.559383 0.828605
vn 0.158544 0.559383 0.813606
vn -0.114224 0.559383 0.821002
vn 0.247798 -0.559383 0.791004
vn -0.0224668 -0.559383 0.828605
vn 0 -1 0
vn 0.158544 0.559383 0.813606
vn 0 1 0
vn -0.114224 0.559383 0.821002
vn -0.0224668 -0.559383 0.828605
vn -0.114224 0.559383 0.821002
vn -0.290297 -0.559383 0.776414
vn -0.290297 -0.559383 0.776414
vn -0.114224 0.559383 0.821002
vn -0.374613 0.559383 0.739429
vn -0.0224668 -0.559383 0.828605
vn -0.290297 -0.559383 0.776414
vn 0 -1 0
vn -0.114224 0.559383 0.821002
vn 0 1 0
vn -0.374613 0.559383 0.739429
vn -0.290297 -0.559383 0.776414
vn -0.374613 0.559383 0.739429
vn -0.526669 -0.559383 0.640086
vn -0.526669 -0.559383 0.640086
vn -0.374613 0.559383 0.739429
vn -0.594408 0.559383 0.577728
vn -0.290297 -0.559383 0.776414
vn -0.526669 -0.559383 0.640086
vn 0 -1 0
vn -0.374613 0.559383 0.739429
vn 0 1 0
vn -0.594408 0.559383 0.577728
vn -0.526669 -0.559383 0.640086
vn -0.594408 0.559383 0.577728
vn -0.705968 -0.559383 0.434396
vn -0.705968 -0.559383 0.434396
vn -0.594408 0.559383 0.577728
vn -0.74979 0.559383 0.353421
vn -0.526669 -0.559383 0.640086
vn -0.705968 -0.559383 0.434396
vn 0 -1 0
vn -0.594408 0.559383 0.577728
vn 0 1 0
vn -0.74979 0.559383 0.353421
vn -0.705968 -0.559383 0.434396
vn -0.74979 0.559383 0.353421
vn -0.808765 -0.559383 0.181631
vn -0.808765 -0.559383 0.181631
vn -0.74979 0.559383 0.353421
vn -0.82392 0.559383 0.0908156
vn -0.705968 -0.559383 0.434396
vn -0.808765 -0.559383 0.181631
vn 0 -1 0
vn -0.74979 0.559383 0.353421
vn 0 1 0
vn -0.82392 0.559383 0.0908156
vn -0.808765 -0.559383 0.181631
vn -0.82392 0.559383 0.0908156
vn -0.82392 -0.559383 -0.0908156
vn -0.82392 -0.559383 -0.0908156
vn -0.82392 0.559383 0.0908156
vn -0.808765 0.559383 -0.181631
vn -0.808765 -0.559383 0.181631
vn -0.82392 -0.559383 -0.0908156
vn 0 -1 0
vn -0.82392 0.559383 0.0908156
vn 0 1 0
vn -0.808765 0.559383 -0.181631
vn -0.82392 -0.559383 -0.0908156
vn -0.808765 0.559383 -0.181631
vn -0.74979 -0.559383 -0.353421
vn -0.74979 -0.559383 -0.353421
vn -0.808765 0.559383 -0.181631
vn -0.705968 0.559383 -0.434396
vn -0.82392 -0.559383 -0.0908156
vn -0.74979 -0.559383 -0.353421
vn 0 -1 0
vn -0.808765 0.559383 -0.181631
vn 0 1 0
vn -0.705968 0.559383 -0.434396
vn -0.74979 -0.559383 -0.353421
vn -0.705968 0.559383 -0.434396
vn -0.594408 -0.559383 -0.577728
vn -0.594408 -0.559383 -0.577728
vn -0.705968 0.559383 -0.434396
vn -0.526669 0.559383 -0.640086
vn -0.74979 -0.559383 -0.353421
vn -0.594408 -0.559383 -0.577728
vn 0 -1 0
vn -0.705968 0.559383 -0.434396
vn 0 1 0
vn -0.526669 0.559383 -0.640086
vn -0.594408 -0.559383 -0.577728
vn -0.526669 0.559383 -0.640086
vn -0.374613 -0.559383 -0.739429
vn -0.374613 -0.559383 -0.739429
vn -0.526669 0.559383 -0.640086
vn -0.290297 0.559383 -0.776414
vn -0.594408 -0.559383 -0.577728
vn -0.374613 -0.559383 -0.739429
vn 0 -1 0
vn -0.526669 0.559383 -0.640086
vn 0 1 0
vn -0.290297 0.559383 -0.776414
vn -0.374613 -0.559383 -0.739429
vn -0.290297 0.559383 -0.776414
vn -0.114223 -0.559383 -0.821002
vn -0.114223 -0.559383 -0.821002
vn -0.290297 0.559383 -0.776414
vn -0.0224663 0.559383 -0.828605
vn -0.374613 -0.559383 -0.739429
vn -0.114223 -0.559383 -0.821002
vn 0 -1 0
vn -0.290297 0.559383 -0.776414
vn 0 1 0
vn -0.0224663 0.559383 -0.828605
vn -0.114223 -0.559383 -0.821002
vn -0.0224663 0.559383 -0.828605
vn 0.158545 -0.559383 -0.813606
vn 0.158545 -0.559383 -0.813606
vn -0.0224663 0.559383 -0.828605
vn 0.247799 0.559383 -0.791004
vn -0.114223 -0.559383 -0.821002
vn 0.158545 -0.559383 -0.813606
vn 0 -1 0
vn -0.0224663 0.559383 -0.828605
vn 0 1 0
vn 0.247799 0.559383 -0.791004
vn 0.158545 -0.559383 -0.813606
vn 0.247799 0.559383 -0.791004
vn 0.414132 -0.559383 -0.718043
vn 0.414132 -0.559383 -0.718043
vn 0.247799 0.559383 -0.791004
vn 0.491211 0.559383 -0.667685
vn 0.158545 -0.559383 -0.813606
vn 0.414132 -0.559383 -0.718043
vn 0 -1 0
vn 0.247799 0.559383 -0.791004
vn 0 1 0
vn 0.491211 0.559383 -0.667685
vn 0.414132 -0.559383 -0.718043
vn 0.491211 0.559383 -0.667685
vn 0.624841 -0.559383 -0.544669
vn 0.624841 -0.559383 -0.544669
vn 0.491211 0.559383 -0.667685
vn 0.681393 0.559383 -0.472012
vn 0.414132 -0.559383 -0.718043
vn 0.624841 -0.559383 -0.544669
vn 0 -1 0
vn 0.491211 0.559383 -0.667685
vn 0 1 0
vn 0.681393 0.559383 -0.472012
vn 0.624841 -0.559383 -0.544669
vn 0.681393 0.559383 -0.472012
vn 0.767839 -0.559383 -0.312271
vn 0.767839 -0.559383 -0.312271
vn 0.681393 0.559383 -0.472012
vn 0.797735 0.559383 -0.225189
vn 0.624841 -0.559383 -0.544669
vn 0.767839 -0.559383 -0.312271
vn 0 -1 0
vn 0.681393 0.559383 -0.472012
vn 0 1 0
vn 0.797735 0.559383 -0.225189
vn 0.767839 -0.559383 -0.312271
vn 0.797735 0.559383 -0.225189
vn 0.82763 -0.559383 -0.0460348
vn 0.82763 -0.559383 -0.0460348
vn 0.797735 0.559383 -0.225189
vn 0.82763 0.559383 0.0460361
vn 0.767839 -0.559383 -0.312271
vn 0.82763 -0.559383 -0.0460348
vn 0 -1 0
vn 0.797735 0.559383 -0.225189
vn 0 1 0
vn 0.82763 0.559383 0.0460361
f 1/1/1 2/2/2 3/3/3
f 4/4/4 5/5/5 6/6/6
f 7/7/7 8/8/8 9/9/9
f 10/10/10 11/11/11 12/12/12
f 13/13/13 14/14/14 15/15/15
f 16/16/16 17/17/17 18/18/18
f 19/19/19 20/20/20 21/21/21
f 22/22/22 23/23/23 24/24/24
f 25/25/25 26/26/26 27/27/27
f 28/28/28 29/29/29 30/30/30
f 31/31/31 32/32/32 33/33/33
f 34/34/34 35/35/35 36/36/36
f 37/37/37 38/38/38 39/39/39
f 40/40/40 41/41/41 42/42/42
f 43/43/43 44/44/44 45/45/45
f 46/46/46 47/47/47 48/48/48
f 49/49/49 50/50/50 51/51/51
f 52/52/52 53/53/53 54/54/54
f 55/55/55 56/56/56 57/57/57
f 58/58/58 59/59/59 60/60/60
f 61/61/61 62/62/62 63/63/63
f 64/64/64 65/65/65 66/66/66
f 67/67/67 68/68/68 69/69/69
f 70/70/70 71/71/71 72/72/72
f 73/73/73 74/74/74 75/75/75
f 76/76/76 77/77/77 78/78/78
f 79/79/79 80/80/80 81/81/81
f 82/82/82 83/83/83 84/84/84
f 85/85/85 86/86/86 87/87/87
f 88/88/88 89/89/89 90/90/90
f 91/91/91 92/92/92 93/93/93
f 94/94/94 95/95/95 96/96/96
f 97/97/97 98/98/98 99/99/99
f 100/100/100 101/101/101 102/102/102
f 103/103/103 104/104/104 105/105/105
f 106/106/106 107/107/107 108/108/108
f 109/109/109 110/110/110 111/111/111
f 112/112/112 113/113/113 114/114/114
f 115/115/115 116/116/116 117/117/117
f 118/118/118 119/119/119 120/120/120
f 121/121/121 122/122/122 123/123/123
f 124/124/124 125/125/125 126/126/126
f 127/127/127 128/128/128 129/129/129
f 130/130/130 131/131/131 132/132/132
f 133/133/133 134/134/134 135/135/135
f 136/136/136 137/137/137 138/138/138
f 139/139/139 140/140/140 141/141/141
f 142/142/142 143/143/143 144/144/144
f 145/145/145 146/146/146 147/147/147
f 148/148/148 149/149/149 150/150/150
f 151/151/151 152/152/152 153/153/153
f 154/154/154 155/155/155 156/156/156
f 157/157/157 158/158/158 159/159/159
f 160/160/160 161/161/161 162/162/162
f 163/163/163 164/164/164 165/165/165
f 166/166/166 167/167/167 168/168/168
f 169/169/169 170/170/170 171/171/171
f 172/172/172 173/173/173 174/174/174
f 175/175/175 176/176/176 177/177/177
f 178/178/178 179/179/179 180/180/180
f 181/181/181 182/182/182 183/183/183
f 184/184/184 185/185/185 186/186/186
f 187/187/187 188/188/188 189/189/189
f 190/190/190 191/191/191 192/192/192
f 193/193/193 194/194/194 195/195/195
f 196/196/196 197/197/197 198/198/198
f 199/199/199 200/200/200 201/201/201
f 202/202/202 203/203/203 204/204/204
f 205/205/205 206/206/206 207/207/207
f 208/208/208 209/209/209 210/210/210
f 211/211/211 212/212/212 213/213/213
f 214/214/214 215/215/215 216/216/216
f 217/217/217 218/218/218 219/219/219
f 220/220/220 221/221/221 222/222/222
f 223/223/223 224/224/224 225/225/225
f 226/226/226 227/227/227 228/228/228
