{
    "products":[
        {   
            "id":"123",
            "name":"TISSOT PRX T137.410.16.041.00",
            "price":14660,
            "url":"https://vector-d.ua/media/catalog/product/cache/4/image/4c149967a5ceee0d1ff942d9fef9d042/t/1/t137.410.16.041.00_1.jpg",
            "color":"Blue/Silver",
            "favorite":false,
            "cart":false,
            "countInCart":0
        },
        {   
            "id":"234",
            "name":"TISSOT PRX POWERMATIC 80 T137.407.16.051.00",
            "price":28340,
            "url":"https://vector-d.ua/media/catalog/product/cache/4/image/4c149967a5ceee0d1ff942d9fef9d042/t/1/t137.407.16.051.00_1.jpg",
            "color":"Black/Silver",
            "favorite":false,
            "cart":false,
            "countInCart":0
        },{   
            "id":"345",
            "name":"TISSOT PRX T137.210.11.041.00",
            "price":16650,
            "url":"https://vector-d.ua/media/catalog/product/cache/4/image/4c149967a5ceee0d1ff942d9fef9d042/t/1/t137.210.11.041.00_1.jpg",
            "color":"Silver/Blue",
            "favorite":false,
            "cart":false,
            "countInCart":0
        },{   
            "id":"456",
            "name":"CASIO MQ-24UC-3B",
            "price":1150,
            "url":"https://content2.rozetka.com.ua/goods/images/big/318379109.jpg",
            "color":"Green/Black",
            "favorite":false,
            "cart":false,
            "countInCart":0
        },{   
            "id":"567",
            "name":"CASIO MTP-V300L-7AUDF",
            "price":2870,
            "url":"https://fs1.deka.ua/photo/goods/card/1/205611/205611_20211015_1500_1500_MTP_V300L_7AUDF.jpg",
            "color":"Silver/Brown",
            "favorite":false,
            "cart":false,
            "countInCart":0
        },{   
            "id":"678",
            "name":"CASIO MTP-E139D-2BVDF",
            "price":2890,
            "url":"https://cas-official.com.ua/images/detailed/6/MTP-E139D-2BVDF.jpg",
            "color":"Silver/Blue",
            "favorite":false,
            "cart":false,
            "countInCart":0
        },{   
            "id":"789",
            "name":"CASIO MTP-V001GL-9BUDF",
            "price":1280,
            "url":"https://montre.com.ua/uploads/shop/products/main/mtp-v001gl-9budf.jpg",
            "color":"Brown/Gold",
            "favorite":false,
            "cart":false,
            "countInCart":0
        },{   
            "id":"891",
            "name":"CASIO F-91WM-2AEF",
            "price":1420,
            "url":"https://fs4.deka.ua/photo/goods/card/1/208694/208694_20180925_632_1110_F_91WM_2A.jpg",
            "color":"Black/Blue",
            "favorite":false,
            "cart":false,
            "countInCart":0
        },{   
            "id":"912",
            "name":"CASIO GA-900AG-1AER",
            "price":8690,
            "url":"https://fs5.deka.ua/photo/goods/card/1/209835/209835_20210913_1948_2205_GA_900AG_1AER_OR01_web.jpg",
            "color":"Black/Gold",
            "favorite":false,
            "cart":false,
            "countInCart":0
        },{   
            "id":"461",
            "name":"CASIO MTP-V002G-7BUDF",
            "price":1912,
            "url":"https://content1.rozetka.com.ua/goods/images/original/18921364.jpg",
            "color":"White/Gold",
            "favorite":false,
            "cart":false,
            "countInCart":0
        },
        {   
            "id":"431",
            "name":"DANIEL WELLINGTON PETITE MELROSE DW00100219",
            "price":3976,
            "url":"https://fs0.deka.ua/photo/goods/card/380/375280/375280_20171117_1200_1200_DW00100219.png",
            "color":"White/Gold",
            "favorite":false,
            "cart":false,
            "countInCart":0
        }
    ]
}