<svg width="73" height="69" viewBox="0 0 73 69" fill="none" xmlns="http://www.w3.org/2000/svg">
<path d="M25.6738 15.716H32.8185V48.4227C32.8185 48.8481 33.1665 49.1962 33.5919 49.1962H39.3927C39.8181 49.1962 40.1661 48.8481 40.1661 48.4227V15.716H47.3301C47.9778 15.716 48.3355 14.9716 47.9392 14.4688L37.111 0.759648C37.0387 0.667205 36.9462 0.592443 36.8407 0.541027C36.7352 0.489611 36.6193 0.462891 36.502 0.462891C36.3846 0.462891 36.2687 0.489611 36.1632 0.541027C36.0577 0.592443 35.9652 0.667205 35.8929 0.759648L25.0647 14.4592C24.6684 14.9716 25.0261 15.716 25.6738 15.716ZM71.8867 45.5223H66.0859C65.6605 45.5223 65.3125 45.8704 65.3125 46.2958V61.1844H7.69141V46.2958C7.69141 45.8704 7.34336 45.5223 6.91797 45.5223H1.11719C0.691797 45.5223 0.34375 45.8704 0.34375 46.2958V65.4384C0.34375 67.1496 1.72627 68.5321 3.4375 68.5321H69.5664C71.2776 68.5321 72.6602 67.1496 72.6602 65.4384V46.2958C72.6602 45.8704 72.3121 45.5223 71.8867 45.5223Z" fill="url(#paint0_linear)"/>
<defs>
<linearGradient id="paint0_linear" x1="72.6602" y1="34.1466" x2="0.343751" y2="34.1466" gradientUnits="userSpaceOnUse">
<stop stop-color="#FE8D2A"/>
<stop offset="1" stop-color="#FF0025"/>
</linearGradient>
</defs>
</svg>
