{
    "responseHeader": {
        "status": 0,
        "QTime": 1,
        "params": {
            "q": "*",
            "facet.field": [
                "author_names",
                "category_names",
                "item_languages"
            ],
            "indent": "on",
            "start": "0",
            "fq": "catalog_ids:1",
            "rows": "20",
            "facet": "on",
            "wt": "json"
        }
    },
    "response": {
        "numFound": 653,
        "start": 0,
        "docs": [
            {
                "item_id": 49153
            },
            {
                "item_id": 34224
            },
            {
                "item_id": 50103
            },
            {
                "item_id": 50879
            },
            {
                "item_id": 52091
            },
            {
                "item_id": 98318
            },
            {
                "item_id": 95403
            },
            {
                "item_id": 95410
            },
            {
                "item_id": 95418
            },
            {
                "item_id": 43050
            },
            {
                "item_id": 96296
            },
            {
                "item_id": 23113
            },
            {
                "item_id": 15121
            },
            {
                "item_id": 96299
            },
            {
                "item_id": 96307
            },
            {
                "item_id": 24843
            },
            {
                "item_id": 96313
            },
            {
                "item_id": 25925
            },
            {
                "item_id": 96306
            },
            {
                "item_id": 82738
            }
        ]
    },
    "facet_counts": {
        "facet_queries": {},
        "facet_fields": {
            "author_names": [
                "Togi",
                9,
                "Ramdani",
                8
            ],
            "category_names": [
                "School",
                103,
                "Politics & Current Affairs",
                47
            ],
            "item_languages": [
                "ind",
                646,
                "eng",
                7
            ]
        },
        "facet_ranges": {},
        "facet_intervals": {},
        "facet_heatmaps": {}
    },
    "spellcheck": {
        "suggestions": [
            "jakarte",
            {
                "numFound": 2,
                "startOffset": 0,
                "endOffset": 7,
                "origFreq": 1,
                "suggestion": [
                    {
                        "word": "jakarta",
                        "freq": 1660
                    },
                    {
                        "word": "jakarta!",
                        "freq": 1
                    }
                ]
            }
        ],
        "correctlySpelled": false
    }
}
