{
    "$schema": "http://jsonschema.org/schema#",
    "id": "https://schemas.apps-foundry.com/cor/items/v2/item.recommendation.json",
    "type": "object",
    "properties": {
        "restricted_countries": {
            "type": "array",
            "items": {
                "type": "number"
            }
        },
        "allowed_countries": {
            "type": "array",
            "items": {
                "type": "number"
            }
        },
        "web_reader_files_ready": {
            "type": "boolean"
        },
        "item_image_highres": {
            "type": "string"
        },
        "item_type_id": {
            "type": "number",
            "minValue": 1,
            "maxValue": 3
        },
        "brand": {
            "$ref": "#/definitions/relationObject"
        },
        "is_active": {
            "type": "boolean"
        },
        "item_status": {
            "type": "number",
            "minValue": 1,
            "maxValue": 9
        },
        "slug": {
            "type": "string"
        },
        "media_base_url": {
            "type": "string",
            "format": "uri"
        },
        "thumb_image_normal": {
            "type": "string"
        },
        "thumb_image_highres": {
            "type": "string"
        },
        "issue_number": {
            "type": "string"
        },
        "content_type": {
            "type": "number"
        },
        "authors": {
            "type": "array",
            "items": {
                "$ref": "#/definitions/relationObject"
            }
        },
        "id": {
            "type": "number"
        },
        "edition_code": {
            "type": "string"
        },
        "name": {
            "type": "string"
        },
        "display_offers": {
            "type": "array",
            "items": {
                "anyOf": [
                    {
                        "$ref": "#/definitions/displayOffer"
                    },
                    {
                        "$ref": "#/definitions/discountOffer"
                    }
                ]
            }
        }
    },
    "required": [
        "restricted_countries",
        "allowed_countries",
        "web_reader_files_ready",
        "item_type_id",
        "brand",
        "is_active",
        "item_status",
        "slug",
        "media_base_url",
        "thumb_image_normal",
        "issue_number",
        "content_type",
        "authors",
        "display_offers",
        "id",
        "edition_code",
        "name"
    ],
    "additionalProperties": false,
    "definitions": {
        "relationObject": {
            "type": "object",
            "properties": {
                "slug": {
                    "type": "string"
                },
                "id": {
                    "type": "number"
                },
                "name": {
                    "type": "string"
                }
            },
            "required": [
                "slug",
                "id",
                "name"
            ],
            "additionalProperties": false
        },
        "displayOffer": {
            "type": "object",
            "properties": {
                "media_base_url": {
                    "type": "string",
                    "format": "uri"
                },
                "price_usd": {
                    "type": "string"
                },
                "image_highres": {
                    "type": [
                        "string",
                        "null"
                    ]
                },
                "offer_id": {
                    "type": "number"
                },
                "is_free": {
                    "type": "boolean"
                },
                "platform_id": {
                    "type": "array",
                    "items": {
                        "type": "number"
                    }
                },
                "price_point": {
                    "type": "number"
                },
                "price_idr": {
                    "type": "string"
                },
                "offer_type_id": {
                    "type": "number"
                },
                "offer_name": {
                    "type": "string"
                },
                "image_normal": {
                    "type": [
                        "string",
                        "null"
                    ]
                }
            },
            "required": [
                "media_base_url",
                "price_usd",
                "image_highres",
                "offer_id",
                "is_free",
                "platform_id",
                "price_idr",
                "price_point",
                "offer_name",
                "offer_type_id",
                "image_normal"
            ],
            "additionalProperties": false
        },
        "discountOffer": {
            "type": "object",
            "properties": {
                "discount_tag": {
                    "type": "string"
                },
                "media_base_url": {
                    "type": "string",
                    "format": "uri"
                },
                "price_usd": {
                    "type": "string"
                },
                "discount_name": {
                    "type": "string"
                },
                "image_highres": {
                    "type": [
                        "string",
                        "null"
                    ]
                },
                "discount_id": {
                    "type": "array",
                    "items": {
                        "type": "number"
                    }
                },
                "offer_id": {
                    "type": "number"
                },
                "discount_price_point": {
                    "type": "number"
                },
                "offer_name": {
                    "type": "string"
                },
                "image_normal": {
                    "type": [
                        "string",
                        "null"
                    ]
                },
                "discount_paymentgateway_id": {
                    "type": "array",
                    "items": {
                        "type": "number"
                    }
                },
                "price_idr": {
                    "type": "string"
                },
                "is_free": {
                    "type": "boolean"
                },
                "offer_type_id": {
                    "type": "number"
                },
                "discount_price_idr": {
                    "type": "string"
                },
                "platform_id": {
                    "type": "array",
                    "items": {
                        "type": "number"
                    }
                },
                "price_point": {
                    "type": "number"
                },
                "discount_price_usd": {
                    "type": "string"
                }
            },
            "required": [
                "discount_tag",
                "media_base_url",
                "price_usd",
                "discount_name",
                "image_highres",
                "discount_id",
                "offer_id",
                "discount_price_point",
                "offer_name",
                "image_normal",
                "discount_paymentgateway_id",
                "price_idr",
                "is_free",
                "offer_type_id",
                "discount_price_idr",
                "platform_id",
                "price_point",
                "discount_price_usd"
            ],
            "additionalProperties": false
        }
    }
}
