{
    "$schema": "http://json-schema.org/schema#",

    "id": "http://docs.apps-foundry.com/scoopcor/web-api-v1/remote_publishing/remote-category-list.json",
    "title": "Remote Category List",
    "description": "A list of remote categories.",

    "type": "object",
    "properties": {
        "remote_categories": {
            "type": "array",
            "items": {"$ref": "http://docs.apps-foundry.com/scoopcor/web-api-v1/remote_publishing/remote-category.json"}
        },
        "metadata": {
            "type": "object",
            "additionalProperties": false,
            "required": ["result_set"],
            "properties": {
                "result_set": {
                    "type": "object",
                    "properties": {
                        "count": {"type": "integer"},
                        "limit": {"type": "integer"},
                        "offset": {"type": "integer"}
                    },
                    "additionalProperties": false,
                    "required": ["count", "limit", "offset"]
                }
            }
        }
    },
    "additionalProperties": false,
    "required": ["remote_categories", "metadata"]
}
