{
  "Version": "2012-10-17",
  "Statement": [
    {
      "Sid": "GitLabRunnerEc2Policy",
      "Effect": "Allow",
      "Action": "ec2:*",
      "Resource": "*"
    },
    {
      "Sid": "GitLabRunnerEc2AutoscalingPolicy",
      "Effect": "Allow",
      "Action": [
        "autoscaling:CreateAutoScalingGroup",
        "autoscaling:CreateLaunchConfiguration",
        "autoscaling:DeleteAutoScalingGroup",
        "autoscaling:DeleteLaunchConfiguration",
        "autoscaling:UpdateAutoScalingGroup"
      ],
      "Resource": [
        "arn:aws:autoscaling:*:*:autoScalingGroup:*:autoScalingGroupName/*-as-group",
        "arn:aws:autoscaling:*:*:launchConfiguration:*:launchConfigurationName/terraform-*",
        "arn:aws:autoscaling:*:*:launchConfiguration:*:*:terraform-*:launchConfigurationName/terraform-*"
      ]
    }
  ,
    {
      "Sid": "GitLabRunnerEc2AutoscalingRequireAllPolicy",
      "Effect": "Allow",
      "Action": [
        "autoscaling:DescribeAutoScalingGroups",
        "autoscaling:DescribeLaunchConfigurations"
      ],
      "Resource": [
        "*"
      ]
    }
  ]
}
