<?xml version="1.0" encoding="utf-8"?>
<!-- Generator: Adobe Illustrator 18.1.1, SVG Export Plug-In . SVG Version: 6.00 Build 0)  -->
<svg version="1.1" id="Layer_1" xmlns="http://www.w3.org/2000/svg" xmlns:xlink="http://www.w3.org/1999/xlink" x="0px" y="0px"
	 viewBox="0 0 160 198" enable-background="new 0 0 160 198" xml:space="preserve">
<g>
	<linearGradient id="SVGID_1_" gradientUnits="userSpaceOnUse" x1="0" y1="90" x2="135" y2="90">
		<stop  offset="0" style="stop-color:#0F264E"/>
		<stop  offset="1" style="stop-color:#1A6583"/>
	</linearGradient>
	<path fill="url(#SVGID_1_)" d="M135,180H0V0h135V180z M5,175h125V5H5V175z"/>
</g>
<linearGradient id="SVGID_2_" gradientUnits="userSpaceOnUse" x1="27" y1="115" x2="160" y2="115">
	<stop  offset="0" style="stop-color:#0F264E"/>
	<stop  offset="1" style="stop-color:#1A6583"/>
</linearGradient>
<polygon fill="url(#SVGID_2_)" points="160,32 160,198 27,198 27,178 133,178 133,32 "/>
<g>
	<g>
		<linearGradient id="SVGID_3_" gradientUnits="userSpaceOnUse" x1="18" y1="23.5" x2="120" y2="23.5">
			<stop  offset="0" style="stop-color:#0F264E"/>
			<stop  offset="1" style="stop-color:#1A6583"/>
		</linearGradient>
		<rect x="18" y="21" fill="url(#SVGID_3_)" width="102" height="5"/>
	</g>
	<g>
		<linearGradient id="SVGID_4_" gradientUnits="userSpaceOnUse" x1="18" y1="34.5" x2="52" y2="34.5">
			<stop  offset="0" style="stop-color:#0F264E"/>
			<stop  offset="1" style="stop-color:#1A6583"/>
		</linearGradient>
		<rect x="18" y="32" fill="url(#SVGID_4_)" width="34" height="5"/>
	</g>
	<g>
		<linearGradient id="SVGID_5_" gradientUnits="userSpaceOnUse" x1="16" y1="110.5" x2="81" y2="110.5">
			<stop  offset="0" style="stop-color:#0F264E"/>
			<stop  offset="1" style="stop-color:#1A6583"/>
		</linearGradient>
		<rect x="16" y="108" fill="url(#SVGID_5_)" width="65" height="5"/>
	</g>
	<g>
		<linearGradient id="SVGID_6_" gradientUnits="userSpaceOnUse" x1="16" y1="119.5" x2="81" y2="119.5">
			<stop  offset="0" style="stop-color:#0F264E"/>
			<stop  offset="1" style="stop-color:#1A6583"/>
		</linearGradient>
		<rect x="16" y="117" fill="url(#SVGID_6_)" width="65" height="5"/>
	</g>
	<g>
		<linearGradient id="SVGID_7_" gradientUnits="userSpaceOnUse" x1="16" y1="129.5" x2="81" y2="129.5">
			<stop  offset="0" style="stop-color:#0F264E"/>
			<stop  offset="1" style="stop-color:#1A6583"/>
		</linearGradient>
		<rect x="16" y="127" fill="url(#SVGID_7_)" width="65" height="5"/>
	</g>
	<g>
		<linearGradient id="SVGID_8_" gradientUnits="userSpaceOnUse" x1="16" y1="152.5" x2="125" y2="152.5">
			<stop  offset="0" style="stop-color:#0F264E"/>
			<stop  offset="1" style="stop-color:#1A6583"/>
		</linearGradient>
		<rect x="16" y="150" fill="url(#SVGID_8_)" width="109" height="5"/>
	</g>
	<g>
		<linearGradient id="SVGID_9_" gradientUnits="userSpaceOnUse" x1="16" y1="162.5" x2="81" y2="162.5">
			<stop  offset="0" style="stop-color:#0F264E"/>
			<stop  offset="1" style="stop-color:#1A6583"/>
		</linearGradient>
		<rect x="16" y="160" fill="url(#SVGID_9_)" width="65" height="5"/>
	</g>
</g>
<g>
	<rect x="89.5" y="58" fill="#E81929" width="15.7" height="74.8"/>
	<rect x="108.9" y="95.5" fill="#E81929" width="15.7" height="37.4"/>
</g>
<g>
	<path fill="#E81929" d="M69.1,81.4c-3.3,12.3-15.9,19.7-28.2,16.5C28.5,94.6,21.2,82,24.5,69.7c3.2-12.2,15.4-19.7,28-16.5
		l-5.9,22.3l20-12C69.7,68.7,70.8,75.1,69.1,81.4z"/>
	<path fill="#E81929" d="M70.3,58.8L50,70.5l5.8-22l0.9,0.2C62.7,50.3,67.3,53.9,70.3,58.8z"/>
</g>
</svg>
