<?xml version="1.0" encoding="utf-8"?>
<!-- Generator: Adobe Illustrator 18.1.1, SVG Export Plug-In . SVG Version: 6.00 Build 0)  -->
<svg version="1.1" id="Layer_1" xmlns="http://www.w3.org/2000/svg" xmlns:xlink="http://www.w3.org/1999/xlink" x="0px" y="0px"
	 viewBox="0 0 285.1 200.9" enable-background="new 0 0 285.1 200.9" xml:space="preserve">
<g display="none">
	<g display="inline">
		<linearGradient id="SVGID_1_" gradientUnits="userSpaceOnUse" x1="53.6297" y1="89.6585" x2="188.6297" y2="89.6585">
			<stop  offset="0" style="stop-color:#0F264E"/>
			<stop  offset="1" style="stop-color:#1A6583"/>
		</linearGradient>
		<path fill="url(#SVGID_1_)" d="M188.6,179.7h-135v-180h135V179.7z M58.6,174.7h125V4.7h-125V174.7z"/>
	</g>
	<linearGradient id="SVGID_2_" gradientUnits="userSpaceOnUse" x1="80.6297" y1="114.6585" x2="213.6297" y2="114.6585">
		<stop  offset="0" style="stop-color:#0F264E"/>
		<stop  offset="1" style="stop-color:#1A6583"/>
	</linearGradient>
	<polygon display="inline" fill="url(#SVGID_2_)" points="213.6,31.7 213.6,197.7 80.6,197.7 80.6,177.7 186.6,177.7 186.6,31.7 	
		"/>
	<g display="inline">
		<g>
			<linearGradient id="SVGID_3_" gradientUnits="userSpaceOnUse" x1="71.6297" y1="23.1585" x2="173.6297" y2="23.1585">
				<stop  offset="0" style="stop-color:#0F264E"/>
				<stop  offset="1" style="stop-color:#1A6583"/>
			</linearGradient>
			<rect x="71.6" y="20.7" fill="url(#SVGID_3_)" width="102" height="5"/>
		</g>
		<g>
			<linearGradient id="SVGID_4_" gradientUnits="userSpaceOnUse" x1="71.6297" y1="34.1585" x2="105.6297" y2="34.1585">
				<stop  offset="0" style="stop-color:#0F264E"/>
				<stop  offset="1" style="stop-color:#1A6583"/>
			</linearGradient>
			<rect x="71.6" y="31.7" fill="url(#SVGID_4_)" width="34" height="5"/>
		</g>
		<g>
			<linearGradient id="SVGID_5_" gradientUnits="userSpaceOnUse" x1="69.6297" y1="110.1585" x2="134.6297" y2="110.1585">
				<stop  offset="0" style="stop-color:#0F264E"/>
				<stop  offset="1" style="stop-color:#1A6583"/>
			</linearGradient>
			<rect x="69.6" y="107.7" fill="url(#SVGID_5_)" width="65" height="5"/>
		</g>
		<g>
			<linearGradient id="SVGID_6_" gradientUnits="userSpaceOnUse" x1="69.6297" y1="119.1585" x2="134.6297" y2="119.1585">
				<stop  offset="0" style="stop-color:#0F264E"/>
				<stop  offset="1" style="stop-color:#1A6583"/>
			</linearGradient>
			<rect x="69.6" y="116.7" fill="url(#SVGID_6_)" width="65" height="5"/>
		</g>
		<g>
			<linearGradient id="SVGID_7_" gradientUnits="userSpaceOnUse" x1="69.6297" y1="129.1584" x2="134.6297" y2="129.1584">
				<stop  offset="0" style="stop-color:#0F264E"/>
				<stop  offset="1" style="stop-color:#1A6583"/>
			</linearGradient>
			<rect x="69.6" y="126.7" fill="url(#SVGID_7_)" width="65" height="5"/>
		</g>
		<g>
			<linearGradient id="SVGID_8_" gradientUnits="userSpaceOnUse" x1="69.6297" y1="152.1584" x2="178.6297" y2="152.1584">
				<stop  offset="0" style="stop-color:#0F264E"/>
				<stop  offset="1" style="stop-color:#1A6583"/>
			</linearGradient>
			<rect x="69.6" y="149.7" fill="url(#SVGID_8_)" width="109" height="5"/>
		</g>
		<g>
			<linearGradient id="SVGID_9_" gradientUnits="userSpaceOnUse" x1="69.6297" y1="162.1584" x2="134.6297" y2="162.1584">
				<stop  offset="0" style="stop-color:#0F264E"/>
				<stop  offset="1" style="stop-color:#1A6583"/>
			</linearGradient>
			<rect x="69.6" y="159.7" fill="url(#SVGID_9_)" width="65" height="5"/>
		</g>
	</g>
	<g display="inline">
		<rect x="143.1" y="57.7" fill="#E81929" width="15.7" height="74.8"/>
		<rect x="162.5" y="95.1" fill="#E81929" width="15.7" height="37.4"/>
	</g>
	<g display="inline">
		<path fill="#E81929" d="M122.7,81.1c-3.3,12.3-15.9,19.7-28.2,16.5S74.9,81.7,78.1,69.3c3.2-12.2,15.4-19.7,28-16.5l-5.9,22.3
			l20-12C123.3,68.4,124.4,74.8,122.7,81.1z"/>
		<path fill="#E81929" d="M123.9,58.5l-20.3,11.7l5.8-22l0.9,0.2C116.3,50,120.9,53.5,123.9,58.5z"/>
	</g>
</g>
<g display="none">
	<g display="inline">
		<g>
			<path fill="#FFFFFF" d="M236.1,89.7L112.7,212.2l-5.1-5.1c0.1-0.1,0.3-0.3,0.4-0.4c3.7-3.7,3.7-9.7,0.1-13.4s-9.7-3.7-13.4-0.1
				c-0.1,0.1-0.3,0.3-0.4,0.4l-9.4-9.5c0.1-0.1,0.3-0.3,0.4-0.4c3.7-3.7,3.7-9.7,0.1-13.4c-3.7-3.7-9.7-3.7-13.4-0.1
				c-0.1,0.1-0.3,0.3-0.4,0.4l-9.2-9.3c0.4-0.4,0.2-0.2,0.3-0.3c0.1-0.1,0.2-0.2,0.3-0.3c0,0,0.1-0.1,0.1-0.1
				c0.1-0.1,0.2-0.2,0.2-0.3c0.1-0.1,0.1-0.2,0.2-0.3c0.1-0.1,0.1-0.1,0.2-0.2c0.1-0.1,0.1-0.2,0.2-0.3c0.1-0.1,0.2-0.2,0.2-0.4
				c0,0,0,0,0-0.1c0.1-0.1,0.1-0.2,0.2-0.4c0.2-0.3,0.3-0.6,0.4-0.9c1.4-3.4,0.8-7.5-2-10.3c-2-2-4.6-2.9-7.2-2.7
				c-0.8,0-1.5,0.2-2.2,0.4c-1.2,0.4-2.3,0.9-3.3,1.7c-0.2,0.2-0.5,0.4-0.7,0.6c-0.1,0.1,0.1-0.1-0.3,0.3L44,143L167.4,20.5l5.1,5.1
				c-3.7,3.7-3.7,9.7-0.1,13.4c3.7,3.7,9.7,3.7,13.4,0.1l10,10.1c-3.7,3.7-3.7,9.7-0.1,13.4c3.7,3.7,9.7,3.7,13.4,0.1l8.6,8.7
				c-3.7,3.7-3.7,9.7-0.1,13.4c3.7,3.7,9.7,3.7,13.4,0.1L236.1,89.7z"/>
			
				<linearGradient id="SVGID_10_" gradientUnits="userSpaceOnUse" x1="86.699" y1="152.7442" x2="188.2723" y2="152.7442" gradientTransform="matrix(0.7044 0.7098 -0.7098 0.7044 151.6038 -88.8364)">
				<stop  offset="0" style="stop-color:#0F264E"/>
				<stop  offset="1" style="stop-color:#1A6583"/>
			</linearGradient>
			<path fill="url(#SVGID_10_)" d="M112.7,215.1l-8-8l1.6-1.4c0.1-0.1,0.2-0.2,0.3-0.3c2.9-2.9,2.9-7.6,0-10.5
				c-1.4-1.4-3.3-2.2-5.3-2.2c-2,0-3.8,0.8-5.3,2.2c-0.1,0.1-0.2,0.2-0.3,0.3l-1.4,1.6L82,184.1l1.6-1.4c0.1-0.1,0.2-0.2,0.3-0.3
				c2.9-2.9,2.9-7.6,0-10.5c-1.4-1.4-3.3-2.2-5.3-2.2c-2,0-3.8,0.8-5.3,2.2c-0.1,0.1-0.2,0.2-0.3,0.3l-1.4,1.6l-12.1-12.2l1.5-1.4
				c0.1-0.1,0.2-0.2,0.3-0.3l0,0c0.1-0.1,0.2-0.2,0.2-0.3l0.1-0.1c0,0,0.1-0.1,0.1-0.1l0-0.1c0.1-0.1,0.1-0.1,0.1-0.2l0-0.1
				c0,0,0.1-0.1,0.1-0.1l0-0.1c0,0,0-0.1,0.1-0.1l0.1-0.1c0.1-0.1,0.1-0.1,0.1-0.2c0.1-0.1,0.1-0.2,0.2-0.3l0-0.1
				c0.1-0.2,0.2-0.4,0.3-0.6c1.2-2.8,0.6-6-1.5-8.2c-1.5-1.5-3.5-2.3-5.7-2.2c-0.6,0-1.2,0.1-1.8,0.3c-1,0.3-1.8,0.8-2.6,1.4
				c-0.2,0.2-0.4,0.3-0.6,0.5l0,0c-0.1,0.1-0.2,0.2-0.3,0.3l-1.4,1.4l-7.9-8L167.4,17.6l7.9,7.9l-1.4,1.4c-2.9,2.9-2.9,7.6,0,10.6
				c1.4,1.4,3.3,2.2,5.3,2.2c2,0,3.8-0.8,5.3-2.2l1.4-1.4l12.8,12.9l-1.4,1.4c-1.4,1.4-2.2,3.3-2.2,5.3c0,2,0.8,3.9,2.2,5.3
				c1.4,1.4,3.3,2.2,5.3,2.2c2,0,3.8-0.8,5.3-2.2l1.4-1.4l11.4,11.5l-1.4,1.4c-1.4,1.4-2.2,3.3-2.2,5.3c0,2,0.8,3.9,2.2,5.3
				c1.4,1.4,3.3,2.2,5.3,2.2c2,0,3.8-0.8,5.3-2.2l1.4-1.4l7.9,7.9L112.7,215.1z M110.4,207.1l2.3,2.3L233.3,89.7l-2.3-2.4
				c-1.9,1.3-4.2,2-6.5,2c-3.1,0-6-1.2-8.1-3.4c-2.2-2.2-3.3-5.1-3.3-8.1c0-2.4,0.7-4.7,2.1-6.6l-6-6.1c-1.9,1.3-4.2,2-6.5,2
				c-3.1,0-6-1.2-8.1-3.4c-2.2-2.2-3.3-5.1-3.3-8.1c0-2.4,0.7-4.7,2.1-6.6l-7.4-7.5c-1.9,1.3-4.2,2-6.5,2c-3.1,0-6-1.2-8.1-3.4
				c-4-4-4.4-10.2-1.2-14.7l-2.3-2.4L46.8,143l2.3,2.3c1.1-0.8,2.3-1.4,3.6-1.8c0.8-0.3,1.8-0.4,2.7-0.5c0.2,0,0.4,0,0.6,0
				c3.1,0,6,1.2,8.1,3.3c3.3,3.3,4.2,8.2,2.4,12.5c-0.1,0.3-0.3,0.7-0.5,1c-0.1,0.2-0.2,0.3-0.3,0.5l0,0.1c-0.1,0.1-0.2,0.3-0.3,0.4
				c-0.1,0.1-0.2,0.2-0.2,0.3c-0.1,0.1-0.1,0.2-0.2,0.3c0,0,0,0,0,0l6.5,6.6c2-1.5,4.4-2.4,7-2.4c3.1,0,6,1.2,8.1,3.4
				c4.1,4.1,4.4,10.7,0.9,15.2l6.7,6.7c2-1.5,4.4-2.4,7-2.4c3.1,0,6,1.2,8.1,3.4C113.6,196.1,113.9,202.6,110.4,207.1z"/>
		</g>
		<g>
			
				<linearGradient id="SVGID_11_" gradientUnits="userSpaceOnUse" x1="88.4203" y1="108.2702" x2="186.5503" y2="108.2702" gradientTransform="matrix(0.7044 0.7098 -0.7098 0.7044 151.6038 -88.8364)">
				<stop  offset="0" style="stop-color:#0F264E"/>
				<stop  offset="1" style="stop-color:#1A6583"/>
			</linearGradient>
			<polygon fill="url(#SVGID_11_)" points="204.7,121.3 135.6,51.6 138.5,48.8 207.6,118.4 			"/>
		</g>
		<g>
			
				<rect x="97.9" y="89.4" transform="matrix(0.7044 0.7098 -0.7098 0.7044 128.7768 -52.043)" fill="#E81929" width="57.9" height="78.4"/>
		</g>
	</g>
	<g display="inline">
		<g>
			<path fill="#FFFFFF" d="M217.6,39.3l-103.1,140l-5.8-4.3c0.1-0.1,0.2-0.3,0.4-0.5c3.1-4.2,2.2-10.1-2-13.2
				c-4.2-3.1-10.1-2.2-13.2,2c-0.1,0.2-0.2,0.3-0.3,0.5l-10.8-7.9c0.1-0.1,0.2-0.3,0.4-0.5c3.1-4.2,2.2-10.1-2-13.2
				c-4.2-3.1-10.1-2.2-13.2,2c-0.1,0.2-0.2,0.3-0.3,0.5l-10.5-7.8c0.3-0.5,0.2-0.3,0.3-0.3c0.1-0.1,0.2-0.2,0.2-0.3
				c0,0,0.1-0.1,0.1-0.2c0.1-0.1,0.1-0.2,0.2-0.3c0.1-0.1,0.1-0.2,0.2-0.3c0-0.1,0.1-0.2,0.1-0.2c0.1-0.1,0.1-0.2,0.1-0.3
				c0.1-0.1,0.1-0.3,0.2-0.4c0,0,0,0,0-0.1c0.1-0.1,0.1-0.3,0.1-0.4c0.1-0.3,0.2-0.6,0.3-0.9c0.9-3.6-0.4-7.6-3.5-9.9
				c-2.2-1.6-5-2.1-7.5-1.6c-0.7,0.2-1.5,0.4-2.2,0.7c-1.1,0.5-2.1,1.3-3,2.2c-0.2,0.2-0.4,0.5-0.6,0.7c-0.1,0.1,0.1-0.1-0.3,0.3
				l-5.8-4.3L139-18.6l5.8,4.3c-3.1,4.2-2.2,10.1,2,13.2s10.1,2.2,13.2-2l11.4,8.4c-3.1,4.2-2.2,10.1,2,13.2s10.1,2.2,13.2-2
				l9.8,7.2c-3.1,4.2-2.2,10.1,2,13.2s10.1,2.2,13.2-2L217.6,39.3z"/>
			
				<linearGradient id="SVGID_12_" gradientUnits="userSpaceOnUse" x1="48.3974" y1="91.9018" x2="149.9709" y2="91.9018" gradientTransform="matrix(0.8053 0.5929 -0.5929 0.8053 101.3633 -52.4737)">
				<stop  offset="0" style="stop-color:#0F264E"/>
				<stop  offset="1" style="stop-color:#1A6583"/>
			</linearGradient>
			<path fill="url(#SVGID_12_)" d="M114.9,182.1l-9.1-6.7l1.4-1.6c0.1-0.1,0.2-0.2,0.3-0.4c1.2-1.6,1.7-3.6,1.4-5.5
				c-0.3-2-1.3-3.7-3-4.9c-1.3-1-2.8-1.5-4.4-1.5c-2.4,0-4.6,1.1-6,3c-0.1,0.1-0.2,0.2-0.3,0.4l-1.2,1.8l-14.2-10.5l1.4-1.6
				c0.1-0.1,0.2-0.2,0.3-0.4c1.2-1.6,1.7-3.6,1.4-5.5c-0.3-2-1.3-3.7-3-4.9c-1.3-1-2.8-1.5-4.4-1.5c-2.4,0-4.6,1.1-6,3
				c-0.1,0.1-0.2,0.2-0.3,0.4l-1.2,1.8l-13.9-10.2l1.2-1.6c0.1-0.1,0.2-0.2,0.2-0.3l0,0c0.1-0.1,0.1-0.2,0.2-0.3l0.1-0.2
				c0-0.1,0.1-0.1,0.1-0.1l0-0.1c0-0.1,0.1-0.1,0.1-0.2l0-0.1c0,0,0-0.1,0.1-0.1l0-0.1c0-0.1,0.1-0.1,0.1-0.1l0.1-0.2
				c0-0.1,0.1-0.2,0.1-0.2c0.1-0.1,0.1-0.2,0.1-0.3l0-0.1c0.1-0.2,0.1-0.5,0.2-0.7c0.7-3-0.4-6-2.8-7.8c-1.3-0.9-2.8-1.4-4.4-1.4
				c-0.5,0-1.1,0.1-1.6,0.2c-0.6,0.1-1.2,0.3-1.7,0.6c-0.9,0.4-1.7,1-2.4,1.8c-0.2,0.2-0.3,0.4-0.5,0.6l0,0
				c-0.1,0.1-0.2,0.2-0.2,0.3l-1.2,1.6l-9-6.7L138.6-21.4l9,6.6l-1.2,1.6c-2.4,3.3-1.7,8,1.6,10.4c1.3,1,2.8,1.5,4.4,1.5
				c2.4,0,4.6-1.1,6-3l1.2-1.6l14.7,10.8l-1.2,1.6c-2.4,3.3-1.7,8,1.6,10.4c1.3,1,2.8,1.5,4.4,1.5c2.4,0,4.6-1.1,6-3l1.2-1.6
				l13.1,9.6l-1.2,1.6c-2.4,3.3-1.7,8,1.6,10.4c1.3,1,2.8,1.5,4.4,1.5c2.4,0,4.6-1.1,6-3l1.2-1.6l9,6.6L114.9,182.1z M111.4,174.5
				l2.6,1.9L214.8,39.7l-2.7-2c-2.1,2-5,3.2-7.9,3.2c-2.5,0-4.8-0.8-6.8-2.2c-4.5-3.3-5.9-9.4-3.5-14.3l-6.9-5.1
				c-2.1,2-5,3.2-7.9,3.2c-2.5,0-4.8-0.8-6.8-2.2c-4.5-3.3-5.9-9.4-3.5-14.3l-8.5-6.2c-2.1,2-5,3.2-7.9,3.2c-2.5,0-4.8-0.8-6.8-2.2
				c-4.5-3.3-5.9-9.4-3.5-14.3l-2.7-2L38.7,121l2.6,1.9c0.9-1,2.1-1.8,3.3-2.4c0.8-0.4,1.7-0.7,2.6-0.9c0.8-0.2,1.6-0.3,2.4-0.3
				c2.4,0,4.8,0.8,6.7,2.2c3.7,2.7,5.4,7.4,4.3,12c-0.1,0.4-0.2,0.7-0.3,1.1c-0.1,0.2-0.1,0.3-0.2,0.5l0,0.1
				c-0.1,0.2-0.1,0.3-0.2,0.5c-0.1,0.1-0.1,0.3-0.2,0.4c0,0.1-0.1,0.2-0.2,0.3c0,0,0,0,0,0l7.4,5.5c2.2-2.3,5.2-3.6,8.3-3.6
				c2.5,0,4.8,0.8,6.8,2.2c4.7,3.5,6,9.9,3.2,14.8l7.7,5.6c2.2-2.3,5.2-3.6,8.3-3.6c2.5,0,4.8,0.8,6.8,2.2c2.5,1.8,4.1,4.5,4.5,7.5
				C113.1,169.8,112.7,172.3,111.4,174.5z"/>
		</g>
		<g>
			
				<linearGradient id="SVGID_13_" gradientUnits="userSpaceOnUse" x1="50.1191" y1="47.4275" x2="148.2491" y2="47.4275" gradientTransform="matrix(0.8053 0.5929 -0.5929 0.8053 101.3633 -52.4737)">
				<stop  offset="0" style="stop-color:#0F264E"/>
				<stop  offset="1" style="stop-color:#1A6583"/>
			</linearGradient>
			<polygon fill="url(#SVGID_13_)" points="191.4,75.2 112.4,17.1 114.8,13.8 193.8,72 			"/>
		</g>
		<g>
			
				<rect x="86.7" y="55.3" transform="matrix(0.8053 0.5929 -0.5929 0.8053 78.5347 -50.1537)" fill="#E81929" width="57.9" height="78.4"/>
		</g>
	</g>
</g>
<g display="none">
	<rect x="60.7" y="94.6" display="inline" fill="#E81929" width="79.3" height="6.2"/>
	<rect x="60.7" y="110" display="inline" fill="#E81929" width="79.3" height="6.2"/>
	<rect x="60.7" y="125.4" display="inline" fill="#E81929" width="79.3" height="6.2"/>
	<rect x="162.2" y="94.6" display="inline" fill="#E81929" width="44.6" height="6.2"/>
	<rect x="162.2" y="110" display="inline" fill="#E81929" width="44.6" height="6.2"/>
	<rect x="162.2" y="125.4" display="inline" fill="#E81929" width="44.6" height="6.2"/>
	<rect x="83.5" y="30" display="inline" fill="#E81929" width="27.4" height="6.2"/>
	<rect x="84.1" y="44.4" display="inline" fill="#E81929" width="27.4" height="6.2"/>
	<rect x="84.1" y="59.8" display="inline" fill="#E81929" width="27.4" height="6.2"/>
	<rect x="124.8" y="30" display="inline" fill="#E81929" width="66" height="6.2"/>
	<rect x="125.4" y="44.4" display="inline" fill="#E81929" width="66" height="6.2"/>
	<rect x="125.4" y="59.8" display="inline" fill="#E81929" width="66" height="6.2"/>
	<rect x="125.4" y="147.5" display="inline" fill="#E81929" width="20.6" height="25.7"/>
	<g display="inline">
		<linearGradient id="SVGID_14_" gradientUnits="userSpaceOnUse" x1="55.6297" y1="130.6584" x2="206.6297" y2="130.6584">
			<stop  offset="0" style="stop-color:#0F264E"/>
			<stop  offset="1" style="stop-color:#1A6583"/>
		</linearGradient>
		<path fill="url(#SVGID_14_)" d="M206.6,176.7h-151v-92h151V176.7z M60.6,171.7h141v-82h-141V171.7z"/>
	</g>
	<g display="inline">
		<linearGradient id="SVGID_15_" gradientUnits="userSpaceOnUse" x1="70.6297" y1="56.1585" x2="191.6297" y2="56.1585">
			<stop  offset="0" style="stop-color:#0F264E"/>
			<stop  offset="1" style="stop-color:#1A6583"/>
		</linearGradient>
		<path fill="url(#SVGID_15_)" d="M191.6,89.7h-121v-67h121V89.7z M75.6,84.7h111v-57h-111V84.7z"/>
	</g>
	<g display="inline">
		<linearGradient id="SVGID_16_" gradientUnits="userSpaceOnUse" x1="42.4034" y1="177.9497" x2="228.8239" y2="177.9497">
			<stop  offset="0" style="stop-color:#0F264E"/>
			<stop  offset="1" style="stop-color:#1A6583"/>
		</linearGradient>
		<path fill="url(#SVGID_16_)" d="M228.8,184.3H42.4v-12.6h186.4V184.3z M47.4,179.3h176.4v-2.6H47.4V179.3z"/>
	</g>
	<g display="inline">
		<linearGradient id="SVGID_17_" gradientUnits="userSpaceOnUse" x1="29.6837" y1="186.7908" x2="241.5426" y2="186.7908">
			<stop  offset="0" style="stop-color:#0F264E"/>
			<stop  offset="1" style="stop-color:#1A6583"/>
		</linearGradient>
		<path fill="url(#SVGID_17_)" d="M241.5,193.4H29.7v-13.1h211.9V193.4z M34.7,188.4h201.9v-3.1H34.7V188.4z"/>
	</g>
</g>
<g display="none">
	<g display="inline">
		<g>
			<linearGradient id="SVGID_18_" gradientUnits="userSpaceOnUse" x1="74.6837" y1="74.8811" x2="74.6837" y2="74.8811">
				<stop  offset="0" style="stop-color:#0F264E"/>
				<stop  offset="1" style="stop-color:#1A6583"/>
			</linearGradient>
			<path fill="none" stroke="url(#SVGID_18_)" stroke-width="5" stroke-miterlimit="10" d="M74.7,74.9"/>
		</g>
	</g>
	<linearGradient id="SVGID_19_" gradientUnits="userSpaceOnUse" x1="34.1729" y1="101.1585" x2="241.1837" y2="101.1585">
		<stop  offset="0" style="stop-color:#0F264E"/>
		<stop  offset="1" style="stop-color:#1A6583"/>
	</linearGradient>
	<polygon display="inline" fill="url(#SVGID_19_)" points="34.2,66.7 66.2,152.7 209.7,152.7 241.2,65.7 129.6,65.7 129.6,49.7 
		66.2,49.7 66.1,66.7 	"/>
	<polygon display="inline" fill="#E81929" points="68.4,72.9 81.7,42.6 219.7,89.7 131.7,89.7 132.2,73.4 	"/>
	<polygon display="inline" fill="#E81929" points="133.7,88.7 214.7,51.7 233.7,88.7 157.7,88.7 	"/>
	<g display="inline">
		<polygon fill="#FFFFFF" points="34.2,92.7 66.2,178.7 209.7,178.7 241.2,91.7 129.6,91.7 129.6,75.7 66.2,75.7 66.1,92.7 		"/>
		<linearGradient id="SVGID_20_" gradientUnits="userSpaceOnUse" x1="30.5724" y1="126.6585" x2="244.7482" y2="126.6585">
			<stop  offset="0" style="stop-color:#0F264E"/>
			<stop  offset="1" style="stop-color:#1A6583"/>
		</linearGradient>
		<path fill="url(#SVGID_20_)" d="M211.4,180.7H64.5l-33.9-91h33l0.1-17h68.9v16h112.1L211.4,180.7z M68,175.7h140l29.7-82h-110v-16
			h-59l-0.1,17H37.8L68,175.7z"/>
	</g>
</g>
<g display="none">
	<g display="inline">
		<linearGradient id="SVGID_21_" gradientUnits="userSpaceOnUse" x1="61.6297" y1="76.6585" x2="117.6297" y2="76.6585">
			<stop  offset="0" style="stop-color:#0F264E"/>
			<stop  offset="1" style="stop-color:#1A6583"/>
		</linearGradient>
		<path fill="url(#SVGID_21_)" d="M117.6,102.7h-56v-52h56V102.7z M66.6,97.7h46v-42h-46V97.7z"/>
		<g>
			<linearGradient id="SVGID_22_" gradientUnits="userSpaceOnUse" x1="85.2259" y1="76.2061" x2="95.1956" y2="76.2061">
				<stop  offset="0" style="stop-color:#0F264E"/>
				<stop  offset="1" style="stop-color:#1A6583"/>
			</linearGradient>
			<path fill="url(#SVGID_22_)" d="M95.2,101.7h-10V50.7h10V101.7z M89.2,97.7h2V54.7h-2V97.7z"/>
		</g>
		<g>
			<linearGradient id="SVGID_23_" gradientUnits="userSpaceOnUse" x1="96.9422" y1="61.168" x2="111.6761" y2="61.168">
				<stop  offset="0" style="stop-color:#0F264E"/>
				<stop  offset="1" style="stop-color:#1A6583"/>
			</linearGradient>
			<path fill="url(#SVGID_23_)" d="M111.7,65.9H96.9v-9.5h14.7V65.9z M99.9,62.9h8.7v-3.5h-8.7V62.9z"/>
		</g>
	</g>
	<g display="inline">
		<rect x="149.1" y="-2.8" fill="#E81929" width="9.4" height="192"/>
		<rect x="237.6" y="-2.8" fill="#E81929" width="9.4" height="192"/>
		<rect x="192.8" y="31.4" fill="#E81929" width="9.4" height="109.3"/>
		<rect x="149.1" y="181.2" fill="#E81929" width="98" height="8"/>
		<rect x="149.1" y="132.7" fill="#E81929" width="98" height="8"/>
		<rect x="149.1" y="71.2" fill="#E81929" width="98" height="8"/>
		<rect x="149.1" y="27.4" fill="#E81929" width="98" height="8"/>
		<linearGradient id="SVGID_24_" gradientUnits="userSpaceOnUse" x1="149.1182" y1="-12.3564" x2="158.5451" y2="-12.3564">
			<stop  offset="0" style="stop-color:#0F264E"/>
			<stop  offset="1" style="stop-color:#1A6583"/>
		</linearGradient>
		<rect x="149.1" y="-22" fill="url(#SVGID_24_)" width="9.4" height="19.2"/>
		<linearGradient id="SVGID_25_" gradientUnits="userSpaceOnUse" x1="237.6441" y1="-12.3564" x2="247.071" y2="-12.3564">
			<stop  offset="0" style="stop-color:#0F264E"/>
			<stop  offset="1" style="stop-color:#1A6583"/>
		</linearGradient>
		<rect x="237.6" y="-22" fill="url(#SVGID_25_)" width="9.4" height="19.2"/>
		<linearGradient id="SVGID_26_" gradientUnits="userSpaceOnUse" x1="131.8986" y1="172.905" x2="149.1182" y2="172.905">
			<stop  offset="0" style="stop-color:#0F264E"/>
			<stop  offset="1" style="stop-color:#1A6583"/>
		</linearGradient>
		<rect x="131.9" y="144.9" fill="url(#SVGID_26_)" width="17.2" height="56"/>
		<linearGradient id="SVGID_27_" gradientUnits="userSpaceOnUse" x1="247.071" y1="172.905" x2="264.2906" y2="172.905">
			<stop  offset="0" style="stop-color:#0F264E"/>
			<stop  offset="1" style="stop-color:#1A6583"/>
		</linearGradient>
		<rect x="247.1" y="144.9" fill="url(#SVGID_27_)" width="17.2" height="56"/>
	</g>
	<g display="inline">
		<g>
			<linearGradient id="SVGID_28_" gradientUnits="userSpaceOnUse" x1="63.8582" y1="148.6709" x2="81.305" y2="148.6709">
				<stop  offset="0" style="stop-color:#0F264E"/>
				<stop  offset="1" style="stop-color:#1A6583"/>
			</linearGradient>
			<path fill="url(#SVGID_28_)" d="M81.3,200.1H63.9V97.2h17.4V200.1z M68.9,195.1h7.4v-92.9h-7.4V195.1z"/>
		</g>
		<g>
			<linearGradient id="SVGID_29_" gradientUnits="userSpaceOnUse" x1="15.6297" y1="149.1584" x2="126.6297" y2="149.1584">
				<stop  offset="0" style="stop-color:#0F264E"/>
				<stop  offset="1" style="stop-color:#1A6583"/>
			</linearGradient>
			<path fill="url(#SVGID_29_)" d="M126.6,200.7h-111v-103h111V200.7z M20.6,195.7h101v-93h-101V195.7z"/>
		</g>
		<g>
			<linearGradient id="SVGID_30_" gradientUnits="userSpaceOnUse" x1="87.2444" y1="117.3149" x2="116.7108" y2="117.3149">
				<stop  offset="0" style="stop-color:#0F264E"/>
				<stop  offset="1" style="stop-color:#1A6583"/>
			</linearGradient>
			<path fill="url(#SVGID_30_)" d="M116.7,126.6H87.2V108h29.5V126.6z M92.2,121.6h19.5V113H92.2V121.6z"/>
		</g>
	</g>
	<g display="inline">
		<g>
			<rect x="155.6" y="112.7" fill="#FFFFFF" width="84" height="74"/>
			<g>
				<rect x="192.4" y="112.1" fill="#FFFFFF" width="9.4" height="73.5"/>
				<linearGradient id="SVGID_31_" gradientUnits="userSpaceOnUse" x1="189.8543" y1="148.8672" x2="204.2068" y2="148.8672">
					<stop  offset="0" style="stop-color:#0F264E"/>
					<stop  offset="1" style="stop-color:#1A6583"/>
				</linearGradient>
				<path fill="url(#SVGID_31_)" d="M204.2,188.1h-14.4v-78.5h14.4V188.1z M194.9,183.1h4.4v-68.5h-4.4V183.1z"/>
			</g>
			<linearGradient id="SVGID_32_" gradientUnits="userSpaceOnUse" x1="153.6297" y1="149.1584" x2="242.6297" y2="149.1584">
				<stop  offset="0" style="stop-color:#0F264E"/>
				<stop  offset="1" style="stop-color:#1A6583"/>
			</linearGradient>
			<path fill="url(#SVGID_32_)" d="M242.6,188.7h-89v-79h89V188.7z M158.6,183.7h79v-69h-79V183.7z"/>
		</g>
		<g>
			<rect x="211.9" y="120.2" fill="#FFFFFF" width="18.4" height="10.2"/>
			<linearGradient id="SVGID_33_" gradientUnits="userSpaceOnUse" x1="209.429" y1="125.3057" x2="232.8143" y2="125.3057">
				<stop  offset="0" style="stop-color:#0F264E"/>
				<stop  offset="1" style="stop-color:#1A6583"/>
			</linearGradient>
			<path fill="url(#SVGID_33_)" d="M232.8,132.9h-23.4v-15.2h23.4V132.9z M214.4,127.9h13.4v-5.2h-13.4V127.9z"/>
		</g>
	</g>
</g>
<g>
	<g>
		<g>
			<linearGradient id="SVGID_34_" gradientUnits="userSpaceOnUse" x1="83.6297" y1="28.1585" x2="184.6297" y2="28.1585">
				<stop  offset="0" style="stop-color:#0F264E"/>
				<stop  offset="1" style="stop-color:#1A6583"/>
			</linearGradient>
			<rect x="83.6" y="25.7" fill="url(#SVGID_34_)" width="101" height="5"/>
		</g>
		<g>
			<linearGradient id="SVGID_35_" gradientUnits="userSpaceOnUse" x1="83.6297" y1="43.1585" x2="184.6297" y2="43.1585">
				<stop  offset="0" style="stop-color:#0F264E"/>
				<stop  offset="1" style="stop-color:#1A6583"/>
			</linearGradient>
			<rect x="83.6" y="40.7" fill="url(#SVGID_35_)" width="101" height="5"/>
		</g>
		<g>
			<linearGradient id="SVGID_36_" gradientUnits="userSpaceOnUse" x1="83.6297" y1="58.1585" x2="184.6297" y2="58.1585">
				<stop  offset="0" style="stop-color:#0F264E"/>
				<stop  offset="1" style="stop-color:#1A6583"/>
			</linearGradient>
			<rect x="83.6" y="55.7" fill="url(#SVGID_36_)" width="101" height="5"/>
		</g>
		<g>
			<linearGradient id="SVGID_37_" gradientUnits="userSpaceOnUse" x1="83.6297" y1="73.1585" x2="121.6297" y2="73.1585">
				<stop  offset="0" style="stop-color:#0F264E"/>
				<stop  offset="1" style="stop-color:#1A6583"/>
			</linearGradient>
			<rect x="83.6" y="70.7" fill="url(#SVGID_37_)" width="38" height="5"/>
		</g>
		<g>
			<linearGradient id="SVGID_38_" gradientUnits="userSpaceOnUse" x1="83.6297" y1="91.1585" x2="184.6297" y2="91.1585">
				<stop  offset="0" style="stop-color:#0F264E"/>
				<stop  offset="1" style="stop-color:#1A6583"/>
			</linearGradient>
			<rect x="83.6" y="88.7" fill="url(#SVGID_38_)" width="101" height="5"/>
		</g>
		<g>
			<linearGradient id="SVGID_39_" gradientUnits="userSpaceOnUse" x1="83.6297" y1="106.1585" x2="184.6297" y2="106.1585">
				<stop  offset="0" style="stop-color:#0F264E"/>
				<stop  offset="1" style="stop-color:#1A6583"/>
			</linearGradient>
			<rect x="83.6" y="103.7" fill="url(#SVGID_39_)" width="101" height="5"/>
		</g>
		<g>
			<linearGradient id="SVGID_40_" gradientUnits="userSpaceOnUse" x1="83.6297" y1="121.1585" x2="184.6297" y2="121.1585">
				<stop  offset="0" style="stop-color:#0F264E"/>
				<stop  offset="1" style="stop-color:#1A6583"/>
			</linearGradient>
			<rect x="83.6" y="118.7" fill="url(#SVGID_40_)" width="101" height="5"/>
		</g>
		<g>
			<linearGradient id="SVGID_41_" gradientUnits="userSpaceOnUse" x1="83.6297" y1="136.1584" x2="184.6297" y2="136.1584">
				<stop  offset="0" style="stop-color:#0F264E"/>
				<stop  offset="1" style="stop-color:#1A6583"/>
			</linearGradient>
			<rect x="83.6" y="133.7" fill="url(#SVGID_41_)" width="101" height="5"/>
		</g>
		<g>
			<linearGradient id="SVGID_42_" gradientUnits="userSpaceOnUse" x1="83.6297" y1="151.1584" x2="163.6297" y2="151.1584">
				<stop  offset="0" style="stop-color:#0F264E"/>
				<stop  offset="1" style="stop-color:#1A6583"/>
			</linearGradient>
			<rect x="83.6" y="148.7" fill="url(#SVGID_42_)" width="80" height="5"/>
		</g>
	</g>
	<g>
		<linearGradient id="SVGID_43_" gradientUnits="userSpaceOnUse" x1="66.209" y1="90.7275" x2="201.2583" y2="90.7275">
			<stop  offset="0" style="stop-color:#0F264E"/>
			<stop  offset="1" style="stop-color:#1A6583"/>
		</linearGradient>
		<path fill="url(#SVGID_43_)" d="M201.3,181.5h-135V0h135V181.5z M71.2,176.5h125V5h-125V176.5z"/>
	</g>
	<g>
		<rect x="153.8" y="154.4" fill="#FFFFFF" width="128.8" height="44.6"/>
		<linearGradient id="SVGID_44_" gradientUnits="userSpaceOnUse" x1="151.2896" y1="176.6562" x2="285.0854" y2="176.6562">
			<stop  offset="0" style="stop-color:#0F264E"/>
			<stop  offset="1" style="stop-color:#1A6583"/>
		</linearGradient>
		<path fill="url(#SVGID_44_)" d="M285.1,201.4H151.3v-49.6h133.8V201.4z M156.3,196.4h123.8v-39.6H156.3V196.4z"/>
	</g>
	<g>
		<g>
			<rect x="2.5" y="95.7" fill="#FFFFFF" width="113.3" height="103.2"/>
			<linearGradient id="SVGID_45_" gradientUnits="userSpaceOnUse" x1="0" y1="147.3325" x2="118.2588" y2="147.3325">
				<stop  offset="0" style="stop-color:#0F264E"/>
				<stop  offset="1" style="stop-color:#1A6583"/>
			</linearGradient>
			<path fill="url(#SVGID_45_)" d="M118.3,201.4H0V93.2h118.3V201.4z M5,196.4h108.3V98.2H5V196.4z"/>
		</g>
		<linearGradient id="SVGID_46_" gradientUnits="userSpaceOnUse" x1="2.4999" y1="109.4796" x2="115.7587" y2="109.4796">
			<stop  offset="0" style="stop-color:#0F264E"/>
			<stop  offset="1" style="stop-color:#1A6583"/>
		</linearGradient>
		<rect x="2.5" y="95.7" fill="url(#SVGID_46_)" width="113.3" height="27.5"/>
		<rect x="59.1" y="140.4" fill="#E81929" width="17.7" height="18.6"/>
		<g>
			<linearGradient id="SVGID_47_" gradientUnits="userSpaceOnUse" x1="20.6297" y1="160.1584" x2="25.6297" y2="160.1584">
				<stop  offset="0" style="stop-color:#0F264E"/>
				<stop  offset="1" style="stop-color:#1A6583"/>
			</linearGradient>
			
				<line fill="none" stroke="url(#SVGID_47_)" stroke-width="5" stroke-miterlimit="10" x1="23.1" y1="122.7" x2="23.1" y2="197.7"/>
			<linearGradient id="SVGID_48_" gradientUnits="userSpaceOnUse" x1="38.6297" y1="159.6584" x2="43.6297" y2="159.6584">
				<stop  offset="0" style="stop-color:#0F264E"/>
				<stop  offset="1" style="stop-color:#1A6583"/>
			</linearGradient>
			
				<line fill="none" stroke="url(#SVGID_48_)" stroke-width="5" stroke-miterlimit="10" x1="41.1" y1="122.7" x2="41.1" y2="196.7"/>
			<linearGradient id="SVGID_49_" gradientUnits="userSpaceOnUse" x1="56.6297" y1="159.6584" x2="61.6297" y2="159.6584">
				<stop  offset="0" style="stop-color:#0F264E"/>
				<stop  offset="1" style="stop-color:#1A6583"/>
			</linearGradient>
			
				<line fill="none" stroke="url(#SVGID_49_)" stroke-width="5" stroke-miterlimit="10" x1="59.1" y1="122.7" x2="59.1" y2="196.7"/>
			<linearGradient id="SVGID_50_" gradientUnits="userSpaceOnUse" x1="74.6297" y1="159.6584" x2="79.6297" y2="159.6584">
				<stop  offset="0" style="stop-color:#0F264E"/>
				<stop  offset="1" style="stop-color:#1A6583"/>
			</linearGradient>
			
				<line fill="none" stroke="url(#SVGID_50_)" stroke-width="5" stroke-miterlimit="10" x1="77.1" y1="122.7" x2="77.1" y2="196.7"/>
			<linearGradient id="SVGID_51_" gradientUnits="userSpaceOnUse" x1="92.6297" y1="159.1584" x2="97.6297" y2="159.1584">
				<stop  offset="0" style="stop-color:#0F264E"/>
				<stop  offset="1" style="stop-color:#1A6583"/>
			</linearGradient>
			
				<line fill="none" stroke="url(#SVGID_51_)" stroke-width="5" stroke-miterlimit="10" x1="95.1" y1="121.7" x2="95.1" y2="196.7"/>
		</g>
		<g>
			<linearGradient id="SVGID_52_" gradientUnits="userSpaceOnUse" x1="2.6297" y1="140.1584" x2="115.6297" y2="140.1584">
				<stop  offset="0" style="stop-color:#0F264E"/>
				<stop  offset="1" style="stop-color:#1A6583"/>
			</linearGradient>
			<rect x="2.6" y="137.7" fill="url(#SVGID_52_)" width="113" height="5"/>
		</g>
		<g>
			<linearGradient id="SVGID_53_" gradientUnits="userSpaceOnUse" x1="2.6297" y1="159.1584" x2="115.6297" y2="159.1584">
				<stop  offset="0" style="stop-color:#0F264E"/>
				<stop  offset="1" style="stop-color:#1A6583"/>
			</linearGradient>
			<rect x="2.6" y="156.7" fill="url(#SVGID_53_)" width="113" height="5"/>
		</g>
		<g>
			<linearGradient id="SVGID_54_" gradientUnits="userSpaceOnUse" x1="2.6297" y1="179.1584" x2="115.6297" y2="179.1584">
				<stop  offset="0" style="stop-color:#0F264E"/>
				<stop  offset="1" style="stop-color:#1A6583"/>
			</linearGradient>
			<rect x="2.6" y="176.7" fill="url(#SVGID_54_)" width="113" height="5"/>
		</g>
	</g>
	<linearGradient id="SVGID_55_" gradientUnits="userSpaceOnUse" x1="164.0749" y1="176.6067" x2="272.1699" y2="176.6067">
		<stop  offset="0" style="stop-color:#0F264E"/>
		<stop  offset="1" style="stop-color:#1A6583"/>
	</linearGradient>
	<rect x="164.1" y="162.6" fill="url(#SVGID_55_)" width="108.1" height="28"/>
	<g>
		<g>
			<path fill="#E81929" d="M189.7,167.5c1.2,0,2.2,1,2.2,2.2v12.7c0,1.2-0.9,2.2-2.2,2.2h-6.5c-1.3,0-2.2-1-2.2-2.2v-12.7
				c0-1.2,1-2.2,2.2-2.2H189.7z M189.7,182.5v-12.7h-6.5v12.7H189.7z"/>
			<path fill="#FF0000" d="M189.7,185.2h-6.5c-1.5,0-2.7-1.2-2.7-2.7v-12.7c0-1.5,1.2-2.7,2.7-2.7h6.5c1.5,0,2.7,1.2,2.7,2.7v12.7
				C192.4,184,191.2,185.2,189.7,185.2z M183.2,168c-0.9,0-1.7,0.8-1.7,1.7v12.7c0,1,0.7,1.7,1.7,1.7h6.5c1,0,1.7-0.7,1.7-1.7v-12.7
				c0-0.9-0.8-1.7-1.7-1.7H183.2z M190.2,183h-7.5v-13.7h7.5V183z M183.7,182h5.5v-11.7h-5.5V182z"/>
		</g>
		<g>
			<path fill="#E81929" d="M205.5,167.5c1.2,0,2.2,1,2.2,2.2v12.7c0,1.2-0.9,2.2-2.2,2.2H199c-1.3,0-2.2-1-2.2-2.2v-12.7
				c0-1.2,1-2.2,2.2-2.2H205.5z M205.5,182.5v-12.7H199v12.7H205.5z"/>
			<path fill="#FF0000" d="M205.5,185.2H199c-1.5,0-2.7-1.2-2.7-2.7v-12.7c0-1.5,1.2-2.7,2.7-2.7h6.5c1.5,0,2.7,1.2,2.7,2.7v12.7
				C208.2,184,207,185.2,205.5,185.2z M199,168c-0.9,0-1.7,0.8-1.7,1.7v12.7c0,1,0.7,1.7,1.7,1.7h6.5c1,0,1.7-0.7,1.7-1.7v-12.7
				c0-0.9-0.8-1.7-1.7-1.7H199z M206,183h-7.5v-13.7h7.5V183z M199.5,182h5.5v-11.7h-5.5V182z"/>
		</g>
		<g>
			<path fill="#E81929" d="M217.3,174.4c-0.5,0-0.8,0-1.1-0.4c-0.2-0.3-0.2-0.6-0.2-1v-1.2c0-0.4,0-0.7,0.2-1
				c0.3-0.4,0.7-0.4,1.1-0.4h1.6c0.5,0,0.8,0,1.1,0.4c0.2,0.3,0.2,0.6,0.2,1v1.2c0,0.4,0,0.7-0.2,1c-0.3,0.4-0.7,0.4-1.1,0.4H217.3z
				 M217.3,181.9c-0.5,0-0.8,0-1.1-0.4c-0.2-0.3-0.2-0.6-0.2-1v-1.2c0-0.4,0-0.7,0.2-1c0.3-0.4,0.7-0.4,1.1-0.4h1.6
				c0.5,0,0.8,0,1.1,0.4c0.2,0.3,0.2,0.6,0.2,1v1.2c0,0.4,0,0.7-0.2,1c-0.3,0.4-0.7,0.4-1.1,0.4H217.3z"/>
			<path fill="#FF0000" d="M218.9,182.4h-1.6c-0.5,0-1.1,0-1.5-0.6c-0.3-0.5-0.3-0.8-0.3-1.3v-1.2c0-0.4,0-0.8,0.3-1.3
				c0.5-0.6,1-0.6,1.5-0.6h1.6c0.5,0,1.1,0,1.5,0.6c0.3,0.5,0.3,0.8,0.3,1.3v1.2c0,0.4,0,0.8-0.3,1.3
				C220,182.4,219.4,182.4,218.9,182.4z M217.3,178.3c-0.5,0-0.6,0-0.7,0.2c-0.1,0.2-0.1,0.3-0.1,0.7v1.2c0,0.4,0,0.5,0.1,0.7
				c0.1,0.2,0.2,0.2,0.7,0.2h1.6c0.5,0,0.6,0,0.7-0.2c0.1-0.2,0.1-0.3,0.1-0.7v-1.2c0-0.4,0-0.5-0.1-0.7c-0.1-0.2-0.2-0.2-0.7-0.2
				H217.3z M218.9,174.9h-1.6c-0.5,0-1.1,0-1.5-0.6c-0.3-0.5-0.3-0.8-0.3-1.3v-1.2c0-0.4,0-0.8,0.3-1.3c0.5-0.6,1-0.6,1.5-0.6h1.6
				c0.5,0,1.1,0,1.5,0.6c0.3,0.5,0.3,0.8,0.3,1.3v1.2c0,0.4,0,0.8-0.3,1.3C220,174.9,219.4,174.9,218.9,174.9z M217.3,170.8
				c-0.5,0-0.6,0-0.7,0.2c-0.1,0.2-0.1,0.3-0.1,0.7v1.2c0,0.4,0,0.5,0.1,0.7c0.1,0.2,0.2,0.2,0.7,0.2h1.6c0.5,0,0.6,0,0.7-0.2
				c0.1-0.2,0.1-0.3,0.1-0.7v-1.2c0-0.4,0-0.5-0.1-0.7c-0.1-0.2-0.2-0.2-0.7-0.2H217.3z"/>
		</g>
		<g>
			<path fill="#E81929" d="M237.2,167.5c1.2,0,2.2,1,2.2,2.2v12.7c0,1.2-0.9,2.2-2.2,2.2h-6.5c-1.3,0-2.2-1-2.2-2.2v-12.7
				c0-1.2,1-2.2,2.2-2.2H237.2z M237.2,182.5v-12.7h-6.5v12.7H237.2z"/>
			<path fill="#FF0000" d="M237.2,185.2h-6.5c-1.5,0-2.7-1.2-2.7-2.7v-12.7c0-1.5,1.2-2.7,2.7-2.7h6.5c1.5,0,2.7,1.2,2.7,2.7v12.7
				C239.9,184,238.7,185.2,237.2,185.2z M230.7,168c-0.9,0-1.7,0.8-1.7,1.7v12.7c0,1,0.7,1.7,1.7,1.7h6.5c1,0,1.7-0.7,1.7-1.7v-12.7
				c0-0.9-0.8-1.7-1.7-1.7H230.7z M237.7,183h-7.5v-13.7h7.5V183z M231.2,182h5.5v-11.7h-5.5V182z"/>
		</g>
		<g>
			<path fill="#E81929" d="M253,167.5c1.2,0,2.2,1,2.2,2.2v12.7c0,1.2-0.9,2.2-2.2,2.2h-6.5c-1.3,0-2.2-1-2.2-2.2v-12.7
				c0-1.2,1-2.2,2.2-2.2H253z M253,182.5v-12.7h-6.5v12.7H253z"/>
			<path fill="#FF0000" d="M253,185.2h-6.5c-1.5,0-2.7-1.2-2.7-2.7v-12.7c0-1.5,1.2-2.7,2.7-2.7h6.5c1.5,0,2.7,1.2,2.7,2.7v12.7
				C255.7,184,254.6,185.2,253,185.2z M246.6,168c-0.9,0-1.7,0.8-1.7,1.7v12.7c0,1,0.7,1.7,1.7,1.7h6.5c1,0,1.7-0.7,1.7-1.7v-12.7
				c0-0.9-0.8-1.7-1.7-1.7H246.6z M253.5,183h-7.5v-13.7h7.5V183z M247.1,182h5.5v-11.7h-5.5V182z"/>
		</g>
	</g>
</g>
</svg>
