<?xml version="1.0" encoding="utf-8"?>
<!-- Generator: Adobe Illustrator 18.1.1, SVG Export Plug-In . SVG Version: 6.00 Build 0)  -->
<svg version="1.1" id="Layer_1" xmlns="http://www.w3.org/2000/svg" xmlns:xlink="http://www.w3.org/1999/xlink" x="0px" y="0px"
	 viewBox="0 0 205.8 240.5" enable-background="new 0 0 205.8 240.5" xml:space="preserve">
<g display="none">
	<g display="inline">
		<linearGradient id="SVGID_1_" gradientUnits="userSpaceOnUse" x1="20.5246" y1="113.068" x2="155.5246" y2="113.068">
			<stop  offset="0" style="stop-color:#0F264E"/>
			<stop  offset="1" style="stop-color:#1A6583"/>
		</linearGradient>
		<path fill="url(#SVGID_1_)" d="M155.5,203.1h-135v-180h135V203.1z M25.5,198.1h125v-170h-125V198.1z"/>
	</g>
	<linearGradient id="SVGID_2_" gradientUnits="userSpaceOnUse" x1="47.5246" y1="138.068" x2="180.5246" y2="138.068">
		<stop  offset="0" style="stop-color:#0F264E"/>
		<stop  offset="1" style="stop-color:#1A6583"/>
	</linearGradient>
	<polygon display="inline" fill="url(#SVGID_2_)" points="180.5,55.1 180.5,221.1 47.5,221.1 47.5,201.1 153.5,201.1 153.5,55.1 	
		"/>
	<g display="inline">
		<g>
			<linearGradient id="SVGID_3_" gradientUnits="userSpaceOnUse" x1="38.5246" y1="46.568" x2="140.5246" y2="46.568">
				<stop  offset="0" style="stop-color:#0F264E"/>
				<stop  offset="1" style="stop-color:#1A6583"/>
			</linearGradient>
			<rect x="38.5" y="44.1" fill="url(#SVGID_3_)" width="102" height="5"/>
		</g>
		<g>
			<linearGradient id="SVGID_4_" gradientUnits="userSpaceOnUse" x1="38.5246" y1="57.568" x2="72.5246" y2="57.568">
				<stop  offset="0" style="stop-color:#0F264E"/>
				<stop  offset="1" style="stop-color:#1A6583"/>
			</linearGradient>
			<rect x="38.5" y="55.1" fill="url(#SVGID_4_)" width="34" height="5"/>
		</g>
		<g>
			<linearGradient id="SVGID_5_" gradientUnits="userSpaceOnUse" x1="36.5246" y1="133.568" x2="101.5246" y2="133.568">
				<stop  offset="0" style="stop-color:#0F264E"/>
				<stop  offset="1" style="stop-color:#1A6583"/>
			</linearGradient>
			<rect x="36.5" y="131.1" fill="url(#SVGID_5_)" width="65" height="5"/>
		</g>
		<g>
			<linearGradient id="SVGID_6_" gradientUnits="userSpaceOnUse" x1="36.5246" y1="142.568" x2="101.5246" y2="142.568">
				<stop  offset="0" style="stop-color:#0F264E"/>
				<stop  offset="1" style="stop-color:#1A6583"/>
			</linearGradient>
			<rect x="36.5" y="140.1" fill="url(#SVGID_6_)" width="65" height="5"/>
		</g>
		<g>
			<linearGradient id="SVGID_7_" gradientUnits="userSpaceOnUse" x1="36.5246" y1="152.568" x2="101.5246" y2="152.568">
				<stop  offset="0" style="stop-color:#0F264E"/>
				<stop  offset="1" style="stop-color:#1A6583"/>
			</linearGradient>
			<rect x="36.5" y="150.1" fill="url(#SVGID_7_)" width="65" height="5"/>
		</g>
		<g>
			<linearGradient id="SVGID_8_" gradientUnits="userSpaceOnUse" x1="36.5246" y1="175.568" x2="145.5246" y2="175.568">
				<stop  offset="0" style="stop-color:#0F264E"/>
				<stop  offset="1" style="stop-color:#1A6583"/>
			</linearGradient>
			<rect x="36.5" y="173.1" fill="url(#SVGID_8_)" width="109" height="5"/>
		</g>
		<g>
			<linearGradient id="SVGID_9_" gradientUnits="userSpaceOnUse" x1="36.5246" y1="185.568" x2="101.5246" y2="185.568">
				<stop  offset="0" style="stop-color:#0F264E"/>
				<stop  offset="1" style="stop-color:#1A6583"/>
			</linearGradient>
			<rect x="36.5" y="183.1" fill="url(#SVGID_9_)" width="65" height="5"/>
		</g>
	</g>
	<g display="inline">
		<rect x="110" y="81.1" fill="#E81929" width="15.7" height="74.8"/>
		<rect x="129.4" y="118.5" fill="#E81929" width="15.7" height="37.4"/>
	</g>
	<g display="inline">
		<path fill="#E81929" d="M89.6,104.5c-3.3,12.3-15.9,19.7-28.2,16.5C49,117.7,41.7,105.1,45,92.7c3.2-12.2,15.4-19.7,28-16.5
			l-5.9,22.3l20-12C90.2,91.8,91.3,98.2,89.6,104.5z"/>
		<path fill="#E81929" d="M90.8,81.9L70.5,93.6l5.8-22l0.9,0.2C83.2,73.4,87.8,77,90.8,81.9z"/>
	</g>
</g>
<g>
	<g>
		<g>
			<path fill="#FFFFFF" d="M203,113.1L79.6,235.6l-5.1-5.1c0.1-0.1,0.3-0.3,0.4-0.4c3.7-3.7,3.7-9.7,0.1-13.4
				c-3.7-3.7-9.7-3.7-13.4-0.1c-0.1,0.1-0.3,0.3-0.4,0.4l-9.4-9.5c0.1-0.1,0.3-0.3,0.4-0.4c3.7-3.7,3.7-9.7,0.1-13.4
				c-3.7-3.7-9.7-3.7-13.4-0.1c-0.1,0.1-0.3,0.3-0.4,0.4l-9.2-9.3c0.4-0.4,0.2-0.2,0.3-0.3c0.1-0.1,0.2-0.2,0.3-0.3
				c0,0,0.1-0.1,0.1-0.1c0.1-0.1,0.2-0.2,0.2-0.3c0.1-0.1,0.1-0.2,0.2-0.3c0.1-0.1,0.1-0.1,0.2-0.2c0.1-0.1,0.1-0.2,0.2-0.3
				c0.1-0.1,0.2-0.2,0.2-0.4c0,0,0,0,0-0.1c0.1-0.1,0.1-0.2,0.2-0.4c0.2-0.3,0.3-0.6,0.4-0.9c1.4-3.4,0.8-7.5-2-10.3
				c-2-2-4.6-2.9-7.2-2.7c-0.8,0-1.5,0.2-2.2,0.4c-1.2,0.4-2.3,0.9-3.3,1.7c-0.2,0.2-0.5,0.4-0.7,0.6c-0.1,0.1,0.1-0.1-0.3,0.3
				l-5.1-5.1L134.3,43.9l5.1,5.1c-3.7,3.7-3.7,9.7-0.1,13.4c3.7,3.7,9.7,3.7,13.4,0.1l10,10.1c-3.7,3.7-3.7,9.7-0.1,13.4
				c3.7,3.7,9.7,3.7,13.4,0.1l8.6,8.7c-3.7,3.7-3.7,9.7-0.1,13.4c3.7,3.7,9.7,3.7,13.4,0.1L203,113.1z"/>
			
				<linearGradient id="SVGID_10_" gradientUnits="userSpaceOnUse" x1="53.5939" y1="176.1538" x2="155.1672" y2="176.1538" gradientTransform="matrix(0.7044 0.7098 -0.7098 0.7044 158.4346 -58.421)">
				<stop  offset="0" style="stop-color:#0F264E"/>
				<stop  offset="1" style="stop-color:#1A6583"/>
			</linearGradient>
			<path fill="url(#SVGID_10_)" d="M79.6,238.5l-8-8l1.6-1.4c0.1-0.1,0.2-0.2,0.3-0.3c2.9-2.9,2.9-7.6,0-10.5
				c-1.4-1.4-3.3-2.2-5.3-2.2c-2,0-3.8,0.8-5.3,2.2c-0.1,0.1-0.2,0.2-0.3,0.3l-1.4,1.6l-12.4-12.5l1.6-1.4c0.1-0.1,0.2-0.2,0.3-0.3
				c2.9-2.9,2.9-7.6,0-10.5c-1.4-1.4-3.3-2.2-5.3-2.2c-2,0-3.8,0.8-5.3,2.2c-0.1,0.1-0.2,0.2-0.3,0.3l-1.4,1.6l-12.1-12.2l1.5-1.4
				c0.1-0.1,0.2-0.2,0.3-0.3l0,0c0.1-0.1,0.2-0.2,0.2-0.3l0.1-0.1c0,0,0.1-0.1,0.1-0.1l0-0.1c0.1-0.1,0.1-0.1,0.1-0.2l0-0.1
				c0,0,0.1-0.1,0.1-0.1l0-0.1c0,0,0-0.1,0.1-0.1l0.1-0.1c0.1-0.1,0.1-0.1,0.1-0.2c0.1-0.1,0.1-0.2,0.2-0.3l0-0.1
				c0.1-0.2,0.2-0.4,0.3-0.6c1.2-2.8,0.6-6-1.5-8.2c-1.5-1.5-3.5-2.3-5.7-2.2c-0.6,0-1.2,0.1-1.8,0.3c-1,0.3-1.8,0.8-2.6,1.4
				c-0.2,0.2-0.4,0.3-0.6,0.5l0,0c-0.1,0.1-0.2,0.2-0.3,0.3l-1.4,1.4l-7.9-8L134.3,41l7.9,7.9l-1.4,1.4c-2.9,2.9-2.9,7.6,0,10.6
				c1.4,1.4,3.3,2.2,5.3,2.2c2,0,3.8-0.8,5.3-2.2l1.4-1.4l12.8,12.9l-1.4,1.4c-1.4,1.4-2.2,3.3-2.2,5.3c0,2,0.8,3.9,2.2,5.3
				c1.4,1.4,3.3,2.2,5.3,2.2c2,0,3.8-0.8,5.3-2.2l1.4-1.4l11.4,11.5L186,96c-1.4,1.4-2.2,3.3-2.2,5.3c0,2,0.8,3.9,2.2,5.3
				c1.4,1.4,3.3,2.2,5.3,2.2c2,0,3.8-0.8,5.3-2.2l1.4-1.4l7.9,7.9L79.6,238.5z M77.3,230.5l2.3,2.3l120.6-119.7l-2.3-2.4
				c-1.9,1.3-4.2,2-6.5,2c-3.1,0-6-1.2-8.1-3.4c-2.2-2.2-3.3-5.1-3.3-8.1c0-2.4,0.7-4.7,2.1-6.6l-6-6.1c-1.9,1.3-4.2,2-6.5,2
				c-3.1,0-6-1.2-8.1-3.4c-2.2-2.2-3.3-5.1-3.3-8.1c0-2.4,0.7-4.7,2.1-6.6l-7.4-7.5c-1.9,1.3-4.2,2-6.5,2c-3.1,0-6-1.2-8.1-3.4
				c-4-4-4.4-10.2-1.2-14.7l-2.3-2.4L13.7,166.4l2.3,2.3c1.1-0.8,2.3-1.4,3.6-1.8c0.8-0.3,1.8-0.4,2.7-0.5c0.2,0,0.4,0,0.6,0
				c3.1,0,6,1.2,8.1,3.3c3.3,3.3,4.2,8.2,2.4,12.5c-0.1,0.3-0.3,0.7-0.5,1c-0.1,0.2-0.2,0.3-0.3,0.5l0,0.1c-0.1,0.1-0.2,0.3-0.3,0.4
				c-0.1,0.1-0.2,0.2-0.2,0.3c-0.1,0.1-0.1,0.2-0.2,0.3c0,0,0,0,0,0l6.5,6.6c2-1.5,4.4-2.4,7-2.4c3.1,0,6,1.2,8.1,3.4
				c4.1,4.1,4.4,10.7,0.9,15.2l6.7,6.7c2-1.5,4.4-2.4,7-2.4c3.1,0,6,1.2,8.1,3.4C80.5,219.5,80.8,226,77.3,230.5z"/>
		</g>
		<g>
			
				<linearGradient id="SVGID_11_" gradientUnits="userSpaceOnUse" x1="55.3152" y1="131.6797" x2="153.4452" y2="131.6797" gradientTransform="matrix(0.7044 0.7098 -0.7098 0.7044 158.4346 -58.421)">
				<stop  offset="0" style="stop-color:#0F264E"/>
				<stop  offset="1" style="stop-color:#1A6583"/>
			</linearGradient>
			<polygon fill="url(#SVGID_11_)" points="171.6,144.7 102.5,75 105.4,72.2 174.5,141.8 			"/>
		</g>
		<g>
			
				<rect x="64.8" y="112.8" transform="matrix(0.7044 0.7098 -0.7098 0.7044 135.6076 -21.6276)" fill="#E81929" width="57.9" height="78.4"/>
		</g>
	</g>
	<g>
		<g>
			<path fill="#FFFFFF" d="M184.5,62.7l-103.1,140l-5.8-4.3c0.1-0.1,0.2-0.3,0.4-0.5c3.1-4.2,2.2-10.1-2-13.2
				c-4.2-3.1-10.1-2.2-13.2,2c-0.1,0.2-0.2,0.3-0.3,0.5l-10.8-7.9c0.1-0.1,0.2-0.3,0.4-0.5c3.1-4.2,2.2-10.1-2-13.2
				c-4.2-3.1-10.1-2.2-13.2,2c-0.1,0.2-0.2,0.3-0.3,0.5l-10.5-7.8c0.3-0.5,0.2-0.3,0.3-0.3c0.1-0.1,0.2-0.2,0.2-0.3
				c0,0,0.1-0.1,0.1-0.2c0.1-0.1,0.1-0.2,0.2-0.3c0.1-0.1,0.1-0.2,0.2-0.3c0-0.1,0.1-0.2,0.1-0.2c0.1-0.1,0.1-0.2,0.1-0.3
				c0.1-0.1,0.1-0.3,0.2-0.4c0,0,0,0,0-0.1c0.1-0.1,0.1-0.3,0.1-0.4c0.1-0.3,0.2-0.6,0.3-0.9c0.9-3.6-0.4-7.6-3.5-9.9
				c-2.2-1.6-5-2.1-7.5-1.6c-0.7,0.2-1.5,0.4-2.2,0.7c-1.1,0.5-2.1,1.3-3,2.2c-0.2,0.2-0.4,0.5-0.6,0.7c-0.1,0.1,0.1-0.1-0.3,0.3
				l-5.8-4.3l103.1-140l5.8,4.3c-3.1,4.2-2.2,10.1,2,13.2s10.1,2.2,13.2-2l11.4,8.4c-3.1,4.2-2.2,10.1,2,13.2
				c4.2,3.1,10.1,2.2,13.2-2l9.8,7.2c-3.1,4.2-2.2,10.1,2,13.2c4.2,3.1,10.1,2.2,13.2-2L184.5,62.7z"/>
			
				<linearGradient id="SVGID_12_" gradientUnits="userSpaceOnUse" x1="15.2923" y1="115.3114" x2="116.8658" y2="115.3114" gradientTransform="matrix(0.8053 0.5929 -0.5929 0.8053 108.7965 -28.2859)">
				<stop  offset="0" style="stop-color:#0F264E"/>
				<stop  offset="1" style="stop-color:#1A6583"/>
			</linearGradient>
			<path fill="url(#SVGID_12_)" d="M81.8,205.5l-9.1-6.7l1.4-1.6c0.1-0.1,0.2-0.2,0.3-0.4c1.2-1.6,1.7-3.6,1.4-5.5
				c-0.3-2-1.3-3.7-3-4.9c-1.3-1-2.8-1.5-4.4-1.5c-2.4,0-4.6,1.1-6,3c-0.1,0.1-0.2,0.2-0.3,0.4l-1.2,1.8l-14.2-10.5L48,178
				c0.1-0.1,0.2-0.2,0.3-0.4c1.2-1.6,1.7-3.6,1.4-5.5c-0.3-2-1.3-3.7-3-4.9c-1.3-1-2.8-1.5-4.4-1.5c-2.4,0-4.6,1.1-6,3
				c-0.1,0.1-0.2,0.2-0.3,0.4l-1.2,1.8L21,160.7l1.2-1.6c0.1-0.1,0.2-0.2,0.2-0.3l0,0c0.1-0.1,0.1-0.2,0.2-0.3l0.1-0.2
				c0-0.1,0.1-0.1,0.1-0.1l0-0.1c0-0.1,0.1-0.1,0.1-0.2l0-0.1c0,0,0-0.1,0.1-0.1l0-0.1c0-0.1,0.1-0.1,0.1-0.1l0.1-0.2
				c0-0.1,0.1-0.2,0.1-0.2c0.1-0.1,0.1-0.2,0.1-0.3l0-0.1c0.1-0.2,0.1-0.5,0.2-0.7c0.7-3-0.4-6-2.8-7.8c-1.3-0.9-2.8-1.4-4.4-1.4
				c-0.5,0-1.1,0.1-1.6,0.2c-0.6,0.1-1.2,0.3-1.7,0.6c-0.9,0.4-1.7,1-2.4,1.8c-0.2,0.2-0.3,0.4-0.5,0.6l0,0
				c-0.1,0.1-0.2,0.2-0.2,0.3L9,151.9l-9-6.7L105.5,2l9,6.6l-1.2,1.6c-2.4,3.3-1.7,8,1.6,10.4c1.3,1,2.8,1.5,4.4,1.5
				c2.4,0,4.6-1.1,6-3l1.2-1.6l14.7,10.8l-1.2,1.6c-2.4,3.3-1.7,8,1.6,10.4c1.3,1,2.8,1.5,4.4,1.5c2.4,0,4.6-1.1,6-3l1.2-1.6
				l13.1,9.6l-1.2,1.6c-2.4,3.3-1.7,8,1.6,10.4c1.3,1,2.8,1.5,4.4,1.5c2.4,0,4.6-1.1,6-3l1.2-1.6l9,6.6L81.8,205.5z M78.3,197.9
				l2.6,1.9L181.7,63.1l-2.7-2c-2.1,2-5,3.2-7.9,3.2c-2.5,0-4.8-0.8-6.8-2.2c-4.5-3.3-5.9-9.4-3.5-14.3l-6.9-5.1
				c-2.1,2-5,3.2-7.9,3.2c-2.5,0-4.8-0.8-6.8-2.2c-4.5-3.3-5.9-9.4-3.5-14.3l-8.5-6.2c-2.1,2-5,3.2-7.9,3.2c-2.5,0-4.8-0.8-6.8-2.2
				c-4.5-3.3-5.9-9.4-3.5-14.3l-2.7-2L5.6,144.4l2.6,1.9c0.9-1,2.1-1.8,3.3-2.4c0.8-0.4,1.7-0.7,2.6-0.9c0.8-0.2,1.6-0.3,2.4-0.3
				c2.4,0,4.8,0.8,6.7,2.2c3.7,2.7,5.4,7.4,4.3,12c-0.1,0.4-0.2,0.7-0.3,1.1c-0.1,0.2-0.1,0.3-0.2,0.5l0,0.1
				c-0.1,0.2-0.1,0.3-0.2,0.5c-0.1,0.1-0.1,0.3-0.2,0.4c0,0.1-0.1,0.2-0.2,0.3c0,0,0,0,0,0l7.4,5.5c2.2-2.3,5.2-3.6,8.3-3.6
				c2.5,0,4.8,0.8,6.8,2.2c4.7,3.5,6,9.9,3.2,14.8l7.7,5.6c2.2-2.3,5.2-3.6,8.3-3.6c2.5,0,4.8,0.8,6.8,2.2c2.5,1.8,4.1,4.5,4.5,7.5
				C80,193.2,79.6,195.7,78.3,197.9z"/>
		</g>
		<g>
			
				<linearGradient id="SVGID_13_" gradientUnits="userSpaceOnUse" x1="17.014" y1="70.8371" x2="115.144" y2="70.8371" gradientTransform="matrix(0.8053 0.5929 -0.5929 0.8053 108.7965 -28.2859)">
				<stop  offset="0" style="stop-color:#0F264E"/>
				<stop  offset="1" style="stop-color:#1A6583"/>
			</linearGradient>
			<polygon fill="url(#SVGID_13_)" points="158.3,98.6 79.3,40.5 81.7,37.2 160.7,95.4 			"/>
		</g>
		<g>
			
				<rect x="53.6" y="78.7" transform="matrix(0.8053 0.5929 -0.5929 0.8053 85.9678 -25.966)" fill="#E81929" width="57.9" height="78.4"/>
		</g>
	</g>
</g>
</svg>
