{
    "fields": {
        "rfc": {
            "type": "text",
            "required": false,
            "rows": 4,
            "lengthOfCut": 400,
            "maxLength": 20,
            "seeMoreDisabled": false,
            "readOnly": false,
            "tooltip": false,
            "isCustom": true
        },
        "metodoDePago": {
            "type": "text",
            "required": false,
            "rows": 4,
            "lengthOfCut": 400,
            "seeMoreDisabled": false,
            "readOnly": false,
            "tooltip": false,
            "isCustom": true
        },
        "formaDePago": {
            "type": "text",
            "required": false,
            "rows": 4,
            "lengthOfCut": 400,
            "seeMoreDisabled": false,
            "readOnly": false,
            "tooltip": false,
            "isCustom": true
        },
        "usoDeCFDI": {
            "type": "text",
            "required": false,
            "rows": 4,
            "lengthOfCut": 400,
            "seeMoreDisabled": false,
            "readOnly": false,
            "tooltip": false,
            "isCustom": true
        },
        "informacionCuentasPorPagar": {
            "type": "text",
            "required": false,
            "rows": 4,
            "lengthOfCut": 400,
            "seeMoreDisabled": false,
            "readOnly": false,
            "tooltip": false,
            "isCustom": true
        },
        "templates": {
            "type": "linkMultiple",
            "layoutDetailDisabled": false,
            "layoutListDisabled": true,
            "layoutMassUpdateDisabled": false,
            "importDisabled": false,
            "noLoad": false,
            "isCustom": true
        },
        "tecnologiass": {
            "type": "linkMultiple",
            "layoutDetailDisabled": false,
            "layoutListDisabled": true,
            "layoutMassUpdateDisabled": false,
            "noLoad": false,
            "importDisabled": false,
            "isCustom": true
        },
        "solucioness": {
            "type": "linkMultiple",
            "layoutDetailDisabled": false,
            "layoutListDisabled": true,
            "layoutMassUpdateDisabled": false,
            "noLoad": false,
            "importDisabled": false,
            "isCustom": true
        },
        "soluciones": {
            "type": "linkMultiple",
            "layoutDetailDisabled": false,
            "layoutListDisabled": true,
            "layoutMassUpdateDisabled": false,
            "importDisabled": false,
            "noLoad": false,
            "isCustom": true
        },
        "razonSocial": {
            "type": "text",
            "required": false,
            "rows": 4,
            "lengthOfCut": 400,
            "maxLength": 255,
            "seeMoreDisabled": false,
            "readOnly": false,
            "tooltip": false,
            "isCustom": true
        },
        "parqueinds": {
            "type": "array",
            "required": false,
            "noEmptyString": false,
            "options": [
                "Pacifico",
                "TIP",
                "Bellas Artes",
                "Otay Industrial",
                "La Mesa",
                "Maran",
                "Los Pinos",
                "Las Brisas"
            ],
            "audited": false,
            "readOnly": false,
            "tooltip": false,
            "isCustom": true
        },
        "type": {
            "options": [
                "",
                "Customer",
                "Investor",
                "Partner",
                "Reseller",
                "Interno"
            ],
            "style": {
                "": null,
                "Customer": null,
                "Investor": null,
                "Partner": null,
                "Reseller": null,
                "Interno": null
            }
        },
        "institutionalDiscount": {
            "type": "varchar",
            "trim": true,
            "options": [],
            "isCustom": true
        },
        "billingEmail": {
            "type": "varchar",
            "trim": true,
            "options": [],
            "isCustom": true
        },
        "termsAdvancePercent": {
            "type": "varchar",
            "trim": true,
            "options": [],
            "isCustom": true
        },
        "termsDeliveryPercent": {
            "type": "varchar",
            "trim": true,
            "options": [],
            "isCustom": true
        },
        "termsInstalationPercent": {
            "type": "varchar",
            "trim": true,
            "options": [],
            "isCustom": true
        },
        "termsAdvanceDays": {
            "type": "varchar",
            "trim": true,
            "options": [],
            "isCustom": true
        },
        "termsDeliveryDays": {
            "type": "varchar",
            "trim": true,
            "options": [],
            "isCustom": true
        },
        "termsInstalationDays": {
            "type": "varchar",
            "trim": true,
            "options": [],
            "isCustom": true
        },
        "deliveryDays": {
            "type": "checklist",
            "storeArrayValues": true,
            "options": [
                "Lunes",
                "Martes",
                "Miercoles",
                "Jueves",
                "Viernes"
            ],
            "isCustom": true
        },
        "partialDeliveries": {
            "type": "checklist",
            "storeArrayValues": true,
            "options": [
                "Si"
            ],
            "isCustom": true
        },
        "deliverySchedules": {
            "type": "array",
            "storeArrayValues": true,
            "options": false,
            "isCustom": true
        },
        "iva": {
            "type": "varchar",
            "trim": true,
            "options": [],
            "isCustom": true,
            "tooltip": true
        },
        "logo": {
            "type": "image",
            "previewSize": "small",
            "isCustom": true
        }
    },
    "links": {
        "templates": {
            "type": "hasMany",
            "relationName": "templateAccount",
            "foreign": "accounts",
            "entity": "Template",
            "audited": false,
            "isCustom": true
        },
        "tecnologiass": {
            "type": "hasMany",
            "foreign": "account",
            "entity": "Tecnologias",
            "audited": false,
            "isCustom": true
        },
        "solucioness": {
            "type": "hasMany",
            "foreign": "account",
            "entity": "Soluciones",
            "audited": false,
            "isCustom": true
        },
        "soluciones": {
            "type": "hasMany",
            "relationName": "solucionesAccount",
            "foreign": "accounts",
            "entity": "Soluciones",
            "audited": false,
            "isCustom": true
        },
        "logo": {
            "type": "belongsTo",
            "entity": "Attachment",
            "skipOrmDefs": true,
            "disabled": true
        }
    }
}