{
    "fields": {
        "fup": {
            "type": "text",
            "required": false,
            "rows": 4,
            "lengthOfCut": 400,
            "seeMoreDisabled": false,
            "readOnly": false,
            "tooltip": false,
            "isCustom": true
        },
        "stage": {
            "options": [
                "Prospecting",
                "Qualification",
                "Needs Analysis",
                "Value Proposition",
                "Id. Decision Makers",
                "Perception Analysis",
                "Proposal/Price Quote",
                "Customer Interest / Modification",
                "Negotiation/Review",
                "Closed Won",
                "Closed Lost"
            ],
            "probabilityMap": {
                "Prospecting": 10,
                "Qualification": 10,
                "Needs Analysis": 20,
                "Value Proposition": 50,
                "Id. Decision Makers": 60,
                "Perception Analysis": 70,
                "Proposal/Price Quote": 75,
                "Customer Interest / Modification": 80,
                "Negotiation/Review": 90,
                "Closed Won": 100,
                "Closed Lost": 0
            },
            "fieldManagerAdditionalParamList": [
                {
                    "name": "probabilityMap",
                    "view": "crm:views/opportunity/admin/field-manager/fields/probability-map"
                }
            ],
            "required": false,
            "isSorted": false,
            "readOnly": false,
            "tooltip": false
        },
        "assignedUser": {
            "audited": false,
            "readOnly": false,
            "tooltip": false
        },
        "usuariosAsignados": {
            "type": "varchar",
            "required": false,
            "trim": true,
            "audited": false,
            "readOnly": false,
            "tooltip": false,
            "isCustom": true
        },
        "fob": {
            "type": "varchar",
            "trim": true,
            "options": [],
            "isCustom": true,
            "required": true
        },
        "iva": {
            "type": "varchar",
            "trim": true,
            "options": [],
            "isCustom": true
        },
        "deliveryTime": {
            "type": "varchar",
            "trim": true,
            "options": [],
            "isCustom": true,
            "required": true
        },
        "termsDeliveryPercent": {
            "type": "varchar",
            "trim": true,
            "options": [],
            "isCustom": true
        },
        "termsAdvancePercent": {
            "type": "varchar",
            "trim": true,
            "options": [],
            "isCustom": true
        },
        "termsInstalationPercent": {
            "type": "varchar",
            "trim": true,
            "options": [],
            "isCustom": true
        },
        "termsAdvanceDays": {
            "type": "varchar",
            "trim": true,
            "options": [],
            "isCustom": true
        },
        "termsDeliveryDays": {
            "type": "varchar",
            "trim": true,
            "options": [],
            "isCustom": true
        },
        "termsInstalationDays": {
            "type": "varchar",
            "trim": true,
            "options": [],
            "isCustom": true
        },
        "deliveryDays": {
            "type": "checklist",
            "storeArrayValues": true,
            "options": [
                "Lunes",
                "Martes",
                "Miercoles",
                "Jueves",
                "Viernes"
            ],
            "isCustom": true
        },
        "partialDeliveries": {
            "type": "checklist",
            "storeArrayValues": true,
            "options": [
                "Si"
            ],
            "isCustom": true
        },
        "generalTerms": {
            "type": "checklist",
            "storeArrayValues": true,
            "options": [
                "Si"
            ],
            "isCustom": true
        },
        "useGeneralIva": {
            "type": "checklist",
            "storeArrayValues": true,
            "options": [
                "Si"
            ],
            "isCustom": true
        },
        "account": {
            "required": true
        },
        "contact": {
            "required": true
        },
        "contacts": {
            "required": true
        }
    },
    "collection": {
        "sortBy": "createdAt",
        "asc": false,
        "textFilterFields": [
            "name"
        ]
    }
}