<?xml version="1.0" encoding="UTF-8" standalone="no"?>
<!DOCTYPE svg PUBLIC "-//W3C//DTD SVG 1.1//EN"
 "http://www.w3.org/Graphics/SVG/1.1/DTD/svg11.dtd">
<!-- Generated by graphviz version 11.0.0 (20240428.1522)
 -->
<!-- Title: Domain_PTP Pages: 1 -->
<svg width="2045pt" height="320pt"
 viewBox="0.00 0.00 2045.00 319.50" xmlns="http://www.w3.org/2000/svg" xmlns:xlink="http://www.w3.org/1999/xlink">
<g id="graph0" class="graph" transform="scale(1 1) rotate(0) translate(4 315.5)">
<title>Domain_PTP</title>
<polygon fill="white" stroke="none" points="-4,4 -4,-315.5 2041,-315.5 2041,4 -4,4"/>
<g id="clust1" class="cluster">
<title>cluster_18</title>
<g id="a_clust1"><a xlink:title="Domain 18">
<polygon fill="none" stroke="black" points="8,-8 8,-155.75 2029,-155.75 2029,-8 8,-8"/>
<text text-anchor="middle" x="1018.5" y="-138.45" font-family="Times New Roman,serif" font-size="14.00">Domain 18</text>
</a>
</g>
</g>
<g id="clust2" class="cluster">
<title>cluster_grandmasters</title>
<g id="a_clust2"><a xlink:title="Grandmasters">
<polygon fill="none" stroke="black" points="951,-227.75 951,-303.5 1259,-303.5 1259,-227.75 951,-227.75"/>
<text text-anchor="middle" x="1105" y="-286.2" font-family="Times New Roman,serif" font-size="14.00">Grandmasters</text>
</a>
</g>
</g>
<!-- site42&#45;rtr8 -->
<g id="node1" class="node">
<title>site42&#45;rtr8</title>
<g id="a_node1"><a xlink:title="Local Clock Identity: 52:f2:0e:ff:ff:d2:e6:32&#10;PTP Domain: 18&#10;Local Clock Priority1: 128&#10;Local Clock Priority2: 128&#10;Steps Removed: 2&#10;Mode: boundary&#10;Local Clock Source IP: 192.168.0.11&#10;Mean Path Delay: 6&#10;Offset From Master: None&#10;Parent Clock Identity: 2b:fe:52:ff:ff:76:ae:d9&#10;Parent Clock IP Address: 192.168.0.224&#10;Grandmaster Clock Identity: 8c:f6:39:ff:fe:8a:d3:36&#10;Grandmaster Clock Priority1: 1&#10;Grandmaster Clock Priority2: 1">
<ellipse fill="none" stroke="black" cx="64" cy="-34" rx="48.07" ry="18"/>
<text text-anchor="middle" x="64" y="-28.57" font-family="Times New Roman,serif" font-size="14.00">site42&#45;rtr8</text>
</a>
</g>
</g>
<!-- site42&#45;rtr6 -->
<g id="node2" class="node">
<title>site42&#45;rtr6</title>
<g id="a_node2"><a xlink:title="Local Clock Identity: fa:86:3e:ff:ff:eb:90:45&#10;PTP Domain: 18&#10;Local Clock Priority1: 128&#10;Local Clock Priority2: 128&#10;Steps Removed: 2&#10;Mode: boundary&#10;Local Clock Source IP: 192.168.0.209&#10;Mean Path Delay: 1389&#10;Offset From Master: None&#10;Parent Clock Identity: 2b:fe:52:ff:ff:76:ae:d9&#10;Parent Clock IP Address: 192.168.0.224&#10;Grandmaster Clock Identity: 8c:f6:39:ff:fe:8a:d3:36&#10;Grandmaster Clock Priority1: 1&#10;Grandmaster Clock Priority2: 1">
<ellipse fill="none" stroke="black" cx="178" cy="-34" rx="48.07" ry="18"/>
<text text-anchor="middle" x="178" y="-28.57" font-family="Times New Roman,serif" font-size="14.00">site42&#45;rtr6</text>
</a>
</g>
</g>
<!-- site42&#45;rtr7 -->
<g id="node3" class="node">
<title>site42&#45;rtr7</title>
<g id="a_node3"><a xlink:title="Local Clock Identity: 2b:fe:52:ff:ff:76:ae:d9&#10;PTP Domain: 18&#10;Local Clock Priority1: 128&#10;Local Clock Priority2: 128&#10;Steps Removed: 1&#10;Mode: boundary&#10;Local Clock Source IP: 192.168.0.224&#10;Mean Path Delay: 19&#10;Offset From Master: None&#10;Parent Clock Identity: 8c:f6:39:ff:fe:8a:d3:36&#10;Parent Clock IP Address: 192.168.0.145&#10;Grandmaster Clock Identity: 8c:f6:39:ff:fe:8a:d3:36&#10;Grandmaster Clock Priority1: 1&#10;Grandmaster Clock Priority2: 1">
<ellipse fill="none" stroke="black" cx="1027" cy="-106" rx="48.07" ry="18"/>
<text text-anchor="middle" x="1027" y="-100.58" font-family="Times New Roman,serif" font-size="14.00">site42&#45;rtr7</text>
</a>
</g>
</g>
<!-- site42&#45;rtr7&#45;&gt;site42&#45;rtr8 -->
<g id="edge1" class="edge">
<title>site42&#45;rtr7&#45;&gt;site42&#45;rtr8</title>
<g id="a_edge1"><a xlink:title="site42&#45;rtr7 &#45;&gt; site42&#45;rtr8">
<path fill="none" stroke="black" d="M978.99,-103.66C816.53,-98.88 288.3,-81.43 121,-52 117.39,-51.36 113.68,-50.58 109.98,-49.7"/>
<polygon fill="black" stroke="black" points="110.99,-46.34 100.43,-47.2 109.22,-53.11 110.99,-46.34"/>
</a>
</g>
</g>
<!-- site42&#45;rtr7&#45;&gt;site42&#45;rtr6 -->
<g id="edge2" class="edge">
<title>site42&#45;rtr7&#45;&gt;site42&#45;rtr6</title>
<g id="a_edge2"><a xlink:title="site42&#45;rtr7 &#45;&gt; site42&#45;rtr6">
<path fill="none" stroke="black" d="M978.78,-105.49C854.48,-105.96 513.36,-102.17 235,-52 231.39,-51.35 227.69,-50.55 223.99,-49.66"/>
<polygon fill="black" stroke="black" points="225,-46.31 214.44,-47.15 223.22,-53.08 225,-46.31"/>
</a>
</g>
</g>
<!-- site42&#45;rtr15 -->
<g id="node4" class="node">
<title>site42&#45;rtr15</title>
<g id="a_node4"><a xlink:title="Local Clock Identity: b5:93:73:ff:ff:63:19:d7&#10;PTP Domain: 18&#10;Local Clock Priority1: 128&#10;Local Clock Priority2: 128&#10;Steps Removed: 2&#10;Mode: boundary&#10;Local Clock Source IP: 192.168.0.60&#10;Mean Path Delay: 73&#10;Offset From Master: None&#10;Parent Clock Identity: 2b:fe:52:ff:ff:76:ae:d9&#10;Parent Clock IP Address: 192.168.0.224&#10;Grandmaster Clock Identity: 8c:f6:39:ff:fe:8a:d3:36&#10;Grandmaster Clock Priority1: 1&#10;Grandmaster Clock Priority2: 1">
<ellipse fill="none" stroke="black" cx="297" cy="-34" rx="52.56" ry="18"/>
<text text-anchor="middle" x="297" y="-28.57" font-family="Times New Roman,serif" font-size="14.00">site42&#45;rtr15</text>
</a>
</g>
</g>
<!-- site42&#45;rtr7&#45;&gt;site42&#45;rtr15 -->
<g id="edge4" class="edge">
<title>site42&#45;rtr7&#45;&gt;site42&#45;rtr15</title>
<g id="a_edge4"><a xlink:title="site42&#45;rtr7 &#45;&gt; site42&#45;rtr15">
<path fill="none" stroke="black" d="M978.82,-104.28C868.38,-101.96 588.76,-92.24 359,-52 354.91,-51.28 350.7,-50.42 346.49,-49.46"/>
<polygon fill="black" stroke="black" points="347.46,-46.09 336.91,-47.11 345.79,-52.89 347.46,-46.09"/>
</a>
</g>
</g>
<!-- site42&#45;rtr4 -->
<g id="node5" class="node">
<title>site42&#45;rtr4</title>
<g id="a_node5"><a xlink:title="Local Clock Identity: 84:41:f9:ff:ff:b1:36:80&#10;PTP Domain: 18&#10;Local Clock Priority1: 128&#10;Local Clock Priority2: 128&#10;Steps Removed: 2&#10;Mode: boundary&#10;Local Clock Source IP: 192.168.0.98&#10;Mean Path Delay: 149&#10;Offset From Master: None&#10;Parent Clock Identity: 2b:fe:52:ff:ff:76:ae:d9&#10;Parent Clock IP Address: 192.168.0.224&#10;Grandmaster Clock Identity: 8c:f6:39:ff:fe:8a:d3:36&#10;Grandmaster Clock Priority1: 1&#10;Grandmaster Clock Priority2: 1">
<ellipse fill="none" stroke="black" cx="416" cy="-34" rx="48.07" ry="18"/>
<text text-anchor="middle" x="416" y="-28.57" font-family="Times New Roman,serif" font-size="14.00">site42&#45;rtr4</text>
</a>
</g>
</g>
<!-- site42&#45;rtr7&#45;&gt;site42&#45;rtr4 -->
<g id="edge5" class="edge">
<title>site42&#45;rtr7&#45;&gt;site42&#45;rtr4</title>
<g id="a_edge5"><a xlink:title="site42&#45;rtr7 &#45;&gt; site42&#45;rtr4">
<path fill="none" stroke="black" d="M979.12,-103.55C882.57,-99.94 657.92,-88.07 473,-52 469.45,-51.31 465.81,-50.49 462.16,-49.59"/>
<polygon fill="black" stroke="black" points="463.34,-46.28 452.77,-47.08 461.53,-53.04 463.34,-46.28"/>
</a>
</g>
</g>
<!-- site42&#45;rtr17 -->
<g id="node6" class="node">
<title>site42&#45;rtr17</title>
<g id="a_node6"><a xlink:title="Local Clock Identity: a8:80:9f:ff:ff:f1:63:38&#10;PTP Domain: 18&#10;Local Clock Priority1: 128&#10;Local Clock Priority2: 128&#10;Steps Removed: 2&#10;Mode: boundary&#10;Local Clock Source IP: 192.168.1.142&#10;Mean Path Delay: 73&#10;Offset From Master: None&#10;Parent Clock Identity: 2b:fe:52:ff:ff:76:ae:d9&#10;Parent Clock IP Address: 192.168.0.224&#10;Grandmaster Clock Identity: 8c:f6:39:ff:fe:8a:d3:36&#10;Grandmaster Clock Priority1: 1&#10;Grandmaster Clock Priority2: 1">
<ellipse fill="none" stroke="black" cx="535" cy="-34" rx="52.56" ry="18"/>
<text text-anchor="middle" x="535" y="-28.57" font-family="Times New Roman,serif" font-size="14.00">site42&#45;rtr17</text>
</a>
</g>
</g>
<!-- site42&#45;rtr7&#45;&gt;site42&#45;rtr17 -->
<g id="edge6" class="edge">
<title>site42&#45;rtr7&#45;&gt;site42&#45;rtr17</title>
<g id="a_edge6"><a xlink:title="site42&#45;rtr7 &#45;&gt; site42&#45;rtr17">
<path fill="none" stroke="black" d="M980.08,-101.54C900.5,-95.16 734.25,-79.6 596,-52 592.22,-51.25 588.33,-50.38 584.43,-49.44"/>
<polygon fill="black" stroke="black" points="585.53,-46.11 574.98,-47.04 583.81,-52.9 585.53,-46.11"/>
</a>
</g>
</g>
<!-- site42&#45;rtr10 -->
<g id="node7" class="node">
<title>site42&#45;rtr10</title>
<g id="a_node7"><a xlink:title="Local Clock Identity: 87:75:27:ff:ff:93:e8:a2&#10;PTP Domain: 18&#10;Local Clock Priority1: 128&#10;Local Clock Priority2: 128&#10;Steps Removed: 2&#10;Mode: boundary&#10;Local Clock Source IP: 192.168.1.196&#10;Mean Path Delay: 1035&#10;Offset From Master: None&#10;Parent Clock Identity: 2b:fe:52:ff:ff:76:ae:d9&#10;Parent Clock IP Address: 192.168.0.224&#10;Grandmaster Clock Identity: 8c:f6:39:ff:fe:8a:d3:36&#10;Grandmaster Clock Priority1: 1&#10;Grandmaster Clock Priority2: 1">
<ellipse fill="none" stroke="black" cx="658" cy="-34" rx="52.56" ry="18"/>
<text text-anchor="middle" x="658" y="-28.57" font-family="Times New Roman,serif" font-size="14.00">site42&#45;rtr10</text>
</a>
</g>
</g>
<!-- site42&#45;rtr7&#45;&gt;site42&#45;rtr10 -->
<g id="edge7" class="edge">
<title>site42&#45;rtr7&#45;&gt;site42&#45;rtr10</title>
<g id="a_edge7"><a xlink:title="site42&#45;rtr7 &#45;&gt; site42&#45;rtr10">
<path fill="none" stroke="black" d="M982.35,-98.77C922.18,-90.04 811.9,-72.88 719,-52 715.41,-51.19 711.71,-50.3 708,-49.37"/>
<polygon fill="black" stroke="black" points="708.93,-46 698.37,-46.86 707.16,-52.77 708.93,-46"/>
</a>
</g>
</g>
<!-- site42&#45;rtr14 -->
<g id="node8" class="node">
<title>site42&#45;rtr14</title>
<g id="a_node8"><a xlink:title="Local Clock Identity: 99:17:5c:ff:ff:eb:df:3e&#10;PTP Domain: 18&#10;Local Clock Priority1: 128&#10;Local Clock Priority2: 128&#10;Steps Removed: 2&#10;Mode: boundary&#10;Local Clock Source IP: 192.168.1.220&#10;Mean Path Delay: 84&#10;Offset From Master: None&#10;Parent Clock Identity: 2b:fe:52:ff:ff:76:ae:d9&#10;Parent Clock IP Address: 192.168.0.224&#10;Grandmaster Clock Identity: 8c:f6:39:ff:fe:8a:d3:36&#10;Grandmaster Clock Priority1: 1&#10;Grandmaster Clock Priority2: 1">
<ellipse fill="none" stroke="black" cx="781" cy="-34" rx="52.56" ry="18"/>
<text text-anchor="middle" x="781" y="-28.57" font-family="Times New Roman,serif" font-size="14.00">site42&#45;rtr14</text>
</a>
</g>
</g>
<!-- site42&#45;rtr7&#45;&gt;site42&#45;rtr14 -->
<g id="edge8" class="edge">
<title>site42&#45;rtr7&#45;&gt;site42&#45;rtr14</title>
<g id="a_edge8"><a xlink:title="site42&#45;rtr7 &#45;&gt; site42&#45;rtr14">
<path fill="none" stroke="black" d="M989.64,-94.37C947.33,-82.33 878.19,-62.65 831.19,-49.28"/>
<polygon fill="black" stroke="black" points="832.38,-45.98 821.8,-46.61 830.46,-52.71 832.38,-45.98"/>
</a>
</g>
</g>
<!-- site42&#45;rtr18 -->
<g id="node9" class="node">
<title>site42&#45;rtr18</title>
<g id="a_node9"><a xlink:title="Local Clock Identity: 00:04:dc:ff:ff:c9:5d:ea&#10;PTP Domain: 18&#10;Local Clock Priority1: 128&#10;Local Clock Priority2: 128&#10;Steps Removed: 2&#10;Mode: boundary&#10;Local Clock Source IP: 192.168.1.221&#10;Mean Path Delay: 145&#10;Offset From Master: None&#10;Parent Clock Identity: 2b:fe:52:ff:ff:76:ae:d9&#10;Parent Clock IP Address: 192.168.0.224&#10;Grandmaster Clock Identity: 8c:f6:39:ff:fe:8a:d3:36&#10;Grandmaster Clock Priority1: 1&#10;Grandmaster Clock Priority2: 1">
<ellipse fill="none" stroke="black" cx="904" cy="-34" rx="52.56" ry="18"/>
<text text-anchor="middle" x="904" y="-28.57" font-family="Times New Roman,serif" font-size="14.00">site42&#45;rtr18</text>
</a>
</g>
</g>
<!-- site42&#45;rtr7&#45;&gt;site42&#45;rtr18 -->
<g id="edge9" class="edge">
<title>site42&#45;rtr7&#45;&gt;site42&#45;rtr18</title>
<g id="a_edge9"><a xlink:title="site42&#45;rtr7 &#45;&gt; site42&#45;rtr18">
<path fill="none" stroke="black" d="M1001.22,-90.33C983.46,-80.22 959.62,-66.66 940,-55.49"/>
<polygon fill="black" stroke="black" points="941.91,-52.55 931.49,-50.64 938.45,-58.63 941.91,-52.55"/>
</a>
</g>
</g>
<!-- site42&#45;rtr12 -->
<g id="node10" class="node">
<title>site42&#45;rtr12</title>
<g id="a_node10"><a xlink:title="Local Clock Identity: b1:68:29:ff:ff:28:b4:65&#10;PTP Domain: 18&#10;Local Clock Priority1: 128&#10;Local Clock Priority2: 128&#10;Steps Removed: 2&#10;Mode: boundary&#10;Local Clock Source IP: 192.168.1.229&#10;Mean Path Delay: 1922&#10;Offset From Master: None&#10;Parent Clock Identity: 2b:fe:52:ff:ff:76:ae:d9&#10;Parent Clock IP Address: 192.168.0.224&#10;Grandmaster Clock Identity: 8c:f6:39:ff:fe:8a:d3:36&#10;Grandmaster Clock Priority1: 1&#10;Grandmaster Clock Priority2: 1">
<ellipse fill="none" stroke="black" cx="1027" cy="-34" rx="52.56" ry="18"/>
<text text-anchor="middle" x="1027" y="-28.57" font-family="Times New Roman,serif" font-size="14.00">site42&#45;rtr12</text>
</a>
</g>
</g>
<!-- site42&#45;rtr7&#45;&gt;site42&#45;rtr12 -->
<g id="edge10" class="edge">
<title>site42&#45;rtr7&#45;&gt;site42&#45;rtr12</title>
<g id="a_edge10"><a xlink:title="site42&#45;rtr7 &#45;&gt; site42&#45;rtr12">
<path fill="none" stroke="black" d="M1027,-87.7C1027,-80.41 1027,-71.73 1027,-63.54"/>
<polygon fill="black" stroke="black" points="1030.5,-63.62 1027,-53.62 1023.5,-63.62 1030.5,-63.62"/>
</a>
</g>
</g>
<!-- site42&#45;rtr3 -->
<g id="node11" class="node">
<title>site42&#45;rtr3</title>
<g id="a_node11"><a xlink:title="Local Clock Identity: 0a:a9:d3:ff:ff:c3:57:d9&#10;PTP Domain: 18&#10;Local Clock Priority1: 128&#10;Local Clock Priority2: 128&#10;Steps Removed: 2&#10;Mode: boundary&#10;Local Clock Source IP: 192.168.2.116&#10;Mean Path Delay: 145&#10;Offset From Master: None&#10;Parent Clock Identity: 2b:fe:52:ff:ff:76:ae:d9&#10;Parent Clock IP Address: 192.168.0.224&#10;Grandmaster Clock Identity: 8c:f6:39:ff:fe:8a:d3:36&#10;Grandmaster Clock Priority1: 1&#10;Grandmaster Clock Priority2: 1">
<ellipse fill="none" stroke="black" cx="1146" cy="-34" rx="48.07" ry="18"/>
<text text-anchor="middle" x="1146" y="-28.57" font-family="Times New Roman,serif" font-size="14.00">site42&#45;rtr3</text>
</a>
</g>
</g>
<!-- site42&#45;rtr7&#45;&gt;site42&#45;rtr3 -->
<g id="edge11" class="edge">
<title>site42&#45;rtr7&#45;&gt;site42&#45;rtr3</title>
<g id="a_edge11"><a xlink:title="site42&#45;rtr7 &#45;&gt; site42&#45;rtr3">
<path fill="none" stroke="black" d="M1051.95,-90.33C1069.16,-80.2 1092.28,-66.6 1111.29,-55.42"/>
<polygon fill="black" stroke="black" points="1112.94,-58.51 1119.78,-50.42 1109.39,-52.48 1112.94,-58.51"/>
</a>
</g>
</g>
<!-- site42&#45;rtr5 -->
<g id="node14" class="node">
<title>site42&#45;rtr5</title>
<g id="a_node14"><a xlink:title="Local Clock Identity: ee:32:30:ff:ff:22:c5:95&#10;PTP Domain: 18&#10;Local Clock Priority1: 128&#10;Local Clock Priority2: 128&#10;Steps Removed: 2&#10;Mode: boundary&#10;Local Clock Source IP: 192.168.2.141&#10;Mean Path Delay: 1084&#10;Offset From Master: None&#10;Parent Clock Identity: 2b:fe:52:ff:ff:76:ae:d9&#10;Parent Clock IP Address: 192.168.0.224&#10;Grandmaster Clock Identity: 8c:f6:39:ff:fe:8a:d3:36&#10;Grandmaster Clock Priority1: 1&#10;Grandmaster Clock Priority2: 1">
<ellipse fill="none" stroke="black" cx="1260" cy="-34" rx="48.07" ry="18"/>
<text text-anchor="middle" x="1260" y="-28.57" font-family="Times New Roman,serif" font-size="14.00">site42&#45;rtr5</text>
</a>
</g>
</g>
<!-- site42&#45;rtr7&#45;&gt;site42&#45;rtr5 -->
<g id="edge13" class="edge">
<title>site42&#45;rtr7&#45;&gt;site42&#45;rtr5</title>
<g id="a_edge13"><a xlink:title="site42&#45;rtr7 &#45;&gt; site42&#45;rtr5">
<path fill="none" stroke="black" d="M1063.66,-93.99C1103.86,-81.91 1168.51,-62.49 1212.55,-49.26"/>
<polygon fill="black" stroke="black" points="1213.53,-52.62 1222.1,-46.39 1211.52,-45.91 1213.53,-52.62"/>
</a>
</g>
</g>
<!-- site42&#45;rtr13 -->
<g id="node15" class="node">
<title>site42&#45;rtr13</title>
<g id="a_node15"><a xlink:title="Local Clock Identity: 9e:c7:0e:ff:ff:17:ad:30&#10;PTP Domain: 18&#10;Local Clock Priority1: 128&#10;Local Clock Priority2: 128&#10;Steps Removed: 2&#10;Mode: boundary&#10;Local Clock Source IP: 192.168.2.149&#10;Mean Path Delay: 873&#10;Offset From Master: None&#10;Parent Clock Identity: 2b:fe:52:ff:ff:76:ae:d9&#10;Parent Clock IP Address: 192.168.0.224&#10;Grandmaster Clock Identity: 8c:f6:39:ff:fe:8a:d3:36&#10;Grandmaster Clock Priority1: 1&#10;Grandmaster Clock Priority2: 1">
<ellipse fill="none" stroke="black" cx="1379" cy="-34" rx="52.56" ry="18"/>
<text text-anchor="middle" x="1379" y="-28.57" font-family="Times New Roman,serif" font-size="14.00">site42&#45;rtr13</text>
</a>
</g>
</g>
<!-- site42&#45;rtr7&#45;&gt;site42&#45;rtr13 -->
<g id="edge14" class="edge">
<title>site42&#45;rtr7&#45;&gt;site42&#45;rtr13</title>
<g id="a_edge14"><a xlink:title="site42&#45;rtr7 &#45;&gt; site42&#45;rtr13">
<path fill="none" stroke="black" d="M1067.41,-95.82C1079.48,-93.18 1092.75,-90.37 1105,-88 1198.83,-69.82 1223.69,-72.66 1317,-52 1320.82,-51.15 1324.76,-50.22 1328.71,-49.24"/>
<polygon fill="black" stroke="black" points="1329.51,-52.65 1338.32,-46.76 1327.77,-45.87 1329.51,-52.65"/>
</a>
</g>
</g>
<!-- site42&#45;rtr16 -->
<g id="node16" class="node">
<title>site42&#45;rtr16</title>
<g id="a_node16"><a xlink:title="Local Clock Identity: 1c:ac:17:ff:ff:0b:54:85&#10;PTP Domain: 18&#10;Local Clock Priority1: 128&#10;Local Clock Priority2: 128&#10;Steps Removed: 2&#10;Mode: boundary&#10;Local Clock Source IP: 192.168.2.189&#10;Mean Path Delay: 64&#10;Offset From Master: None&#10;Parent Clock Identity: 2b:fe:52:ff:ff:76:ae:d9&#10;Parent Clock IP Address: 192.168.0.224&#10;Grandmaster Clock Identity: 8c:f6:39:ff:fe:8a:d3:36&#10;Grandmaster Clock Priority1: 1&#10;Grandmaster Clock Priority2: 1">
<ellipse fill="none" stroke="black" cx="1502" cy="-34" rx="52.56" ry="18"/>
<text text-anchor="middle" x="1502" y="-28.57" font-family="Times New Roman,serif" font-size="14.00">site42&#45;rtr16</text>
</a>
</g>
</g>
<!-- site42&#45;rtr7&#45;&gt;site42&#45;rtr16 -->
<g id="edge15" class="edge">
<title>site42&#45;rtr7&#45;&gt;site42&#45;rtr16</title>
<g id="a_edge15"><a xlink:title="site42&#45;rtr7 &#45;&gt; site42&#45;rtr16">
<path fill="none" stroke="black" d="M1066.52,-95.52C1078.8,-92.81 1092.41,-90.04 1105,-88 1253.25,-63.97 1293.49,-80.26 1441,-52 1444.84,-51.26 1448.79,-50.4 1452.75,-49.47"/>
<polygon fill="black" stroke="black" points="1453.52,-52.88 1462.36,-47.05 1451.81,-46.1 1453.52,-52.88"/>
</a>
</g>
</g>
<!-- site42&#45;rtr1 -->
<g id="node17" class="node">
<title>site42&#45;rtr1</title>
<g id="a_node17"><a xlink:title="Local Clock Identity: 55:a6:3c:ff:ff:38:a8:32&#10;PTP Domain: 18&#10;Local Clock Priority1: 128&#10;Local Clock Priority2: 128&#10;Steps Removed: 2&#10;Mode: boundary&#10;Local Clock Source IP: 192.168.2.212&#10;Mean Path Delay: 1911&#10;Offset From Master: None&#10;Parent Clock Identity: 2b:fe:52:ff:ff:76:ae:d9&#10;Parent Clock IP Address: 192.168.0.224&#10;Grandmaster Clock Identity: 8c:f6:39:ff:fe:8a:d3:36&#10;Grandmaster Clock Priority1: 1&#10;Grandmaster Clock Priority2: 1">
<ellipse fill="none" stroke="black" cx="1621" cy="-34" rx="48.07" ry="18"/>
<text text-anchor="middle" x="1621" y="-28.57" font-family="Times New Roman,serif" font-size="14.00">site42&#45;rtr1</text>
</a>
</g>
</g>
<!-- site42&#45;rtr7&#45;&gt;site42&#45;rtr1 -->
<g id="edge16" class="edge">
<title>site42&#45;rtr7&#45;&gt;site42&#45;rtr1</title>
<g id="a_edge16"><a xlink:title="site42&#45;rtr7 &#45;&gt; site42&#45;rtr1">
<path fill="none" stroke="black" d="M1066.49,-95.3C1078.76,-92.58 1092.39,-89.86 1105,-88 1307.44,-58.14 1362.83,-89.45 1564,-52 1567.6,-51.33 1571.3,-50.52 1575.01,-49.62"/>
<polygon fill="black" stroke="black" points="1575.78,-53.03 1584.55,-47.09 1573.99,-46.27 1575.78,-53.03"/>
</a>
</g>
</g>
<!-- site42&#45;rtr11 -->
<g id="node18" class="node">
<title>site42&#45;rtr11</title>
<g id="a_node18"><a xlink:title="Local Clock Identity: e9:55:ce:ff:ff:ab:24:47&#10;PTP Domain: 18&#10;Local Clock Priority1: 128&#10;Local Clock Priority2: 128&#10;Steps Removed: 2&#10;Mode: boundary&#10;Local Clock Source IP: 192.168.2.39&#10;Mean Path Delay: 1165&#10;Offset From Master: None&#10;Parent Clock Identity: 2b:fe:52:ff:ff:76:ae:d9&#10;Parent Clock IP Address: 192.168.0.224&#10;Grandmaster Clock Identity: 8c:f6:39:ff:fe:8a:d3:36&#10;Grandmaster Clock Priority1: 1&#10;Grandmaster Clock Priority2: 1">
<ellipse fill="none" stroke="black" cx="1740" cy="-34" rx="52.56" ry="18"/>
<text text-anchor="middle" x="1740" y="-28.57" font-family="Times New Roman,serif" font-size="14.00">site42&#45;rtr11</text>
</a>
</g>
</g>
<!-- site42&#45;rtr7&#45;&gt;site42&#45;rtr11 -->
<g id="edge17" class="edge">
<title>site42&#45;rtr7&#45;&gt;site42&#45;rtr11</title>
<g id="a_edge17"><a xlink:title="site42&#45;rtr7 &#45;&gt; site42&#45;rtr11">
<path fill="none" stroke="black" d="M1066.07,-95.27C1078.45,-92.51 1092.23,-89.78 1105,-88 1357.72,-52.73 1426.3,-93.96 1678,-52 1682.27,-51.29 1686.68,-50.4 1691.08,-49.41"/>
<polygon fill="black" stroke="black" points="1691.55,-52.89 1700.44,-47.12 1689.89,-46.09 1691.55,-52.89"/>
</a>
</g>
</g>
<!-- site42&#45;rtr9 -->
<g id="node20" class="node">
<title>site42&#45;rtr9</title>
<g id="a_node20"><a xlink:title="Local Clock Identity: 0e:59:82:ff:ff:e7:b7:8c&#10;PTP Domain: 18&#10;Local Clock Priority1: 128&#10;Local Clock Priority2: 128&#10;Steps Removed: 2&#10;Mode: boundary&#10;Local Clock Source IP: 192.168.3.115&#10;Mean Path Delay: 1378&#10;Offset From Master: None&#10;Parent Clock Identity: 2b:fe:52:ff:ff:76:ae:d9&#10;Parent Clock IP Address: 192.168.0.224&#10;Grandmaster Clock Identity: 8c:f6:39:ff:fe:8a:d3:36&#10;Grandmaster Clock Priority1: 1&#10;Grandmaster Clock Priority2: 1">
<ellipse fill="none" stroke="black" cx="1859" cy="-34" rx="48.07" ry="18"/>
<text text-anchor="middle" x="1859" y="-28.57" font-family="Times New Roman,serif" font-size="14.00">site42&#45;rtr9</text>
</a>
</g>
</g>
<!-- site42&#45;rtr7&#45;&gt;site42&#45;rtr9 -->
<g id="edge19" class="edge">
<title>site42&#45;rtr7&#45;&gt;site42&#45;rtr9</title>
<g id="a_edge19"><a xlink:title="site42&#45;rtr7 &#45;&gt; site42&#45;rtr9">
<path fill="none" stroke="black" d="M1066.06,-95.18C1078.44,-92.42 1092.22,-89.71 1105,-88 1412.45,-46.84 1496.32,-104.7 1802,-52 1805.78,-51.35 1809.66,-50.53 1813.53,-49.6"/>
<polygon fill="black" stroke="black" points="1814.1,-53.07 1822.88,-47.15 1812.32,-46.3 1814.1,-53.07"/>
</a>
</g>
</g>
<!-- site42&#45;rtr2 -->
<g id="node21" class="node">
<title>site42&#45;rtr2</title>
<g id="a_node21"><a xlink:title="Local Clock Identity: f1:60:f2:ff:ff:a8:38:ef&#10;PTP Domain: 18&#10;Local Clock Priority1: 128&#10;Local Clock Priority2: 128&#10;Steps Removed: 2&#10;Mode: boundary&#10;Local Clock Source IP: 192.168.3.5&#10;Mean Path Delay: 149&#10;Offset From Master: None&#10;Parent Clock Identity: 2b:fe:52:ff:ff:76:ae:d9&#10;Parent Clock IP Address: 192.168.0.224&#10;Grandmaster Clock Identity: 8c:f6:39:ff:fe:8a:d3:36&#10;Grandmaster Clock Priority1: 1&#10;Grandmaster Clock Priority2: 1">
<ellipse fill="none" stroke="black" cx="1973" cy="-34" rx="48.07" ry="18"/>
<text text-anchor="middle" x="1973" y="-28.57" font-family="Times New Roman,serif" font-size="14.00">site42&#45;rtr2</text>
</a>
</g>
</g>
<!-- site42&#45;rtr7&#45;&gt;site42&#45;rtr2 -->
<g id="edge20" class="edge">
<title>site42&#45;rtr7&#45;&gt;site42&#45;rtr2</title>
<g id="a_edge20"><a xlink:title="site42&#45;rtr7 &#45;&gt; site42&#45;rtr2">
<path fill="none" stroke="black" d="M1066.05,-95.12C1078.43,-92.36 1092.22,-89.66 1105,-88 1462.78,-41.42 1560.23,-112.01 1916,-52 1919.78,-51.36 1923.66,-50.55 1927.54,-49.63"/>
<polygon fill="black" stroke="black" points="1928.1,-53.1 1936.89,-47.19 1926.33,-46.33 1928.1,-53.1"/>
</a>
</g>
</g>
<!-- site81&#45;rtr2 -->
<g id="node12" class="node">
<title>site81&#45;rtr2</title>
<g id="a_node12"><a xlink:title="Local Clock Identity: d9:ed:7e:ff:fe:ec:2f:4c&#10;PTP Domain: 18&#10;Local Clock Priority1: 255&#10;Local Clock Priority2: 255&#10;Steps Removed: 2&#10;Mode: boundary&#10;Local Clock Source IP: 192.168.2.137&#10;Mean Path Delay: 100&#10;Offset From Master: 10&#10;Parent Clock Identity: 45:86:1a:ff:ff:7e:47:a0&#10;Parent Clock IP Address: 192.168.0.224&#10;Grandmaster Clock Identity: 8a:65:5b:ff:fe:d8:99:96&#10;Grandmaster Clock Priority1: 1&#10;Grandmaster Clock Priority2: 1">
<ellipse fill="none" stroke="black" cx="1162" cy="-106" rx="48.07" ry="18"/>
<text text-anchor="middle" x="1162" y="-100.58" font-family="Times New Roman,serif" font-size="14.00">site81&#45;rtr2</text>
</a>
</g>
</g>
<!-- site84&#45;rtr2 -->
<g id="node13" class="node">
<title>site84&#45;rtr2</title>
<g id="a_node13"><a xlink:title="Local Clock Identity: e3:40:e5:ff:fe:38:b5:bf&#10;PTP Domain: 18&#10;Local Clock Priority1: 255&#10;Local Clock Priority2: 255&#10;Steps Removed: 0&#10;Mode: boundary&#10;Local Clock Source IP: 192.168.2.137&#10;Mean Path Delay: 0&#10;Offset From Master: 0&#10;Parent Clock Identity: e3:40:e5:ff:fe:38:b5:bf&#10;Parent Clock IP Address: None&#10;Grandmaster Clock Identity: e3:40:e5:ff:fe:38:b5:bf&#10;Grandmaster Clock Priority1: 255&#10;Grandmaster Clock Priority2: 255">
<polygon fill="none" stroke="black" points="1346.42,-111.56 1287,-124 1227.58,-111.56 1227.64,-91.44 1346.36,-91.44 1346.42,-111.56"/>
<text text-anchor="middle" x="1287" y="-100.58" font-family="Times New Roman,serif" font-size="14.00">site84&#45;rtr2</text>
</a>
</g>
</g>
<!-- site81&#45;rtr1 -->
<g id="node19" class="node">
<title>site81&#45;rtr1</title>
<g id="a_node19"><a xlink:title="Local Clock Identity: bd:67:08:ff:fe:ed:2c:ef&#10;PTP Domain: 18&#10;Local Clock Priority1: 255&#10;Local Clock Priority2: 255&#10;Steps Removed: 3&#10;Mode: boundary&#10;Local Clock Source IP: 192.168.2.44&#10;Mean Path Delay: 94&#10;Offset From Master: 36&#10;Parent Clock Identity: d1:96:50:ff:ff:56:9a:91&#10;Parent Clock IP Address: 192.168.0.11&#10;Grandmaster Clock Identity: 8a:65:5b:ff:fe:d8:99:96&#10;Grandmaster Clock Priority1: 1&#10;Grandmaster Clock Priority2: 1">
<ellipse fill="none" stroke="black" cx="1412" cy="-106" rx="48.07" ry="18"/>
<text text-anchor="middle" x="1412" y="-100.58" font-family="Times New Roman,serif" font-size="14.00">site81&#45;rtr1</text>
</a>
</g>
</g>
<!-- transit -->
<g id="node22" class="node">
<title>transit</title>
<polygon fill="none" stroke="black" points="1221.61,-174.29 1221.61,-189.21 1198.41,-199.75 1165.59,-199.75 1142.39,-189.21 1142.39,-174.29 1165.59,-163.75 1198.41,-163.75 1221.61,-174.29"/>
<text text-anchor="middle" x="1182" y="-176.32" font-family="Times New Roman,serif" font-size="14.00">Transit</text>
</g>
<!-- transit&#45;&gt;site81&#45;rtr2 -->
<g id="edge12" class="edge">
<title>transit&#45;&gt;site81&#45;rtr2</title>
<g id="a_edge12"><a xlink:title="Unknown &#45;&gt; site81&#45;rtr2">
<path fill="none" stroke="black" d="M1177.26,-163.27C1174.99,-154.91 1172.22,-144.7 1169.67,-135.27"/>
<polygon fill="black" stroke="black" points="1173.1,-134.55 1167.1,-125.81 1166.34,-136.38 1173.1,-134.55"/>
</a>
</g>
</g>
<!-- transit&#45;&gt;site81&#45;rtr1 -->
<g id="edge18" class="edge">
<title>transit&#45;&gt;site81&#45;rtr1</title>
<g id="a_edge18"><a xlink:title="Unknown &#45;&gt; site81&#45;rtr1">
<path fill="none" stroke="black" d="M1221.88,-181.2C1258.12,-180.2 1312.3,-175.1 1355,-155.75 1367.84,-149.93 1380.02,-140.31 1389.79,-131.15"/>
<polygon fill="black" stroke="black" points="1391.99,-133.9 1396.65,-124.39 1387.07,-128.92 1391.99,-133.9"/>
</a>
</g>
</g>
<!-- OGM6ZjY6Mzk6ZmY6ZmU6OGE6ZDM6MzY= -->
<g id="node23" class="node">
<title>OGM6ZjY6Mzk6ZmY6ZmU6OGE6ZDM6MzY=</title>
<g id="a_node23"><a xlink:title="8c:f6:39:ff:fe:8a:d3:36">
<polygon fill="none" stroke="black" points="1094.62,-271.75 959.38,-271.75 959.38,-235.75 1094.62,-235.75 1094.62,-271.75"/>
<text text-anchor="middle" x="1027" y="-248.32" font-family="Times New Roman,serif" font-size="14.00">8c:f6:39:ff:fe:8a:d3:36</text>
</a>
</g>
</g>
<!-- OGM6ZjY6Mzk6ZmY6ZmU6OGE6ZDM6MzY=&#45;&gt;site42&#45;rtr7 -->
<g id="edge3" class="edge">
<title>OGM6ZjY6Mzk6ZmY6ZmU6OGE6ZDM6MzY=&#45;&gt;site42&#45;rtr7</title>
<g id="a_edge3"><a xlink:title="8c:f6:39:ff:fe:8a:d3:36 &#45;&gt; site42&#45;rtr7">
<path fill="none" stroke="black" d="M1027,-235.46C1027,-210.8 1027,-165.25 1027,-135.55"/>
<polygon fill="black" stroke="black" points="1030.5,-135.78 1027,-125.78 1023.5,-135.78 1030.5,-135.78"/>
</a>
</g>
</g>
<!-- OGE6NjU6NWI6ZmY6ZmU6ZDg6OTk6OTY= -->
<g id="node24" class="node">
<title>OGE6NjU6NWI6ZmY6ZmU6ZDg6OTk6OTY=</title>
<g id="a_node24"><a xlink:title="8a:65:5b:ff:fe:d8:99:96">
<polygon fill="none" stroke="black" points="1251.12,-271.75 1112.88,-271.75 1112.88,-235.75 1251.12,-235.75 1251.12,-271.75"/>
<text text-anchor="middle" x="1182" y="-248.32" font-family="Times New Roman,serif" font-size="14.00">8a:65:5b:ff:fe:d8:99:96</text>
</a>
</g>
</g>
<!-- OGE6NjU6NWI6ZmY6ZmU6ZDg6OTk6OTY=&#45;&gt;transit -->
<g id="edge21" class="edge">
<title>OGE6NjU6NWI6ZmY6ZmU6ZDg6OTk6OTY=&#45;&gt;transit</title>
<g id="a_edge21"><a xlink:title="8a:65:5b:ff:fe:d8:99:96 &#45;&gt; Unknown">
<path fill="none" stroke="black" d="M1182,-235.45C1182,-228.16 1182,-219.48 1182,-211.29"/>
<polygon fill="black" stroke="black" points="1185.5,-211.37 1182,-201.37 1178.5,-211.37 1185.5,-211.37"/>
</a>
</g>
</g>
</g>
</svg>
