{
    "interactionModel": {
        "languageModel": {
            "invocationName": "iota",
            "intents": [
                {
                    "name": "AMAZON.FallbackIntent",
                    "samples": []
                },
                {
                    "name": "AMAZON.CancelIntent",
                    "samples": []
                },
                {
                    "name": "AMAZON.HelpIntent",
                    "samples": []
                },
                {
                    "name": "AMAZON.StopIntent",
                    "samples": []
                },
                {
                    "name": "AMAZON.NavigateHomeIntent",
                    "samples": []
                },
                {
                    "name": "hello",
                    "slots": [],
                    "samples": [
                        "hello there"
                    ]
                },
                {
                    "name": "higgins",
                    "slots": [
                        {
                            "name": "action",
                            "type": "action"
                        },
                        {
                            "name": "target",
                            "type": "target"
                        }
                    ],
                    "samples": [
                        "{action} {target}"
                    ]
                }
            ],
            "types": [
                {
                    "name": "target",
                    "values": [
                        {
                            "name": {
                                "value": "server"
                            }
                        },
                        {
                            "name": {
                                "value": "higgins"
                            }
                        },
                        {
                            "name": {
                                "value": "printer 1"
                            }
                        },
                        {
                            "name": {
                                "value": "server 42"
                            }
                        }
                    ]
                },
                {
                    "name": "action",
                    "values": [
                        {
                            "name": {
                                "value": "alarm"
                            }
                        },
                        {
                            "name": {
                                "value": "shutdown"
                            }
                        },
                        {
                            "name": {
                                "value": "start"
                            }
                        },
                        {
                            "name": {
                                "value": "turn off"
                            }
                        },
                        {
                            "name": {
                                "value": "reboot"
                            }
                        },
                        {
                            "name": {
                                "value": "turn on"
                            }
                        }
                    ]
                }
            ]
        }
    }
}