{
  "migIndex": 1,
  "data": [
    {
      "path": "fonts/Poppins-Medium.ttf",
      "sha1": "6575dbf38e9e61beec498e2be61c89d43399db24"
    },
    {
      "path": "fonts/Poppins-Regular.ttf",
      "sha1": "dd48971530e3f19f7067ad80ce6c215365fe7269"
    },
    {
      "path": "fonts/Poppins-SemiBold.ttf",
      "sha1": "33cccb49029917a6175e7e7a754e296d518c2710"
    }
  ]
}
