

================================================================
== Vitis HLS Report for 'cache_module_Pipeline_VITIS_LOOP_11_1'
================================================================
* Date:           Sun Jun  5 01:17:51 2022

* Version:        2022.1 (Build 3526262 on Mon Apr 18 15:47:01 MDT 2022)
* Project:        dsd2-cache-memory
* Solution:       solution2 (Vivado IP Flow Target)
* Product family: zynq
* Target device:  xc7z020-clg400-1


================================================================
== Performance Estimates
================================================================
+ Timing: 
    * Summary: 
    +--------+----------+----------+------------+
    |  Clock |  Target  | Estimated| Uncertainty|
    +--------+----------+----------+------------+
    |ap_clk  |  10.00 ns|  5.472 ns|     2.70 ns|
    +--------+----------+----------+------------+

+ Latency: 
    * Summary: 
    +---------+---------+-----------+-----------+-----+-----+---------+
    |  Latency (cycles) |   Latency (absolute)  |  Interval | Pipeline|
    |   min   |   max   |    min    |    max    | min | max |   Type  |
    +---------+---------+-----------+-----------+-----+-----+---------+
    |        7|        7|  70.000 ns|  70.000 ns|    7|    7|       no|
    +---------+---------+-----------+-----------+-----+-----+---------+

    + Detail: 
        * Instance: 
        N/A

        * Loop: 
        +-------------------+---------+---------+----------+-----------+-----------+------+----------+
        |                   |  Latency (cycles) | Iteration|  Initiation Interval  | Trip |          |
        |     Loop Name     |   min   |   max   |  Latency |  achieved |   target  | Count| Pipelined|
        +-------------------+---------+---------+----------+-----------+-----------+------+----------+
        |- VITIS_LOOP_11_1  |        5|        5|         3|          1|          1|     4|       yes|
        +-------------------+---------+---------+----------+-----------+-----------+------+----------+

============================================================
+ Verbose Summary: Synthesis Manager
============================================================
InlineROM: 1
ExposeGlobal: 0
============================================================
+ Verbose Summary: CDFG Model
============================================================
IsTopModel: 0
ResetActiveHigh: 1
IsCombinational: 0
IsDatapathOnly: 0
HasWiredReturn: 1
HasMFsm: 2
HasVarLatency: 1
IsPipeline: 0
IsRtlPipelined: 0
IsInstanceOverlapped: 0
IsDontTouch: 0
HasImplIP: 0
IsGatedGlobalClock: 0

+ Individual pipeline summary: 
  * Pipeline-0: initiation interval (II) = 1, depth = 3


============================================================
+ Verbose Summary: Schedule
============================================================
* Number of FSM states : 3
* Pipeline : 1
  Pipeline-0 : II = 1, D = 3, States = { 1 2 3 }
* Dataflow Pipeline: 0

* FSM state transitions: 
1 --> 2 
2 --> 3 
3 --> 

* FSM state operations: 

State 1 <SV = 0> <Delay = 3.23>
ST_1 : Operation 6 [1/1] (0.00ns)   --->   "%i = alloca i32 1"   --->   Operation 6 'alloca' 'i' <Predicate = true> <Delay = 0.00>
ST_1 : Operation 7 [1/1] (0.00ns)   --->   "%specbramwithbyteenable_ln0 = specbramwithbyteenable void @_ssdm_op_SpecBRAMWithByteEnable, i64 %cacheMemory"   --->   Operation 7 'specbramwithbyteenable' 'specbramwithbyteenable_ln0' <Predicate = true> <Delay = 0.00>
ST_1 : Operation 8 [1/1] (0.00ns)   --->   "%specinterface_ln0 = specinterface void @_ssdm_op_SpecInterface, i8 %newData, void @empty_1, i32 0, i32 0, void @empty_0, i32 4294967295, i32 0, void @empty_0, void @empty_0, void @empty_0, i32 0, i32 0, i32 0, i32 0, void @empty_0, void @empty_0, i32 4294967295, i32 0"   --->   Operation 8 'specinterface' 'specinterface_ln0' <Predicate = true> <Delay = 0.00>
ST_1 : Operation 9 [1/1] (0.00ns)   --->   "%or_ln11_read = read i6 @_ssdm_op_Read.ap_auto.i6, i6 %or_ln11"   --->   Operation 9 'read' 'or_ln11_read' <Predicate = true> <Delay = 0.00>
ST_1 : Operation 10 [1/1] (1.58ns)   --->   "%store_ln0 = store i3 0, i3 %i"   --->   Operation 10 'store' 'store_ln0' <Predicate = true> <Delay = 1.58>
ST_1 : Operation 11 [1/1] (0.00ns)   --->   "%br_ln0 = br void %for.inc"   --->   Operation 11 'br' 'br_ln0' <Predicate = true> <Delay = 0.00>
ST_1 : Operation 12 [1/1] (0.00ns)   --->   "%i_1 = load i3 %i" [dsd2-cache-memory/mem-example.cpp:11]   --->   Operation 12 'load' 'i_1' <Predicate = true> <Delay = 0.00>
ST_1 : Operation 13 [1/1] (0.00ns)   --->   "%specpipeline_ln0 = specpipeline void @_ssdm_op_SpecPipeline, i32 4294967295, i32 0, i32 1, i32 0, void @p_str"   --->   Operation 13 'specpipeline' 'specpipeline_ln0' <Predicate = true> <Delay = 0.00>
ST_1 : Operation 14 [1/1] (1.13ns)   --->   "%icmp_ln11 = icmp_eq  i3 %i_1, i3 4" [dsd2-cache-memory/mem-example.cpp:11]   --->   Operation 14 'icmp' 'icmp_ln11' <Predicate = true> <Delay = 1.13> <CoreInst = "Cmp">   --->   Core 9 'Cmp' <Latency = 0> <II = 1> <Delay = 1.13> <FuncUnit> <Opcode : 'icmp'> <InPorts = 2> <OutPorts = 1>
ST_1 : Operation 15 [1/1] (0.00ns)   --->   "%empty = speclooptripcount i32 @_ssdm_op_SpecLoopTripCount, i64 4, i64 4, i64 4"   --->   Operation 15 'speclooptripcount' 'empty' <Predicate = true> <Delay = 0.00>
ST_1 : Operation 16 [1/1] (1.65ns)   --->   "%add_ln11_1 = add i3 %i_1, i3 1" [dsd2-cache-memory/mem-example.cpp:11]   --->   Operation 16 'add' 'add_ln11_1' <Predicate = true> <Delay = 1.65> <CoreInst = "Adder">   --->   Core 1 'Adder' <Latency = 0> <II = 1> <Delay = 1.65> <FuncUnit> <Opcode : 'add' 'sub'> <InPorts = 2> <OutPorts = 1>
ST_1 : Operation 17 [1/1] (0.00ns)   --->   "%br_ln11 = br i1 %icmp_ln11, void %for.inc.split, void %if.end.loopexit.exitStub" [dsd2-cache-memory/mem-example.cpp:11]   --->   Operation 17 'br' 'br_ln11' <Predicate = true> <Delay = 0.00>
ST_1 : Operation 18 [1/1] (0.00ns)   --->   "%i_cast5 = zext i3 %i_1" [dsd2-cache-memory/mem-example.cpp:11]   --->   Operation 18 'zext' 'i_cast5' <Predicate = (!icmp_ln11)> <Delay = 0.00>
ST_1 : Operation 19 [1/1] (0.00ns)   --->   "%newData_addr = getelementptr i8 %newData, i64 0, i64 %i_cast5" [dsd2-cache-memory/mem-example.cpp:11]   --->   Operation 19 'getelementptr' 'newData_addr' <Predicate = (!icmp_ln11)> <Delay = 0.00>
ST_1 : Operation 20 [2/2] (2.32ns)   --->   "%newData_load = load i2 %newData_addr" [dsd2-cache-memory/mem-example.cpp:11]   --->   Operation 20 'load' 'newData_load' <Predicate = (!icmp_ln11)> <Delay = 2.32> <CoreInst = "RAM">   --->   Core 82 'RAM' <Latency = 1> <II = 1> <Delay = 2.32> <Storage> <Opcode : 'load' 'store'> <Ports = 2> <Width = 8> <Depth = 4> <RAM>
ST_1 : Operation 21 [1/1] (1.58ns)   --->   "%store_ln11 = store i3 %add_ln11_1, i3 %i" [dsd2-cache-memory/mem-example.cpp:11]   --->   Operation 21 'store' 'store_ln11' <Predicate = (!icmp_ln11)> <Delay = 1.58>

State 2 <SV = 1> <Delay = 2.32>
ST_2 : Operation 22 [1/2] (2.32ns)   --->   "%newData_load = load i2 %newData_addr" [dsd2-cache-memory/mem-example.cpp:11]   --->   Operation 22 'load' 'newData_load' <Predicate = true> <Delay = 2.32> <CoreInst = "RAM">   --->   Core 82 'RAM' <Latency = 1> <II = 1> <Delay = 2.32> <Storage> <Opcode : 'load' 'store'> <Ports = 2> <Width = 8> <Depth = 4> <RAM>
ST_2 : Operation 39 [1/1] (0.00ns)   --->   "%ret_ln0 = ret"   --->   Operation 39 'ret' 'ret_ln0' <Predicate = (icmp_ln11)> <Delay = 0.00>

State 3 <SV = 2> <Delay = 5.47>
ST_3 : Operation 23 [1/1] (0.00ns)   --->   "%i_cast = zext i3 %i_1" [dsd2-cache-memory/mem-example.cpp:11]   --->   Operation 23 'zext' 'i_cast' <Predicate = true> <Delay = 0.00>
ST_3 : Operation 24 [1/1] (0.00ns)   --->   "%specloopname_ln11 = specloopname void @_ssdm_op_SpecLoopName, void @empty_3" [dsd2-cache-memory/mem-example.cpp:11]   --->   Operation 24 'specloopname' 'specloopname_ln11' <Predicate = true> <Delay = 0.00>
ST_3 : Operation 25 [1/1] (0.00ns)   --->   "%trunc_ln11 = trunc i3 %i_1" [dsd2-cache-memory/mem-example.cpp:11]   --->   Operation 25 'trunc' 'trunc_ln11' <Predicate = true> <Delay = 0.00>
ST_3 : Operation 26 [1/1] (1.82ns)   --->   "%add_ln11 = add i6 %i_cast, i6 %or_ln11_read" [dsd2-cache-memory/mem-example.cpp:11]   --->   Operation 26 'add' 'add_ln11' <Predicate = true> <Delay = 1.82> <CoreInst = "Adder">   --->   Core 1 'Adder' <Latency = 0> <II = 1> <Delay = 1.82> <FuncUnit> <Opcode : 'add' 'sub'> <InPorts = 2> <OutPorts = 1>
ST_3 : Operation 27 [1/1] (0.00ns)   --->   "%zext_ln11 = zext i8 %newData_load" [dsd2-cache-memory/mem-example.cpp:11]   --->   Operation 27 'zext' 'zext_ln11' <Predicate = true> <Delay = 0.00>
ST_3 : Operation 28 [1/1] (0.00ns)   --->   "%zext_ln11_1_cast = bitconcatenate i3 @_ssdm_op_BitConcatenate.i3.i1.i2, i1 1, i2 %trunc_ln11" [dsd2-cache-memory/mem-example.cpp:11]   --->   Operation 28 'bitconcatenate' 'zext_ln11_1_cast' <Predicate = true> <Delay = 0.00>
ST_3 : Operation 29 [1/1] (0.00ns)   --->   "%zext_ln11_1 = zext i3 %zext_ln11_1_cast" [dsd2-cache-memory/mem-example.cpp:11]   --->   Operation 29 'zext' 'zext_ln11_1' <Predicate = true> <Delay = 0.00>
ST_3 : Operation 30 [1/1] (2.12ns)   --->   "%shl_ln11 = shl i8 1, i8 %zext_ln11_1" [dsd2-cache-memory/mem-example.cpp:11]   --->   Operation 30 'shl' 'shl_ln11' <Predicate = true> <Delay = 2.12> <CoreInst = "Shifter">   --->   Core 75 'Shifter' <Latency = 0> <II = 1> <Delay = 2.12> <FuncUnit> <Opcode : 'shl' 'lshr' 'ashr'> <InPorts = 2> <OutPorts = 1>
ST_3 : Operation 31 [1/1] (0.00ns)   --->   "%zext_ln11_2_cast = bitconcatenate i6 @_ssdm_op_BitConcatenate.i6.i1.i2.i3, i1 1, i2 %trunc_ln11, i3 0" [dsd2-cache-memory/mem-example.cpp:11]   --->   Operation 31 'bitconcatenate' 'zext_ln11_2_cast' <Predicate = true> <Delay = 0.00>
ST_3 : Operation 32 [1/1] (0.00ns)   --->   "%zext_ln11_2 = zext i6 %zext_ln11_2_cast" [dsd2-cache-memory/mem-example.cpp:11]   --->   Operation 32 'zext' 'zext_ln11_2' <Predicate = true> <Delay = 0.00>
ST_3 : Operation 33 [1/1] (3.14ns)   --->   "%shl_ln11_1 = shl i64 %zext_ln11, i64 %zext_ln11_2" [dsd2-cache-memory/mem-example.cpp:11]   --->   Operation 33 'shl' 'shl_ln11_1' <Predicate = true> <Delay = 3.14> <CoreInst = "Shifter">   --->   Core 75 'Shifter' <Latency = 0> <II = 1> <Delay = 3.14> <FuncUnit> <Opcode : 'shl' 'lshr' 'ashr'> <InPorts = 2> <OutPorts = 1>
ST_3 : Operation 34 [1/1] (0.00ns)   --->   "%lshr_ln = partselect i3 @_ssdm_op_PartSelect.i3.i6.i32.i32, i6 %add_ln11, i32 3, i32 5" [dsd2-cache-memory/mem-example.cpp:11]   --->   Operation 34 'partselect' 'lshr_ln' <Predicate = true> <Delay = 0.00>
ST_3 : Operation 35 [1/1] (0.00ns)   --->   "%zext_ln11_3 = zext i3 %lshr_ln" [dsd2-cache-memory/mem-example.cpp:11]   --->   Operation 35 'zext' 'zext_ln11_3' <Predicate = true> <Delay = 0.00>
ST_3 : Operation 36 [1/1] (0.00ns)   --->   "%cacheMemory_addr = getelementptr i64 %cacheMemory, i64 0, i64 %zext_ln11_3" [dsd2-cache-memory/mem-example.cpp:11]   --->   Operation 36 'getelementptr' 'cacheMemory_addr' <Predicate = true> <Delay = 0.00>
ST_3 : Operation 37 [1/1] (2.32ns)   --->   "%store_ln11 = store void @_ssdm_op_Write.bram.p0L_a8i8packedL, i3 %cacheMemory_addr, i64 %shl_ln11_1, i8 %shl_ln11" [dsd2-cache-memory/mem-example.cpp:11]   --->   Operation 37 'store' 'store_ln11' <Predicate = true> <Delay = 2.32> <CoreInst = "RAM">   --->   Core 82 'RAM' <Latency = 1> <II = 1> <Delay = 2.32> <Storage> <Opcode : 'load' 'store'> <Ports = 2> <Width = 64> <Depth = 8> <RAM>
ST_3 : Operation 38 [1/1] (0.00ns)   --->   "%br_ln11 = br void %for.inc" [dsd2-cache-memory/mem-example.cpp:11]   --->   Operation 38 'br' 'br_ln11' <Predicate = true> <Delay = 0.00>


============================================================
+ Verbose Summary: Binding
============================================================
STG Binding: 
---------------- STG Properties BEGIN ----------------
- Is combinational: 0
- Is one-state seq: 0
- Is datapath-only: 0
- Is pipelined: 0
- Is top level: 0
Port [ Return ] is wired: 1; IO mode=ap_ctrl_hs:ce=0
Port [ newData]:  wired=1; compound=1; hidden=0; nouse=0; global=0; static=0; extern=0; dir=0; type=1; pingpong=0; private_global=0; MemPort=[13]; IO mode=ap_memory:ce=0
Port [ or_ln11]:  wired=1; compound=0; hidden=0; nouse=0; global=0; static=0; extern=0; dir=0; type=0; pingpong=0; private_global=0; IO mode=ap_none:ce=0
Port [ cacheMemory]:  wired=1; compound=1; hidden=0; nouse=0; global=1; static=1; extern=0; dir=1; type=1; pingpong=0; private_global=0; MemPort=[03]; IO mode=ap_memory:ce=0
---------------- STG Properties END ------------------

---------------- Datapath Model BEGIN ----------------

<LifeTime>
<method=bitvector/>
i                          (alloca                ) [ 0100]
specbramwithbyteenable_ln0 (specbramwithbyteenable) [ 0000]
specinterface_ln0          (specinterface         ) [ 0000]
or_ln11_read               (read                  ) [ 0111]
store_ln0                  (store                 ) [ 0000]
br_ln0                     (br                    ) [ 0000]
i_1                        (load                  ) [ 0111]
specpipeline_ln0           (specpipeline          ) [ 0000]
icmp_ln11                  (icmp                  ) [ 0110]
empty                      (speclooptripcount     ) [ 0000]
add_ln11_1                 (add                   ) [ 0000]
br_ln11                    (br                    ) [ 0000]
i_cast5                    (zext                  ) [ 0000]
newData_addr               (getelementptr         ) [ 0110]
store_ln11                 (store                 ) [ 0000]
newData_load               (load                  ) [ 0101]
i_cast                     (zext                  ) [ 0000]
specloopname_ln11          (specloopname          ) [ 0000]
trunc_ln11                 (trunc                 ) [ 0000]
add_ln11                   (add                   ) [ 0000]
zext_ln11                  (zext                  ) [ 0000]
zext_ln11_1_cast           (bitconcatenate        ) [ 0000]
zext_ln11_1                (zext                  ) [ 0000]
shl_ln11                   (shl                   ) [ 0000]
zext_ln11_2_cast           (bitconcatenate        ) [ 0000]
zext_ln11_2                (zext                  ) [ 0000]
shl_ln11_1                 (shl                   ) [ 0000]
lshr_ln                    (partselect            ) [ 0000]
zext_ln11_3                (zext                  ) [ 0000]
cacheMemory_addr           (getelementptr         ) [ 0000]
store_ln11                 (store                 ) [ 0000]
br_ln11                    (br                    ) [ 0000]
ret_ln0                    (ret                   ) [ 0000]
</LifeTime>

<model>

<comp_list>
<comp id="0" class="1000" name="newData">
<pin_list>
<pin id="1" dir="1" index="0" bw="1" slack="0"/>
</pin_list>
<bind>
<StgValue><ssdm name="newData"/><MemPortTyVec>1 3 </MemPortTyVec>
</StgValue>
</bind>
</comp>

<comp id="2" class="1000" name="or_ln11">
<pin_list>
<pin id="3" dir="1" index="0" bw="1" slack="0"/>
</pin_list>
<bind>
<StgValue><ssdm name="or_ln11"/></StgValue>
</bind>
</comp>

<comp id="4" class="1000" name="cacheMemory">
<pin_list>
<pin id="5" dir="1" index="0" bw="1" slack="0"/>
</pin_list>
<bind>
<StgValue><ssdm name="cacheMemory"/><MemPortTyVec>0 3 </MemPortTyVec>
</StgValue>
</bind>
</comp>

<comp id="6" class="1001" name="const_6">
<pin_list>
<pin id="7" dir="1" index="0" bw="1" slack="0"/>
</pin_list>
<bind>
<StgValue><ssdm name=""/></StgValue>
</bind>
</comp>

<comp id="8" class="1001" name="const_8">
<pin_list>
<pin id="9" dir="1" index="0" bw="1" slack="2147483647"/>
</pin_list>
<bind>
<StgValue><ssdm name="_ssdm_op_SpecBRAMWithByteEnable"/></StgValue>
</bind>
</comp>

<comp id="10" class="1001" name="const_10">
<pin_list>
<pin id="11" dir="1" index="0" bw="1" slack="2147483647"/>
</pin_list>
<bind>
<StgValue><ssdm name="_ssdm_op_SpecInterface"/></StgValue>
</bind>
</comp>

<comp id="12" class="1001" name="const_12">
<pin_list>
<pin id="13" dir="1" index="0" bw="1" slack="2147483647"/>
</pin_list>
<bind>
<StgValue><ssdm name="empty_1"/></StgValue>
</bind>
</comp>

<comp id="14" class="1001" name="const_14">
<pin_list>
<pin id="15" dir="1" index="0" bw="1" slack="2147483647"/>
</pin_list>
<bind>
<StgValue><ssdm name=""/></StgValue>
</bind>
</comp>

<comp id="16" class="1001" name="const_16">
<pin_list>
<pin id="17" dir="1" index="0" bw="1" slack="2147483647"/>
</pin_list>
<bind>
<StgValue><ssdm name="empty_0"/></StgValue>
</bind>
</comp>

<comp id="18" class="1001" name="const_18">
<pin_list>
<pin id="19" dir="1" index="0" bw="1" slack="2147483647"/>
</pin_list>
<bind>
<StgValue><ssdm name=""/></StgValue>
</bind>
</comp>

<comp id="20" class="1001" name="const_20">
<pin_list>
<pin id="21" dir="1" index="0" bw="1" slack="0"/>
</pin_list>
<bind>
<StgValue><ssdm name="_ssdm_op_Read.ap_auto.i6"/></StgValue>
</bind>
</comp>

<comp id="22" class="1001" name="const_22">
<pin_list>
<pin id="23" dir="1" index="0" bw="1" slack="0"/>
</pin_list>
<bind>
<StgValue><ssdm name=""/></StgValue>
</bind>
</comp>

<comp id="24" class="1001" name="const_24">
<pin_list>
<pin id="25" dir="1" index="0" bw="1" slack="2147483647"/>
</pin_list>
<bind>
<StgValue><ssdm name="_ssdm_op_SpecPipeline"/></StgValue>
</bind>
</comp>

<comp id="26" class="1001" name="const_26">
<pin_list>
<pin id="27" dir="1" index="0" bw="1" slack="2147483647"/>
</pin_list>
<bind>
<StgValue><ssdm name="p_str"/></StgValue>
</bind>
</comp>

<comp id="28" class="1001" name="const_28">
<pin_list>
<pin id="29" dir="1" index="0" bw="1" slack="0"/>
</pin_list>
<bind>
<StgValue><ssdm name=""/></StgValue>
</bind>
</comp>

<comp id="30" class="1001" name="const_30">
<pin_list>
<pin id="31" dir="1" index="0" bw="1" slack="2147483647"/>
</pin_list>
<bind>
<StgValue><ssdm name="_ssdm_op_SpecLoopTripCount"/></StgValue>
</bind>
</comp>

<comp id="32" class="1001" name="const_32">
<pin_list>
<pin id="33" dir="1" index="0" bw="1" slack="2147483647"/>
</pin_list>
<bind>
<StgValue><ssdm name=""/></StgValue>
</bind>
</comp>

<comp id="34" class="1001" name="const_34">
<pin_list>
<pin id="35" dir="1" index="0" bw="1" slack="0"/>
</pin_list>
<bind>
<StgValue><ssdm name=""/></StgValue>
</bind>
</comp>

<comp id="36" class="1001" name="const_36">
<pin_list>
<pin id="37" dir="1" index="0" bw="1" slack="0"/>
</pin_list>
<bind>
<StgValue><ssdm name=""/></StgValue>
</bind>
</comp>

<comp id="38" class="1001" name="const_38">
<pin_list>
<pin id="39" dir="1" index="0" bw="1" slack="2147483647"/>
</pin_list>
<bind>
<StgValue><ssdm name="_ssdm_op_SpecLoopName"/></StgValue>
</bind>
</comp>

<comp id="40" class="1001" name="const_40">
<pin_list>
<pin id="41" dir="1" index="0" bw="1" slack="2147483647"/>
</pin_list>
<bind>
<StgValue><ssdm name="empty_3"/></StgValue>
</bind>
</comp>

<comp id="42" class="1001" name="const_42">
<pin_list>
<pin id="43" dir="1" index="0" bw="1" slack="0"/>
</pin_list>
<bind>
<StgValue><ssdm name="_ssdm_op_BitConcatenate.i3.i1.i2"/></StgValue>
</bind>
</comp>

<comp id="44" class="1001" name="const_44">
<pin_list>
<pin id="45" dir="1" index="0" bw="1" slack="0"/>
</pin_list>
<bind>
<StgValue><ssdm name=""/></StgValue>
</bind>
</comp>

<comp id="46" class="1001" name="const_46">
<pin_list>
<pin id="47" dir="1" index="0" bw="1" slack="0"/>
</pin_list>
<bind>
<StgValue><ssdm name=""/></StgValue>
</bind>
</comp>

<comp id="48" class="1001" name="const_48">
<pin_list>
<pin id="49" dir="1" index="0" bw="1" slack="0"/>
</pin_list>
<bind>
<StgValue><ssdm name="_ssdm_op_BitConcatenate.i6.i1.i2.i3"/></StgValue>
</bind>
</comp>

<comp id="50" class="1001" name="const_50">
<pin_list>
<pin id="51" dir="1" index="0" bw="1" slack="0"/>
</pin_list>
<bind>
<StgValue><ssdm name="_ssdm_op_PartSelect.i3.i6.i32.i32"/></StgValue>
</bind>
</comp>

<comp id="52" class="1001" name="const_52">
<pin_list>
<pin id="53" dir="1" index="0" bw="1" slack="0"/>
</pin_list>
<bind>
<StgValue><ssdm name=""/></StgValue>
</bind>
</comp>

<comp id="54" class="1001" name="const_54">
<pin_list>
<pin id="55" dir="1" index="0" bw="1" slack="0"/>
</pin_list>
<bind>
<StgValue><ssdm name=""/></StgValue>
</bind>
</comp>

<comp id="56" class="1001" name="const_56">
<pin_list>
<pin id="57" dir="1" index="0" bw="1" slack="2147483647"/>
</pin_list>
<bind>
<StgValue><ssdm name="_ssdm_op_Write.bram.p0L_a8i8packedL"/></StgValue>
</bind>
</comp>

<comp id="58" class="1004" name="i_fu_58">
<pin_list>
<pin id="59" dir="0" index="0" bw="1" slack="0"/>
<pin id="60" dir="1" index="1" bw="3" slack="0"/>
</pin_list>
<bind>
<opcode="alloca(26) " fcode="alloca"/>
<opset="i/1 "/>
</bind>
</comp>

<comp id="62" class="1004" name="or_ln11_read_read_fu_62">
<pin_list>
<pin id="63" dir="0" index="0" bw="6" slack="0"/>
<pin id="64" dir="0" index="1" bw="6" slack="0"/>
<pin id="65" dir="1" index="2" bw="6" slack="2"/>
</pin_list>
<bind>
<opcode="read(1150) " fcode="read"/>
<opset="or_ln11_read/1 "/>
</bind>
</comp>

<comp id="68" class="1004" name="newData_addr_gep_fu_68">
<pin_list>
<pin id="69" dir="0" index="0" bw="8" slack="0"/>
<pin id="70" dir="0" index="1" bw="1" slack="0"/>
<pin id="71" dir="0" index="2" bw="3" slack="0"/>
<pin id="72" dir="1" index="3" bw="2" slack="0"/>
</pin_list>
<bind>
<opcode="getelementptr(29) " fcode="getelementptr"/>
<opset="newData_addr/1 "/>
</bind>
</comp>

<comp id="75" class="1004" name="grp_access_fu_75">
<pin_list>
<pin id="76" dir="0" index="0" bw="2" slack="0"/>
<pin id="77" dir="0" index="1" bw="8" slack="2147483647"/>
<pin id="78" dir="0" index="2" bw="0" slack="2147483647"/>
<pin id="79" dir="1" index="3" bw="8" slack="1"/>
</pin_list>
<bind>
<opcode="load(27) " fcode="load"/>
<opset="newData_load/1 "/>
</bind>
</comp>

<comp id="81" class="1004" name="cacheMemory_addr_gep_fu_81">
<pin_list>
<pin id="82" dir="0" index="0" bw="64" slack="0"/>
<pin id="83" dir="0" index="1" bw="1" slack="0"/>
<pin id="84" dir="0" index="2" bw="3" slack="0"/>
<pin id="85" dir="1" index="3" bw="3" slack="2147483647"/>
</pin_list>
<bind>
<opcode="getelementptr(29) " fcode="getelementptr"/>
<opset="cacheMemory_addr/3 "/>
</bind>
</comp>

<comp id="88" class="1004" name="store_ln11_access_fu_88">
<pin_list>
<pin id="89" dir="0" index="0" bw="3" slack="2147483647"/>
<pin id="90" dir="0" index="1" bw="64" slack="0"/>
<pin id="91" dir="0" index="2" bw="8" slack="0"/>
<pin id="92" dir="1" index="3" bw="64" slack="2147483647"/>
</pin_list>
<bind>
<opcode="store(28) " fcode="store"/>
<opset="store_ln11/3 "/>
</bind>
</comp>

<comp id="93" class="1004" name="store_ln0_store_fu_93">
<pin_list>
<pin id="94" dir="0" index="0" bw="1" slack="0"/>
<pin id="95" dir="0" index="1" bw="3" slack="0"/>
<pin id="96" dir="1" index="2" bw="0" slack="2147483647"/>
</pin_list>
<bind>
<opcode="store(28) " fcode="store"/>
<opset="store_ln0/1 "/>
</bind>
</comp>

<comp id="98" class="1004" name="i_1_load_fu_98">
<pin_list>
<pin id="99" dir="0" index="0" bw="3" slack="0"/>
<pin id="100" dir="1" index="1" bw="3" slack="0"/>
</pin_list>
<bind>
<opcode="load(27) " fcode="load"/>
<opset="i_1/1 "/>
</bind>
</comp>

<comp id="101" class="1004" name="icmp_ln11_fu_101">
<pin_list>
<pin id="102" dir="0" index="0" bw="3" slack="0"/>
<pin id="103" dir="0" index="1" bw="3" slack="0"/>
<pin id="104" dir="1" index="2" bw="1" slack="1"/>
</pin_list>
<bind>
<opcode="icmp(45) " fcode="icmp"/>
<opset="icmp_ln11/1 "/>
</bind>
</comp>

<comp id="107" class="1004" name="add_ln11_1_fu_107">
<pin_list>
<pin id="108" dir="0" index="0" bw="3" slack="0"/>
<pin id="109" dir="0" index="1" bw="1" slack="0"/>
<pin id="110" dir="1" index="2" bw="3" slack="0"/>
</pin_list>
<bind>
<opcode="add(8) " fcode="add"/>
<opset="add_ln11_1/1 "/>
</bind>
</comp>

<comp id="113" class="1004" name="i_cast5_fu_113">
<pin_list>
<pin id="114" dir="0" index="0" bw="3" slack="0"/>
<pin id="115" dir="1" index="1" bw="64" slack="0"/>
</pin_list>
<bind>
<opcode="zext(34) " fcode="zext"/>
<opset="i_cast5/1 "/>
</bind>
</comp>

<comp id="118" class="1004" name="store_ln11_store_fu_118">
<pin_list>
<pin id="119" dir="0" index="0" bw="3" slack="0"/>
<pin id="120" dir="0" index="1" bw="3" slack="0"/>
<pin id="121" dir="1" index="2" bw="0" slack="2147483647"/>
</pin_list>
<bind>
<opcode="store(28) " fcode="store"/>
<opset="store_ln11/1 "/>
</bind>
</comp>

<comp id="123" class="1004" name="i_cast_fu_123">
<pin_list>
<pin id="124" dir="0" index="0" bw="3" slack="2"/>
<pin id="125" dir="1" index="1" bw="6" slack="0"/>
</pin_list>
<bind>
<opcode="zext(34) " fcode="zext"/>
<opset="i_cast/3 "/>
</bind>
</comp>

<comp id="126" class="1004" name="trunc_ln11_fu_126">
<pin_list>
<pin id="127" dir="0" index="0" bw="3" slack="2"/>
<pin id="128" dir="1" index="1" bw="2" slack="0"/>
</pin_list>
<bind>
<opcode="trunc(33) " fcode="trunc"/>
<opset="trunc_ln11/3 "/>
</bind>
</comp>

<comp id="129" class="1004" name="add_ln11_fu_129">
<pin_list>
<pin id="130" dir="0" index="0" bw="3" slack="0"/>
<pin id="131" dir="0" index="1" bw="6" slack="2"/>
<pin id="132" dir="1" index="2" bw="6" slack="0"/>
</pin_list>
<bind>
<opcode="add(8) " fcode="add"/>
<opset="add_ln11/3 "/>
</bind>
</comp>

<comp id="134" class="1004" name="zext_ln11_fu_134">
<pin_list>
<pin id="135" dir="0" index="0" bw="8" slack="1"/>
<pin id="136" dir="1" index="1" bw="64" slack="0"/>
</pin_list>
<bind>
<opcode="zext(34) " fcode="zext"/>
<opset="zext_ln11/3 "/>
</bind>
</comp>

<comp id="137" class="1004" name="zext_ln11_1_cast_fu_137">
<pin_list>
<pin id="138" dir="0" index="0" bw="3" slack="0"/>
<pin id="139" dir="0" index="1" bw="1" slack="0"/>
<pin id="140" dir="0" index="2" bw="2" slack="0"/>
<pin id="141" dir="1" index="3" bw="3" slack="0"/>
</pin_list>
<bind>
<opcode="bitconcatenate(1004) " fcode="bitconcatenate"/>
<opset="zext_ln11_1_cast/3 "/>
</bind>
</comp>

<comp id="145" class="1004" name="zext_ln11_1_fu_145">
<pin_list>
<pin id="146" dir="0" index="0" bw="3" slack="0"/>
<pin id="147" dir="1" index="1" bw="8" slack="0"/>
</pin_list>
<bind>
<opcode="zext(34) " fcode="zext"/>
<opset="zext_ln11_1/3 "/>
</bind>
</comp>

<comp id="149" class="1004" name="shl_ln11_fu_149">
<pin_list>
<pin id="150" dir="0" index="0" bw="1" slack="0"/>
<pin id="151" dir="0" index="1" bw="3" slack="0"/>
<pin id="152" dir="1" index="2" bw="8" slack="0"/>
</pin_list>
<bind>
<opcode="shl(20) " fcode="shl"/>
<opset="shl_ln11/3 "/>
</bind>
</comp>

<comp id="156" class="1004" name="zext_ln11_2_cast_fu_156">
<pin_list>
<pin id="157" dir="0" index="0" bw="6" slack="0"/>
<pin id="158" dir="0" index="1" bw="1" slack="0"/>
<pin id="159" dir="0" index="2" bw="2" slack="0"/>
<pin id="160" dir="0" index="3" bw="1" slack="0"/>
<pin id="161" dir="1" index="4" bw="6" slack="0"/>
</pin_list>
<bind>
<opcode="bitconcatenate(1004) " fcode="bitconcatenate"/>
<opset="zext_ln11_2_cast/3 "/>
</bind>
</comp>

<comp id="166" class="1004" name="zext_ln11_2_fu_166">
<pin_list>
<pin id="167" dir="0" index="0" bw="6" slack="0"/>
<pin id="168" dir="1" index="1" bw="64" slack="0"/>
</pin_list>
<bind>
<opcode="zext(34) " fcode="zext"/>
<opset="zext_ln11_2/3 "/>
</bind>
</comp>

<comp id="170" class="1004" name="shl_ln11_1_fu_170">
<pin_list>
<pin id="171" dir="0" index="0" bw="8" slack="0"/>
<pin id="172" dir="0" index="1" bw="6" slack="0"/>
<pin id="173" dir="1" index="2" bw="64" slack="0"/>
</pin_list>
<bind>
<opcode="shl(20) " fcode="shl"/>
<opset="shl_ln11_1/3 "/>
</bind>
</comp>

<comp id="177" class="1004" name="lshr_ln_fu_177">
<pin_list>
<pin id="178" dir="0" index="0" bw="3" slack="0"/>
<pin id="179" dir="0" index="1" bw="6" slack="0"/>
<pin id="180" dir="0" index="2" bw="3" slack="0"/>
<pin id="181" dir="0" index="3" bw="4" slack="0"/>
<pin id="182" dir="1" index="4" bw="3" slack="0"/>
</pin_list>
<bind>
<opcode="partselect(1002) " fcode="partselect"/>
<opset="lshr_ln/3 "/>
</bind>
</comp>

<comp id="187" class="1004" name="zext_ln11_3_fu_187">
<pin_list>
<pin id="188" dir="0" index="0" bw="3" slack="0"/>
<pin id="189" dir="1" index="1" bw="64" slack="0"/>
</pin_list>
<bind>
<opcode="zext(34) " fcode="zext"/>
<opset="zext_ln11_3/3 "/>
</bind>
</comp>

<comp id="192" class="1005" name="i_reg_192">
<pin_list>
<pin id="193" dir="0" index="0" bw="3" slack="0"/>
<pin id="194" dir="1" index="1" bw="3" slack="0"/>
</pin_list>
<bind>
<opset="i "/>
</bind>
</comp>

<comp id="199" class="1005" name="or_ln11_read_reg_199">
<pin_list>
<pin id="200" dir="0" index="0" bw="6" slack="2"/>
<pin id="201" dir="1" index="1" bw="6" slack="2"/>
</pin_list>
<bind>
<opset="or_ln11_read "/>
</bind>
</comp>

<comp id="204" class="1005" name="i_1_reg_204">
<pin_list>
<pin id="205" dir="0" index="0" bw="3" slack="2"/>
<pin id="206" dir="1" index="1" bw="3" slack="2"/>
</pin_list>
<bind>
<opset="i_1 "/>
</bind>
</comp>

<comp id="210" class="1005" name="icmp_ln11_reg_210">
<pin_list>
<pin id="211" dir="0" index="0" bw="1" slack="1"/>
<pin id="212" dir="1" index="1" bw="1" slack="2147483647"/>
</pin_list>
<bind>
<opset="icmp_ln11 "/>
</bind>
</comp>

<comp id="214" class="1005" name="newData_addr_reg_214">
<pin_list>
<pin id="215" dir="0" index="0" bw="2" slack="1"/>
<pin id="216" dir="1" index="1" bw="2" slack="1"/>
</pin_list>
<bind>
<opset="newData_addr "/>
</bind>
</comp>

<comp id="219" class="1005" name="newData_load_reg_219">
<pin_list>
<pin id="220" dir="0" index="0" bw="8" slack="1"/>
<pin id="221" dir="1" index="1" bw="8" slack="1"/>
</pin_list>
<bind>
<opset="newData_load "/>
</bind>
</comp>

</comp_list>

<net_list>
<net id="61"><net_src comp="6" pin="0"/><net_sink comp="58" pin=0"/></net>

<net id="66"><net_src comp="20" pin="0"/><net_sink comp="62" pin=0"/></net>

<net id="67"><net_src comp="2" pin="0"/><net_sink comp="62" pin=1"/></net>

<net id="73"><net_src comp="0" pin="0"/><net_sink comp="68" pin=0"/></net>

<net id="74"><net_src comp="36" pin="0"/><net_sink comp="68" pin=1"/></net>

<net id="80"><net_src comp="68" pin="3"/><net_sink comp="75" pin=0"/></net>

<net id="86"><net_src comp="4" pin="0"/><net_sink comp="81" pin=0"/></net>

<net id="87"><net_src comp="36" pin="0"/><net_sink comp="81" pin=1"/></net>

<net id="97"><net_src comp="22" pin="0"/><net_sink comp="93" pin=0"/></net>

<net id="105"><net_src comp="98" pin="1"/><net_sink comp="101" pin=0"/></net>

<net id="106"><net_src comp="28" pin="0"/><net_sink comp="101" pin=1"/></net>

<net id="111"><net_src comp="98" pin="1"/><net_sink comp="107" pin=0"/></net>

<net id="112"><net_src comp="34" pin="0"/><net_sink comp="107" pin=1"/></net>

<net id="116"><net_src comp="98" pin="1"/><net_sink comp="113" pin=0"/></net>

<net id="117"><net_src comp="113" pin="1"/><net_sink comp="68" pin=2"/></net>

<net id="122"><net_src comp="107" pin="2"/><net_sink comp="118" pin=0"/></net>

<net id="133"><net_src comp="123" pin="1"/><net_sink comp="129" pin=0"/></net>

<net id="142"><net_src comp="42" pin="0"/><net_sink comp="137" pin=0"/></net>

<net id="143"><net_src comp="44" pin="0"/><net_sink comp="137" pin=1"/></net>

<net id="144"><net_src comp="126" pin="1"/><net_sink comp="137" pin=2"/></net>

<net id="148"><net_src comp="137" pin="3"/><net_sink comp="145" pin=0"/></net>

<net id="153"><net_src comp="46" pin="0"/><net_sink comp="149" pin=0"/></net>

<net id="154"><net_src comp="145" pin="1"/><net_sink comp="149" pin=1"/></net>

<net id="155"><net_src comp="149" pin="2"/><net_sink comp="88" pin=2"/></net>

<net id="162"><net_src comp="48" pin="0"/><net_sink comp="156" pin=0"/></net>

<net id="163"><net_src comp="44" pin="0"/><net_sink comp="156" pin=1"/></net>

<net id="164"><net_src comp="126" pin="1"/><net_sink comp="156" pin=2"/></net>

<net id="165"><net_src comp="22" pin="0"/><net_sink comp="156" pin=3"/></net>

<net id="169"><net_src comp="156" pin="4"/><net_sink comp="166" pin=0"/></net>

<net id="174"><net_src comp="134" pin="1"/><net_sink comp="170" pin=0"/></net>

<net id="175"><net_src comp="166" pin="1"/><net_sink comp="170" pin=1"/></net>

<net id="176"><net_src comp="170" pin="2"/><net_sink comp="88" pin=1"/></net>

<net id="183"><net_src comp="50" pin="0"/><net_sink comp="177" pin=0"/></net>

<net id="184"><net_src comp="129" pin="2"/><net_sink comp="177" pin=1"/></net>

<net id="185"><net_src comp="52" pin="0"/><net_sink comp="177" pin=2"/></net>

<net id="186"><net_src comp="54" pin="0"/><net_sink comp="177" pin=3"/></net>

<net id="190"><net_src comp="177" pin="4"/><net_sink comp="187" pin=0"/></net>

<net id="191"><net_src comp="187" pin="1"/><net_sink comp="81" pin=2"/></net>

<net id="195"><net_src comp="58" pin="1"/><net_sink comp="192" pin=0"/></net>

<net id="196"><net_src comp="192" pin="1"/><net_sink comp="93" pin=1"/></net>

<net id="197"><net_src comp="192" pin="1"/><net_sink comp="98" pin=0"/></net>

<net id="198"><net_src comp="192" pin="1"/><net_sink comp="118" pin=1"/></net>

<net id="202"><net_src comp="62" pin="2"/><net_sink comp="199" pin=0"/></net>

<net id="203"><net_src comp="199" pin="1"/><net_sink comp="129" pin=1"/></net>

<net id="207"><net_src comp="98" pin="1"/><net_sink comp="204" pin=0"/></net>

<net id="208"><net_src comp="204" pin="1"/><net_sink comp="123" pin=0"/></net>

<net id="209"><net_src comp="204" pin="1"/><net_sink comp="126" pin=0"/></net>

<net id="213"><net_src comp="101" pin="2"/><net_sink comp="210" pin=0"/></net>

<net id="217"><net_src comp="68" pin="3"/><net_sink comp="214" pin=0"/></net>

<net id="218"><net_src comp="214" pin="1"/><net_sink comp="75" pin=0"/></net>

<net id="222"><net_src comp="75" pin="3"/><net_sink comp="219" pin=0"/></net>

<net id="223"><net_src comp="219" pin="1"/><net_sink comp="134" pin=0"/></net>

</net_list>

</model> 
---------------- Datapath Model END ------------------

* FSMD analyzer results:
  - Output states:
	Port: cacheMemory | {3 }
 - Input state : 
	Port: cache_module_Pipeline_VITIS_LOOP_11_1 : newData | {1 2 }
	Port: cache_module_Pipeline_VITIS_LOOP_11_1 : or_ln11 | {1 }
  - Chain level:
	State 1
		store_ln0 : 1
		i_1 : 1
		icmp_ln11 : 2
		add_ln11_1 : 2
		br_ln11 : 3
		i_cast5 : 2
		newData_addr : 3
		newData_load : 4
		store_ln11 : 3
	State 2
	State 3
		add_ln11 : 1
		zext_ln11_1_cast : 1
		zext_ln11_1 : 2
		shl_ln11 : 3
		zext_ln11_2_cast : 1
		zext_ln11_2 : 2
		shl_ln11_1 : 3
		lshr_ln : 2
		zext_ln11_3 : 3
		cacheMemory_addr : 4
		store_ln11 : 5


============================================================
+ Verbose Summary: Datapath Resource usage 
============================================================

* Functional unit list:
|----------|-------------------------|---------|---------|
| Operation|     Functional Unit     |    FF   |   LUT   |
|----------|-------------------------|---------|---------|
|    add   |    add_ln11_1_fu_107    |    0    |    11   |
|          |     add_ln11_fu_129     |    0    |    14   |
|----------|-------------------------|---------|---------|
|    shl   |     shl_ln11_fu_149     |    0    |    7    |
|          |    shl_ln11_1_fu_170    |    0    |    17   |
|----------|-------------------------|---------|---------|
|   icmp   |     icmp_ln11_fu_101    |    0    |    8    |
|----------|-------------------------|---------|---------|
|   read   | or_ln11_read_read_fu_62 |    0    |    0    |
|----------|-------------------------|---------|---------|
|          |      i_cast5_fu_113     |    0    |    0    |
|          |      i_cast_fu_123      |    0    |    0    |
|   zext   |     zext_ln11_fu_134    |    0    |    0    |
|          |    zext_ln11_1_fu_145   |    0    |    0    |
|          |    zext_ln11_2_fu_166   |    0    |    0    |
|          |    zext_ln11_3_fu_187   |    0    |    0    |
|----------|-------------------------|---------|---------|
|   trunc  |    trunc_ln11_fu_126    |    0    |    0    |
|----------|-------------------------|---------|---------|
|bitconcatenate| zext_ln11_1_cast_fu_137 |    0    |    0    |
|          | zext_ln11_2_cast_fu_156 |    0    |    0    |
|----------|-------------------------|---------|---------|
|partselect|      lshr_ln_fu_177     |    0    |    0    |
|----------|-------------------------|---------|---------|
|   Total  |                         |    0    |    57   |
|----------|-------------------------|---------|---------|

Memories:
N/A

* Register list:
+--------------------+--------+
|                    |   FF   |
+--------------------+--------+
|     i_1_reg_204    |    3   |
|      i_reg_192     |    3   |
|  icmp_ln11_reg_210 |    1   |
|newData_addr_reg_214|    2   |
|newData_load_reg_219|    8   |
|or_ln11_read_reg_199|    6   |
+--------------------+--------+
|        Total       |   23   |
+--------------------+--------+

* Multiplexer (MUX) list: 
|------------------|------|------|------|--------||---------||---------|
|       Comp       |  Pin | Size |  BW  | S x BW ||  Delay  ||   LUT   |
|------------------|------|------|------|--------||---------||---------|
| grp_access_fu_75 |  p0  |   2  |   2  |    4   ||    9    |
|------------------|------|------|------|--------||---------||---------|
|       Total      |      |      |      |    4   ||  1.588  ||    9    |
|------------------|------|------|------|--------||---------||---------|



* Summary:
+-----------+--------+--------+--------+
|           |  Delay |   FF   |   LUT  |
+-----------+--------+--------+--------+
|  Function |    -   |    0   |   57   |
|   Memory  |    -   |    -   |    -   |
|Multiplexer|    1   |    -   |    9   |
|  Register |    -   |   23   |    -   |
+-----------+--------+--------+--------+
|   Total   |    1   |   23   |   66   |
+-----------+--------+--------+--------+
