

================================================================
== Vitis HLS Report for 'cache_module'
================================================================
* Date:           Sun Jun  5 01:17:51 2022

* Version:        2022.1 (Build 3526262 on Mon Apr 18 15:47:01 MDT 2022)
* Project:        dsd2-cache-memory
* Solution:       solution2 (Vivado IP Flow Target)
* Product family: zynq
* Target device:  xc7z020-clg400-1


================================================================
== Performance Estimates
================================================================
+ Timing: 
    * Summary: 
    +--------+----------+----------+------------+
    |  Clock |  Target  | Estimated| Uncertainty|
    +--------+----------+----------+------------+
    |ap_clk  |  10.00 ns|  6.917 ns|     2.70 ns|
    +--------+----------+----------+------------+

+ Latency: 
    * Summary: 
    +---------+---------+-----------+----------+-----+-----+---------+
    |  Latency (cycles) |  Latency (absolute)  |  Interval | Pipeline|
    |   min   |   max   |    min    |    max   | min | max |   Type  |
    +---------+---------+-----------+----------+-----+-----+---------+
    |        4|       14|  40.000 ns|  0.140 us|    5|   15|       no|
    +---------+---------+-----------+----------+-----+-----+---------+

    + Detail: 
        * Instance: 
        N/A

        * Loop: 
        N/A

============================================================
+ Verbose Summary: Synthesis Manager
============================================================
InlineROM: 1
ExposeGlobal: 0
============================================================
+ Verbose Summary: CDFG Model
============================================================
IsTopModel: 1
ResetActiveHigh: 1
IsCombinational: 0
IsDatapathOnly: 0
HasWiredReturn: 1
HasMFsm: 0
HasVarLatency: 1
IsPipeline: 0
IsRtlPipelined: 0
IsInstanceOverlapped: 0
IsDontTouch: 0
HasImplIP: 0
IsGatedGlobalClock: 0


============================================================
+ Verbose Summary: Schedule
============================================================
* Number of FSM states : 8
* Pipeline : 0
* Dataflow Pipeline: 0

* FSM state transitions: 
1 --> 2 4 
2 --> 3 
3 --> 4 
4 --> 5 6 
5 --> 6 
6 --> 7 
7 --> 8 
8 --> 

* FSM state operations: 

State 1 <SV = 0> <Delay = 4.14>
ST_1 : Operation 9 [1/1] (0.00ns)   --->   "%updateDataValid_read = read i1 @_ssdm_op_Read.ap_auto.i1, i1 %updateDataValid" [dsd2-cache-memory/mem-example.cpp:7]   --->   Operation 9 'read' 'updateDataValid_read' <Predicate = true> <Delay = 0.00>
ST_1 : Operation 10 [1/1] (0.00ns)   --->   "%updateTagValid_read = read i1 @_ssdm_op_Read.ap_auto.i1, i1 %updateTagValid" [dsd2-cache-memory/mem-example.cpp:7]   --->   Operation 10 'read' 'updateTagValid_read' <Predicate = true> <Delay = 0.00>
ST_1 : Operation 11 [1/1] (0.00ns)   --->   "%newTag_read = read i32 @_ssdm_op_Read.ap_auto.i32, i32 %newTag" [dsd2-cache-memory/mem-example.cpp:7]   --->   Operation 11 'read' 'newTag_read' <Predicate = true> <Delay = 0.00>
ST_1 : Operation 12 [1/1] (0.00ns)   --->   "%updateWay_read = read i8 @_ssdm_op_Read.ap_auto.i8, i8 %updateWay" [dsd2-cache-memory/mem-example.cpp:7]   --->   Operation 12 'read' 'updateWay_read' <Predicate = true> <Delay = 0.00>
ST_1 : Operation 13 [1/1] (0.00ns)   --->   "%updateSet_read = read i8 @_ssdm_op_Read.ap_auto.i8, i8 %updateSet" [dsd2-cache-memory/mem-example.cpp:7]   --->   Operation 13 'read' 'updateSet_read' <Predicate = true> <Delay = 0.00>
ST_1 : Operation 14 [1/1] (0.00ns)   --->   "%address_read = read i32 @_ssdm_op_Read.ap_auto.i32, i32 %address" [dsd2-cache-memory/mem-example.cpp:7]   --->   Operation 14 'read' 'address_read' <Predicate = true> <Delay = 0.00>
ST_1 : Operation 15 [1/1] (0.00ns)   --->   "%trunc_ln7 = trunc i32 %address_read" [dsd2-cache-memory/mem-example.cpp:7]   --->   Operation 15 'trunc' 'trunc_ln7' <Predicate = true> <Delay = 0.00>
ST_1 : Operation 16 [1/1] (0.00ns)   --->   "%spectopmodule_ln7 = spectopmodule void @_ssdm_op_SpecTopModule, void @empty_2" [dsd2-cache-memory/mem-example.cpp:7]   --->   Operation 16 'spectopmodule' 'spectopmodule_ln7' <Predicate = true> <Delay = 0.00>
ST_1 : Operation 17 [1/1] (0.00ns)   --->   "%specbitsmap_ln0 = specbitsmap void @_ssdm_op_SpecBitsMap, i32 %address"   --->   Operation 17 'specbitsmap' 'specbitsmap_ln0' <Predicate = true> <Delay = 0.00>
ST_1 : Operation 18 [1/1] (0.00ns)   --->   "%specinterface_ln0 = specinterface void @_ssdm_op_SpecInterface, i32 %address, void @empty, i32 0, i32 0, void @empty_0, i32 0, i32 0, void @empty_0, void @empty_0, void @empty_0, i32 0, i32 0, i32 0, i32 0, void @empty_0, void @empty_0, i32 4294967295, i32 0"   --->   Operation 18 'specinterface' 'specinterface_ln0' <Predicate = true> <Delay = 0.00>
ST_1 : Operation 19 [1/1] (0.00ns)   --->   "%specbitsmap_ln0 = specbitsmap void @_ssdm_op_SpecBitsMap, i1 %dirty"   --->   Operation 19 'specbitsmap' 'specbitsmap_ln0' <Predicate = true> <Delay = 0.00>
ST_1 : Operation 20 [1/1] (0.00ns)   --->   "%specinterface_ln0 = specinterface void @_ssdm_op_SpecInterface, i1 %dirty, void @empty, i32 0, i32 0, void @empty_0, i32 0, i32 0, void @empty_0, void @empty_0, void @empty_0, i32 0, i32 0, i32 0, i32 0, void @empty_0, void @empty_0, i32 4294967295, i32 0"   --->   Operation 20 'specinterface' 'specinterface_ln0' <Predicate = true> <Delay = 0.00>
ST_1 : Operation 21 [1/1] (0.00ns)   --->   "%specbitsmap_ln0 = specbitsmap void @_ssdm_op_SpecBitsMap, i1 %hit"   --->   Operation 21 'specbitsmap' 'specbitsmap_ln0' <Predicate = true> <Delay = 0.00>
ST_1 : Operation 22 [1/1] (0.00ns)   --->   "%specinterface_ln0 = specinterface void @_ssdm_op_SpecInterface, i1 %hit, void @empty, i32 0, i32 0, void @empty_0, i32 0, i32 0, void @empty_0, void @empty_0, void @empty_0, i32 0, i32 0, i32 0, i32 0, void @empty_0, void @empty_0, i32 4294967295, i32 0"   --->   Operation 22 'specinterface' 'specinterface_ln0' <Predicate = true> <Delay = 0.00>
ST_1 : Operation 23 [1/1] (0.00ns)   --->   "%specbitsmap_ln0 = specbitsmap void @_ssdm_op_SpecBitsMap, i8 %data"   --->   Operation 23 'specbitsmap' 'specbitsmap_ln0' <Predicate = true> <Delay = 0.00>
ST_1 : Operation 24 [1/1] (0.00ns)   --->   "%specinterface_ln0 = specinterface void @_ssdm_op_SpecInterface, i8 %data, void @empty, i32 0, i32 0, void @empty_0, i32 0, i32 0, void @empty_0, void @empty_0, void @empty_0, i32 0, i32 0, i32 0, i32 0, void @empty_0, void @empty_0, i32 4294967295, i32 0"   --->   Operation 24 'specinterface' 'specinterface_ln0' <Predicate = true> <Delay = 0.00>
ST_1 : Operation 25 [1/1] (0.00ns)   --->   "%specbitsmap_ln0 = specbitsmap void @_ssdm_op_SpecBitsMap, i8 %updateSet"   --->   Operation 25 'specbitsmap' 'specbitsmap_ln0' <Predicate = true> <Delay = 0.00>
ST_1 : Operation 26 [1/1] (0.00ns)   --->   "%specinterface_ln0 = specinterface void @_ssdm_op_SpecInterface, i8 %updateSet, void @empty, i32 0, i32 0, void @empty_0, i32 0, i32 0, void @empty_0, void @empty_0, void @empty_0, i32 0, i32 0, i32 0, i32 0, void @empty_0, void @empty_0, i32 4294967295, i32 0"   --->   Operation 26 'specinterface' 'specinterface_ln0' <Predicate = true> <Delay = 0.00>
ST_1 : Operation 27 [1/1] (0.00ns)   --->   "%specbitsmap_ln0 = specbitsmap void @_ssdm_op_SpecBitsMap, i8 %updateWay"   --->   Operation 27 'specbitsmap' 'specbitsmap_ln0' <Predicate = true> <Delay = 0.00>
ST_1 : Operation 28 [1/1] (0.00ns)   --->   "%specinterface_ln0 = specinterface void @_ssdm_op_SpecInterface, i8 %updateWay, void @empty, i32 0, i32 0, void @empty_0, i32 0, i32 0, void @empty_0, void @empty_0, void @empty_0, i32 0, i32 0, i32 0, i32 0, void @empty_0, void @empty_0, i32 4294967295, i32 0"   --->   Operation 28 'specinterface' 'specinterface_ln0' <Predicate = true> <Delay = 0.00>
ST_1 : Operation 29 [1/1] (0.00ns)   --->   "%specbitsmap_ln0 = specbitsmap void @_ssdm_op_SpecBitsMap, i32 %newTag"   --->   Operation 29 'specbitsmap' 'specbitsmap_ln0' <Predicate = true> <Delay = 0.00>
ST_1 : Operation 30 [1/1] (0.00ns)   --->   "%specinterface_ln0 = specinterface void @_ssdm_op_SpecInterface, i32 %newTag, void @empty, i32 0, i32 0, void @empty_0, i32 0, i32 0, void @empty_0, void @empty_0, void @empty_0, i32 0, i32 0, i32 0, i32 0, void @empty_0, void @empty_0, i32 4294967295, i32 0"   --->   Operation 30 'specinterface' 'specinterface_ln0' <Predicate = true> <Delay = 0.00>
ST_1 : Operation 31 [1/1] (0.00ns)   --->   "%specbitsmap_ln0 = specbitsmap void @_ssdm_op_SpecBitsMap, i1 %updateTagValid"   --->   Operation 31 'specbitsmap' 'specbitsmap_ln0' <Predicate = true> <Delay = 0.00>
ST_1 : Operation 32 [1/1] (0.00ns)   --->   "%specinterface_ln0 = specinterface void @_ssdm_op_SpecInterface, i1 %updateTagValid, void @empty, i32 0, i32 0, void @empty_0, i32 0, i32 0, void @empty_0, void @empty_0, void @empty_0, i32 0, i32 0, i32 0, i32 0, void @empty_0, void @empty_0, i32 4294967295, i32 0"   --->   Operation 32 'specinterface' 'specinterface_ln0' <Predicate = true> <Delay = 0.00>
ST_1 : Operation 33 [1/1] (0.00ns)   --->   "%specinterface_ln0 = specinterface void @_ssdm_op_SpecInterface, i8 %newData, void @empty_1, i32 0, i32 0, void @empty_0, i32 4294967295, i32 0, void @empty_0, void @empty_0, void @empty_0, i32 0, i32 0, i32 0, i32 0, void @empty_0, void @empty_0, i32 4294967295, i32 0"   --->   Operation 33 'specinterface' 'specinterface_ln0' <Predicate = true> <Delay = 0.00>
ST_1 : Operation 34 [1/1] (0.00ns)   --->   "%specbitsmap_ln0 = specbitsmap void @_ssdm_op_SpecBitsMap, i8 %newData"   --->   Operation 34 'specbitsmap' 'specbitsmap_ln0' <Predicate = true> <Delay = 0.00>
ST_1 : Operation 35 [1/1] (0.00ns)   --->   "%specbitsmap_ln0 = specbitsmap void @_ssdm_op_SpecBitsMap, i1 %updateDataValid"   --->   Operation 35 'specbitsmap' 'specbitsmap_ln0' <Predicate = true> <Delay = 0.00>
ST_1 : Operation 36 [1/1] (0.00ns)   --->   "%specinterface_ln0 = specinterface void @_ssdm_op_SpecInterface, i1 %updateDataValid, void @empty, i32 0, i32 0, void @empty_0, i32 0, i32 0, void @empty_0, void @empty_0, void @empty_0, i32 0, i32 0, i32 0, i32 0, void @empty_0, void @empty_0, i32 4294967295, i32 0"   --->   Operation 36 'specinterface' 'specinterface_ln0' <Predicate = true> <Delay = 0.00>
ST_1 : Operation 37 [1/1] (0.00ns)   --->   "%specbramwithbyteenable_ln0 = specbramwithbyteenable void @_ssdm_op_SpecBRAMWithByteEnable, i64 %cacheMemory"   --->   Operation 37 'specbramwithbyteenable' 'specbramwithbyteenable_ln0' <Predicate = true> <Delay = 0.00>
ST_1 : Operation 38 [1/1] (0.00ns)   --->   "%br_ln8 = br i1 %updateDataValid_read, void %if.end, void %if.then" [dsd2-cache-memory/mem-example.cpp:8]   --->   Operation 38 'br' 'br_ln8' <Predicate = true> <Delay = 0.00>
ST_1 : Operation 39 [1/1] (0.00ns)   --->   "%trunc_ln9 = trunc i8 %updateSet_read" [dsd2-cache-memory/mem-example.cpp:9]   --->   Operation 39 'trunc' 'trunc_ln9' <Predicate = (updateDataValid_read)> <Delay = 0.00>
ST_1 : Operation 40 [1/1] (0.00ns)   --->   "%shl_ln9 = bitconcatenate i6 @_ssdm_op_BitConcatenate.i6.i3.i3, i3 %trunc_ln9, i3 0" [dsd2-cache-memory/mem-example.cpp:9]   --->   Operation 40 'bitconcatenate' 'shl_ln9' <Predicate = (updateDataValid_read)> <Delay = 0.00>
ST_1 : Operation 41 [1/1] (0.00ns)   --->   "%trunc_ln9_1 = trunc i8 %updateWay_read" [dsd2-cache-memory/mem-example.cpp:9]   --->   Operation 41 'trunc' 'trunc_ln9_1' <Predicate = (updateDataValid_read)> <Delay = 0.00>
ST_1 : Operation 42 [1/1] (0.00ns)   --->   "%shl_ln9_1 = bitconcatenate i6 @_ssdm_op_BitConcatenate.i6.i3.i3, i3 %trunc_ln9_1, i3 0" [dsd2-cache-memory/mem-example.cpp:9]   --->   Operation 42 'bitconcatenate' 'shl_ln9_1' <Predicate = (updateDataValid_read)> <Delay = 0.00>
ST_1 : Operation 43 [1/1] (1.82ns)   --->   "%add_ln9 = add i6 %shl_ln9_1, i6 %shl_ln9" [dsd2-cache-memory/mem-example.cpp:9]   --->   Operation 43 'add' 'add_ln9' <Predicate = (updateDataValid_read)> <Delay = 1.82> <CoreInst = "Adder">   --->   Core 1 'Adder' <Latency = 0> <II = 1> <Delay = 1.82> <FuncUnit> <Opcode : 'add' 'sub'> <InPorts = 2> <OutPorts = 1>
ST_1 : Operation 44 [1/1] (0.00ns)   --->   "%lshr_ln9 = partselect i3 @_ssdm_op_PartSelect.i3.i6.i32.i32, i6 %add_ln9, i32 3, i32 5" [dsd2-cache-memory/mem-example.cpp:9]   --->   Operation 44 'partselect' 'lshr_ln9' <Predicate = (updateDataValid_read)> <Delay = 0.00>
ST_1 : Operation 45 [1/1] (0.00ns)   --->   "%zext_ln9 = zext i3 %lshr_ln9" [dsd2-cache-memory/mem-example.cpp:9]   --->   Operation 45 'zext' 'zext_ln9' <Predicate = (updateDataValid_read)> <Delay = 0.00>
ST_1 : Operation 46 [1/1] (0.00ns)   --->   "%cacheMemory_addr = getelementptr i64 %cacheMemory, i64 0, i64 %zext_ln9" [dsd2-cache-memory/mem-example.cpp:9]   --->   Operation 46 'getelementptr' 'cacheMemory_addr' <Predicate = (updateDataValid_read)> <Delay = 0.00>
ST_1 : Operation 47 [2/2] (2.32ns)   --->   "%cacheMemory_load = load i3 %cacheMemory_addr" [dsd2-cache-memory/mem-example.cpp:9]   --->   Operation 47 'load' 'cacheMemory_load' <Predicate = (updateDataValid_read)> <Delay = 2.32> <CoreInst = "RAM">   --->   Core 82 'RAM' <Latency = 1> <II = 1> <Delay = 2.32> <Storage> <Opcode : 'load' 'store'> <Ports = 2> <Width = 64> <Depth = 8> <RAM>

State 2 <SV = 1> <Delay = 4.64>
ST_2 : Operation 48 [1/2] (2.32ns)   --->   "%cacheMemory_load = load i3 %cacheMemory_addr" [dsd2-cache-memory/mem-example.cpp:9]   --->   Operation 48 'load' 'cacheMemory_load' <Predicate = true> <Delay = 2.32> <CoreInst = "RAM">   --->   Core 82 'RAM' <Latency = 1> <II = 1> <Delay = 2.32> <Storage> <Opcode : 'load' 'store'> <Ports = 2> <Width = 64> <Depth = 8> <RAM>
ST_2 : Operation 49 [1/1] (0.00ns)   --->   "%tmp_3 = partselect i30 @_ssdm_op_PartSelect.i30.i64.i32.i32, i64 %cacheMemory_load, i32 2, i32 31" [dsd2-cache-memory/mem-example.cpp:10]   --->   Operation 49 'partselect' 'tmp_3' <Predicate = true> <Delay = 0.00>
ST_2 : Operation 50 [1/1] (0.00ns)   --->   "%and_ln = bitconcatenate i32 @_ssdm_op_BitConcatenate.i32.i30.i2, i30 %tmp_3, i2 0" [dsd2-cache-memory/mem-example.cpp:10]   --->   Operation 50 'bitconcatenate' 'and_ln' <Predicate = true> <Delay = 0.00>
ST_2 : Operation 51 [1/1] (0.00ns)   --->   "%or_ln10 = or i32 %and_ln, i32 1" [dsd2-cache-memory/mem-example.cpp:10]   --->   Operation 51 'or' 'or_ln10' <Predicate = true> <Delay = 0.00>
ST_2 : Operation 52 [1/1] (0.00ns)   --->   "%zext_ln10 = zext i32 %or_ln10" [dsd2-cache-memory/mem-example.cpp:10]   --->   Operation 52 'zext' 'zext_ln10' <Predicate = true> <Delay = 0.00>
ST_2 : Operation 53 [1/1] (2.32ns)   --->   "%store_ln10 = store void @_ssdm_op_Write.bram.p0L_a8i8packedL, i3 %cacheMemory_addr, i64 %zext_ln10, i8 15" [dsd2-cache-memory/mem-example.cpp:10]   --->   Operation 53 'store' 'store_ln10' <Predicate = true> <Delay = 2.32> <CoreInst = "RAM">   --->   Core 82 'RAM' <Latency = 1> <II = 1> <Delay = 2.32> <Storage> <Opcode : 'load' 'store'> <Ports = 2> <Width = 64> <Depth = 8> <RAM>

State 3 <SV = 2> <Delay = 0.00>
ST_3 : Operation 54 [1/1] (0.00ns)   --->   "%or_ln11 = or i6 %add_ln9, i6 4" [dsd2-cache-memory/mem-example.cpp:11]   --->   Operation 54 'or' 'or_ln11' <Predicate = true> <Delay = 0.00>
ST_3 : Operation 55 [2/2] (0.00ns)   --->   "%call_ln11 = call void @cache_module_Pipeline_VITIS_LOOP_11_1, i8 %newData, i6 %or_ln11, i64 %cacheMemory" [dsd2-cache-memory/mem-example.cpp:11]   --->   Operation 55 'call' 'call_ln11' <Predicate = true> <Delay = 0.00> <CoreType = "Generic">   --->   Core 0 '' <Latency = 0> <II = 1> <Delay = 1.00> <Generic> <Opcode : >

State 4 <SV = 3> <Delay = 1.65>
ST_4 : Operation 56 [1/2] (0.00ns)   --->   "%call_ln11 = call void @cache_module_Pipeline_VITIS_LOOP_11_1, i8 %newData, i6 %or_ln11, i64 %cacheMemory" [dsd2-cache-memory/mem-example.cpp:11]   --->   Operation 56 'call' 'call_ln11' <Predicate = (updateDataValid_read)> <Delay = 0.00> <CoreType = "Generic">   --->   Core 0 '' <Latency = 0> <II = 1> <Delay = 1.00> <Generic> <Opcode : >
ST_4 : Operation 57 [1/1] (0.00ns)   --->   "%br_ln0 = br void %if.end"   --->   Operation 57 'br' 'br_ln0' <Predicate = (updateDataValid_read)> <Delay = 0.00>
ST_4 : Operation 58 [1/1] (0.00ns)   --->   "%br_ln14 = br i1 %updateTagValid_read, void %VITIS_LOOP_20_2, void %if.then19" [dsd2-cache-memory/mem-example.cpp:14]   --->   Operation 58 'br' 'br_ln14' <Predicate = true> <Delay = 0.00>
ST_4 : Operation 59 [1/1] (0.00ns)   --->   "%trunc_ln15 = trunc i8 %updateSet_read" [dsd2-cache-memory/mem-example.cpp:15]   --->   Operation 59 'trunc' 'trunc_ln15' <Predicate = (updateTagValid_read)> <Delay = 0.00>
ST_4 : Operation 60 [1/1] (0.00ns)   --->   "%empty = trunc i8 %updateWay_read" [dsd2-cache-memory/mem-example.cpp:7]   --->   Operation 60 'trunc' 'empty' <Predicate = (updateTagValid_read)> <Delay = 0.00>
ST_4 : Operation 61 [1/1] (1.65ns)   --->   "%tmp = add i3 %empty, i3 %trunc_ln15" [dsd2-cache-memory/mem-example.cpp:7]   --->   Operation 61 'add' 'tmp' <Predicate = (updateTagValid_read)> <Delay = 1.65> <CoreInst = "Adder">   --->   Core 1 'Adder' <Latency = 0> <II = 1> <Delay = 1.65> <FuncUnit> <Opcode : 'add' 'sub'> <InPorts = 2> <OutPorts = 1>
ST_4 : Operation 62 [1/1] (0.00ns)   --->   "%trunc_ln15_1 = trunc i32 %newTag_read" [dsd2-cache-memory/mem-example.cpp:15]   --->   Operation 62 'trunc' 'trunc_ln15_1' <Predicate = (updateTagValid_read)> <Delay = 0.00>

State 5 <SV = 4> <Delay = 2.32>
ST_5 : Operation 63 [1/1] (0.00ns)   --->   "%zext_ln15 = zext i3 %tmp" [dsd2-cache-memory/mem-example.cpp:15]   --->   Operation 63 'zext' 'zext_ln15' <Predicate = true> <Delay = 0.00>
ST_5 : Operation 64 [1/1] (0.00ns)   --->   "%cacheMemory_addr_1 = getelementptr i64 %cacheMemory, i64 0, i64 %zext_ln15" [dsd2-cache-memory/mem-example.cpp:15]   --->   Operation 64 'getelementptr' 'cacheMemory_addr_1' <Predicate = true> <Delay = 0.00>
ST_5 : Operation 65 [2/2] (2.32ns)   --->   "%cacheMemory_load_1 = load i3 %cacheMemory_addr_1" [dsd2-cache-memory/mem-example.cpp:15]   --->   Operation 65 'load' 'cacheMemory_load_1' <Predicate = true> <Delay = 2.32> <CoreInst = "RAM">   --->   Core 82 'RAM' <Latency = 1> <II = 1> <Delay = 2.32> <Storage> <Opcode : 'load' 'store'> <Ports = 2> <Width = 64> <Depth = 8> <RAM>

State 6 <SV = 5> <Delay = 4.64>
ST_6 : Operation 66 [1/2] (2.32ns)   --->   "%cacheMemory_load_1 = load i3 %cacheMemory_addr_1" [dsd2-cache-memory/mem-example.cpp:15]   --->   Operation 66 'load' 'cacheMemory_load_1' <Predicate = (updateTagValid_read)> <Delay = 2.32> <CoreInst = "RAM">   --->   Core 82 'RAM' <Latency = 1> <II = 1> <Delay = 2.32> <Storage> <Opcode : 'load' 'store'> <Ports = 2> <Width = 64> <Depth = 8> <RAM>
ST_6 : Operation 67 [1/1] (0.00ns)   --->   "%tmp_5 = partselect i3 @_ssdm_op_PartSelect.i3.i64.i32.i32, i64 %cacheMemory_load_1, i32 29, i32 31" [dsd2-cache-memory/mem-example.cpp:15]   --->   Operation 67 'partselect' 'tmp_5' <Predicate = (updateTagValid_read)> <Delay = 0.00>
ST_6 : Operation 68 [1/1] (0.00ns)   --->   "%tmp1 = bitconcatenate i32 @_ssdm_op_BitConcatenate.i32.i3.i27.i2, i3 %tmp_5, i27 %trunc_ln15_1, i2 0" [dsd2-cache-memory/mem-example.cpp:16]   --->   Operation 68 'bitconcatenate' 'tmp1' <Predicate = (updateTagValid_read)> <Delay = 0.00>
ST_6 : Operation 69 [1/1] (0.00ns)   --->   "%or_ln16 = or i32 %tmp1, i32 1" [dsd2-cache-memory/mem-example.cpp:16]   --->   Operation 69 'or' 'or_ln16' <Predicate = (updateTagValid_read)> <Delay = 0.00>
ST_6 : Operation 70 [1/1] (0.00ns)   --->   "%zext_ln17 = zext i32 %or_ln16" [dsd2-cache-memory/mem-example.cpp:17]   --->   Operation 70 'zext' 'zext_ln17' <Predicate = (updateTagValid_read)> <Delay = 0.00>
ST_6 : Operation 71 [1/1] (2.32ns)   --->   "%store_ln17 = store void @_ssdm_op_Write.bram.p0L_a8i8packedL, i3 %cacheMemory_addr_1, i64 %zext_ln17, i8 15" [dsd2-cache-memory/mem-example.cpp:17]   --->   Operation 71 'store' 'store_ln17' <Predicate = (updateTagValid_read)> <Delay = 2.32> <CoreInst = "RAM">   --->   Core 82 'RAM' <Latency = 1> <II = 1> <Delay = 2.32> <Storage> <Opcode : 'load' 'store'> <Ports = 2> <Width = 64> <Depth = 8> <RAM>
ST_6 : Operation 72 [1/1] (0.00ns)   --->   "%br_ln18 = br void %VITIS_LOOP_20_2" [dsd2-cache-memory/mem-example.cpp:18]   --->   Operation 72 'br' 'br_ln18' <Predicate = (updateTagValid_read)> <Delay = 0.00>

State 7 <SV = 6> <Delay = 2.32>
ST_7 : Operation 73 [1/1] (0.00ns)   --->   "%bf_lshr_cast = partselect i3 @_ssdm_op_PartSelect.i3.i32.i32.i32, i32 %address_read, i32 27, i32 29" [dsd2-cache-memory/mem-example.cpp:7]   --->   Operation 73 'partselect' 'bf_lshr_cast' <Predicate = true> <Delay = 0.00>
ST_7 : Operation 74 [1/1] (0.00ns)   --->   "%idxprom48 = zext i3 %bf_lshr_cast" [dsd2-cache-memory/mem-example.cpp:7]   --->   Operation 74 'zext' 'idxprom48' <Predicate = true> <Delay = 0.00>
ST_7 : Operation 75 [1/1] (0.00ns)   --->   "%cacheMemory_addr_2 = getelementptr i64 %cacheMemory, i64 0, i64 %idxprom48" [dsd2-cache-memory/mem-example.cpp:21]   --->   Operation 75 'getelementptr' 'cacheMemory_addr_2' <Predicate = true> <Delay = 0.00>
ST_7 : Operation 76 [2/2] (2.32ns)   --->   "%cacheMemory_load_2 = load i3 %cacheMemory_addr_2" [dsd2-cache-memory/mem-example.cpp:21]   --->   Operation 76 'load' 'cacheMemory_load_2' <Predicate = true> <Delay = 2.32> <CoreInst = "RAM">   --->   Core 82 'RAM' <Latency = 1> <II = 1> <Delay = 2.32> <Storage> <Opcode : 'load' 'store'> <Ports = 2> <Width = 64> <Depth = 8> <RAM>

State 8 <SV = 7> <Delay = 6.91>
ST_8 : Operation 77 [1/2] (2.32ns)   --->   "%cacheMemory_load_2 = load i3 %cacheMemory_addr_2" [dsd2-cache-memory/mem-example.cpp:21]   --->   Operation 77 'load' 'cacheMemory_load_2' <Predicate = true> <Delay = 2.32> <CoreInst = "RAM">   --->   Core 82 'RAM' <Latency = 1> <II = 1> <Delay = 2.32> <Storage> <Opcode : 'load' 'store'> <Ports = 2> <Width = 64> <Depth = 8> <RAM>
ST_8 : Operation 78 [1/1] (0.00ns)   --->   "%trunc_ln21 = trunc i64 %cacheMemory_load_2" [dsd2-cache-memory/mem-example.cpp:21]   --->   Operation 78 'trunc' 'trunc_ln21' <Predicate = true> <Delay = 0.00>
ST_8 : Operation 79 [1/1] (0.00ns)   --->   "%br_ln21 = br i1 %trunc_ln21, void %for.end99, void %land.lhs.true" [dsd2-cache-memory/mem-example.cpp:21]   --->   Operation 79 'br' 'br_ln21' <Predicate = true> <Delay = 0.00>
ST_8 : Operation 80 [1/1] (0.00ns)   --->   "%trunc_ln21_3 = partselect i27 @_ssdm_op_PartSelect.i27.i64.i32.i32, i64 %cacheMemory_load_2, i32 2, i32 28" [dsd2-cache-memory/mem-example.cpp:21]   --->   Operation 80 'partselect' 'trunc_ln21_3' <Predicate = (trunc_ln21)> <Delay = 0.00>
ST_8 : Operation 81 [1/1] (2.45ns)   --->   "%icmp_ln21 = icmp_eq  i27 %trunc_ln21_3, i27 %trunc_ln7" [dsd2-cache-memory/mem-example.cpp:21]   --->   Operation 81 'icmp' 'icmp_ln21' <Predicate = (trunc_ln21)> <Delay = 2.45> <CoreInst = "Cmp">   --->   Core 9 'Cmp' <Latency = 0> <II = 1> <Delay = 2.45> <FuncUnit> <Opcode : 'icmp'> <InPorts = 2> <OutPorts = 1>
ST_8 : Operation 82 [1/1] (0.00ns)   --->   "%br_ln21 = br i1 %icmp_ln21, void %for.end99, void %cleanup" [dsd2-cache-memory/mem-example.cpp:21]   --->   Operation 82 'br' 'br_ln21' <Predicate = (trunc_ln21)> <Delay = 0.00>
ST_8 : Operation 83 [1/1] (0.00ns)   --->   "%write_ln28 = write void @_ssdm_op_Write.ap_auto.i1P0A, i1 %hit, i1 0" [dsd2-cache-memory/mem-example.cpp:28]   --->   Operation 83 'write' 'write_ln28' <Predicate = (!icmp_ln21) | (!trunc_ln21)> <Delay = 0.00>
ST_8 : Operation 84 [1/1] (0.00ns)   --->   "%br_ln29 = br void %return" [dsd2-cache-memory/mem-example.cpp:29]   --->   Operation 84 'br' 'br_ln29' <Predicate = (!icmp_ln21) | (!trunc_ln21)> <Delay = 0.00>
ST_8 : Operation 85 [1/1] (0.00ns)   --->   "%write_ln22 = write void @_ssdm_op_Write.ap_auto.i1P0A, i1 %hit, i1 1" [dsd2-cache-memory/mem-example.cpp:22]   --->   Operation 85 'write' 'write_ln22' <Predicate = (trunc_ln21 & icmp_ln21)> <Delay = 0.00>
ST_8 : Operation 86 [1/1] (0.00ns)   --->   "%tmp_6 = partselect i2 @_ssdm_op_PartSelect.i2.i32.i32.i32, i32 %address_read, i32 30, i32 31" [dsd2-cache-memory/mem-example.cpp:23]   --->   Operation 86 'partselect' 'tmp_6' <Predicate = (trunc_ln21 & icmp_ln21)> <Delay = 0.00>
ST_8 : Operation 87 [1/1] (0.00ns)   --->   "%zext_ln23_cast = bitconcatenate i6 @_ssdm_op_BitConcatenate.i6.i1.i2.i3, i1 1, i2 %tmp_6, i3 0" [dsd2-cache-memory/mem-example.cpp:23]   --->   Operation 87 'bitconcatenate' 'zext_ln23_cast' <Predicate = (trunc_ln21 & icmp_ln21)> <Delay = 0.00>
ST_8 : Operation 88 [1/1] (0.00ns)   --->   "%zext_ln23 = zext i6 %zext_ln23_cast" [dsd2-cache-memory/mem-example.cpp:23]   --->   Operation 88 'zext' 'zext_ln23' <Predicate = (trunc_ln21 & icmp_ln21)> <Delay = 0.00>
ST_8 : Operation 89 [1/1] (4.59ns)   --->   "%lshr_ln23 = lshr i64 %cacheMemory_load_2, i64 %zext_ln23" [dsd2-cache-memory/mem-example.cpp:23]   --->   Operation 89 'lshr' 'lshr_ln23' <Predicate = (trunc_ln21 & icmp_ln21)> <Delay = 4.59> <CoreInst = "Shifter">   --->   Core 75 'Shifter' <Latency = 0> <II = 1> <Delay = 4.59> <FuncUnit> <Opcode : 'shl' 'lshr' 'ashr'> <InPorts = 2> <OutPorts = 1>
ST_8 : Operation 90 [1/1] (0.00ns)   --->   "%trunc_ln23 = trunc i64 %lshr_ln23" [dsd2-cache-memory/mem-example.cpp:23]   --->   Operation 90 'trunc' 'trunc_ln23' <Predicate = (trunc_ln21 & icmp_ln21)> <Delay = 0.00>
ST_8 : Operation 91 [1/1] (0.00ns)   --->   "%write_ln23 = write void @_ssdm_op_Write.ap_auto.i8P0A, i8 %data, i8 %trunc_ln23" [dsd2-cache-memory/mem-example.cpp:23]   --->   Operation 91 'write' 'write_ln23' <Predicate = (trunc_ln21 & icmp_ln21)> <Delay = 0.00>
ST_8 : Operation 92 [1/1] (0.00ns)   --->   "%tmp_1 = bitselect i1 @_ssdm_op_BitSelect.i1.i64.i32, i64 %cacheMemory_load_2, i32 1" [dsd2-cache-memory/mem-example.cpp:24]   --->   Operation 92 'bitselect' 'tmp_1' <Predicate = (trunc_ln21 & icmp_ln21)> <Delay = 0.00>
ST_8 : Operation 93 [1/1] (0.00ns)   --->   "%write_ln24 = write void @_ssdm_op_Write.ap_auto.i1P0A, i1 %dirty, i1 %tmp_1" [dsd2-cache-memory/mem-example.cpp:24]   --->   Operation 93 'write' 'write_ln24' <Predicate = (trunc_ln21 & icmp_ln21)> <Delay = 0.00>
ST_8 : Operation 94 [1/1] (0.00ns)   --->   "%br_ln0 = br void %return"   --->   Operation 94 'br' 'br_ln0' <Predicate = (trunc_ln21 & icmp_ln21)> <Delay = 0.00>
ST_8 : Operation 95 [1/1] (0.00ns)   --->   "%ret_ln29 = ret" [dsd2-cache-memory/mem-example.cpp:29]   --->   Operation 95 'ret' 'ret_ln29' <Predicate = true> <Delay = 0.00>


============================================================
+ Verbose Summary: Timing violations
============================================================
Target clock period: 10ns, clock uncertainty: 2.7ns.

 <State 1>: 4.15ns
The critical path consists of the following:
	wire read operation ('updateWay', dsd2-cache-memory/mem-example.cpp:7) on port 'updateWay' (dsd2-cache-memory/mem-example.cpp:7) [15]  (0 ns)
	'add' operation ('add_ln9', dsd2-cache-memory/mem-example.cpp:9) [47]  (1.83 ns)
	'getelementptr' operation ('cacheMemory_addr', dsd2-cache-memory/mem-example.cpp:9) [50]  (0 ns)
	'load' operation ('cacheMemory_load', dsd2-cache-memory/mem-example.cpp:9) on array 'cacheMemory' [51]  (2.32 ns)

 <State 2>: 4.64ns
The critical path consists of the following:
	'load' operation ('cacheMemory_load', dsd2-cache-memory/mem-example.cpp:9) on array 'cacheMemory' [51]  (2.32 ns)
	'or' operation ('or_ln10', dsd2-cache-memory/mem-example.cpp:10) [54]  (0 ns)
	'store' operation ('store_ln10', dsd2-cache-memory/mem-example.cpp:10) of constant <constant:_ssdm_op_Write.bram.p0L_a8i8packedL> on array 'cacheMemory' [56]  (2.32 ns)

 <State 3>: 0ns
The critical path consists of the following:

 <State 4>: 1.65ns
The critical path consists of the following:
	'add' operation ('tmp', dsd2-cache-memory/mem-example.cpp:7) [65]  (1.65 ns)

 <State 5>: 2.32ns
The critical path consists of the following:
	'getelementptr' operation ('cacheMemory_addr_1', dsd2-cache-memory/mem-example.cpp:15) [67]  (0 ns)
	'load' operation ('cacheMemory_load_1', dsd2-cache-memory/mem-example.cpp:15) on array 'cacheMemory' [68]  (2.32 ns)

 <State 6>: 4.64ns
The critical path consists of the following:
	'load' operation ('cacheMemory_load_1', dsd2-cache-memory/mem-example.cpp:15) on array 'cacheMemory' [68]  (2.32 ns)
	'or' operation ('or_ln16', dsd2-cache-memory/mem-example.cpp:16) [72]  (0 ns)
	'store' operation ('store_ln17', dsd2-cache-memory/mem-example.cpp:17) of constant <constant:_ssdm_op_Write.bram.p0L_a8i8packedL> on array 'cacheMemory' [74]  (2.32 ns)

 <State 7>: 2.32ns
The critical path consists of the following:
	'getelementptr' operation ('cacheMemory_addr_2', dsd2-cache-memory/mem-example.cpp:21) [79]  (0 ns)
	'load' operation ('cacheMemory_load_2', dsd2-cache-memory/mem-example.cpp:21) on array 'cacheMemory' [80]  (2.32 ns)

 <State 8>: 6.92ns
The critical path consists of the following:
	'load' operation ('cacheMemory_load_2', dsd2-cache-memory/mem-example.cpp:21) on array 'cacheMemory' [80]  (2.32 ns)
	'lshr' operation ('lshr_ln23', dsd2-cache-memory/mem-example.cpp:23) [95]  (4.59 ns)


============================================================
+ Verbose Summary: Binding
============================================================
N/A
* FSMD analyzer results:
  - Output states:
 - Input state : 
  - Chain level:
	State 1
	State 2
	State 3
	State 4
	State 5
	State 6
	State 7
	State 8


============================================================
+ Verbose Summary: Datapath Resource usage 
============================================================
N/A
