

================================================================
== Vitis HLS Report for 'cache_module_Pipeline_VITIS_LOOP_11_1'
================================================================
* Date:           Sun Jun  5 00:08:35 2022

* Version:        2022.1 (Build 3526262 on Mon Apr 18 15:47:01 MDT 2022)
* Project:        dsd2-cache-memory
* Solution:       solution1 (Vivado IP Flow Target)
* Product family: zynq
* Target device:  xc7z020-clg400-1


================================================================
== Performance Estimates
================================================================
+ Timing: 
    * Summary: 
    +--------+----------+----------+------------+
    |  Clock |  Target  | Estimated| Uncertainty|
    +--------+----------+----------+------------+
    |ap_clk  |  10.00 ns|  7.794 ns|     2.00 ns|
    +--------+----------+----------+------------+

+ Latency: 
    * Summary: 
    +---------+---------+-----------+-----------+-----+-----+---------+
    |  Latency (cycles) |   Latency (absolute)  |  Interval | Pipeline|
    |   min   |   max   |    min    |    max    | min | max |   Type  |
    +---------+---------+-----------+-----------+-----+-----+---------+
    |        6|        6|  60.000 ns|  60.000 ns|    6|    6|       no|
    +---------+---------+-----------+-----------+-----+-----+---------+

    + Detail: 
        * Instance: 
        N/A

        * Loop: 
        +-------------------+---------+---------+----------+-----------+-----------+------+----------+
        |                   |  Latency (cycles) | Iteration|  Initiation Interval  | Trip |          |
        |     Loop Name     |   min   |   max   |  Latency |  achieved |   target  | Count| Pipelined|
        +-------------------+---------+---------+----------+-----------+-----------+------+----------+
        |- VITIS_LOOP_11_1  |        4|        4|         2|          1|          1|     4|       yes|
        +-------------------+---------+---------+----------+-----------+-----------+------+----------+

============================================================
+ Verbose Summary: Synthesis Manager
============================================================
InlineROM: 1
ExposeGlobal: 0
============================================================
+ Verbose Summary: CDFG Model
============================================================
IsTopModel: 0
ResetActiveHigh: 1
IsCombinational: 0
IsDatapathOnly: 0
HasWiredReturn: 1
HasMFsm: 2
HasVarLatency: 1
IsPipeline: 0
IsRtlPipelined: 0
IsInstanceOverlapped: 0
IsDontTouch: 0
HasImplIP: 0
IsGatedGlobalClock: 0

+ Individual pipeline summary: 
  * Pipeline-0: initiation interval (II) = 1, depth = 2


============================================================
+ Verbose Summary: Schedule
============================================================
* Number of FSM states : 2
* Pipeline : 1
  Pipeline-0 : II = 1, D = 2, States = { 1 2 }
* Dataflow Pipeline: 0

* FSM state transitions: 
1 --> 2 
2 --> 

* FSM state operations: 

State 1 <SV = 0> <Delay = 3.23>
ST_1 : Operation 5 [1/1] (0.00ns)   --->   "%i = alloca i32 1"   --->   Operation 5 'alloca' 'i' <Predicate = true> <Delay = 0.00>
ST_1 : Operation 6 [1/1] (0.00ns)   --->   "%specbramwithbyteenable_ln0 = specbramwithbyteenable void @_ssdm_op_SpecBRAMWithByteEnable, i64 %cacheMemory"   --->   Operation 6 'specbramwithbyteenable' 'specbramwithbyteenable_ln0' <Predicate = true> <Delay = 0.00>
ST_1 : Operation 7 [1/1] (0.00ns)   --->   "%specinterface_ln0 = specinterface void @_ssdm_op_SpecInterface, i8 %newData, void @empty_1, i32 0, i32 0, void @empty_0, i32 4294967295, i32 0, void @empty_0, void @empty_0, void @empty_0, i32 0, i32 0, i32 0, i32 0, void @empty_0, void @empty_0, i32 4294967295, i32 0"   --->   Operation 7 'specinterface' 'specinterface_ln0' <Predicate = true> <Delay = 0.00>
ST_1 : Operation 8 [1/1] (0.00ns)   --->   "%or_ln11_read = read i6 @_ssdm_op_Read.ap_auto.i6, i6 %or_ln11"   --->   Operation 8 'read' 'or_ln11_read' <Predicate = true> <Delay = 0.00>
ST_1 : Operation 9 [1/1] (1.58ns)   --->   "%store_ln0 = store i3 0, i3 %i"   --->   Operation 9 'store' 'store_ln0' <Predicate = true> <Delay = 1.58>
ST_1 : Operation 10 [1/1] (0.00ns)   --->   "%br_ln0 = br void %for.inc"   --->   Operation 10 'br' 'br_ln0' <Predicate = true> <Delay = 0.00>
ST_1 : Operation 11 [1/1] (0.00ns)   --->   "%i_2 = load i3 %i" [dsd2-cache-memory/mem-example.cpp:11]   --->   Operation 11 'load' 'i_2' <Predicate = true> <Delay = 0.00>
ST_1 : Operation 12 [1/1] (0.00ns)   --->   "%specpipeline_ln0 = specpipeline void @_ssdm_op_SpecPipeline, i32 4294967295, i32 0, i32 1, i32 0, void @p_str"   --->   Operation 12 'specpipeline' 'specpipeline_ln0' <Predicate = true> <Delay = 0.00>
ST_1 : Operation 13 [1/1] (1.13ns)   --->   "%icmp_ln11 = icmp_eq  i3 %i_2, i3 4" [dsd2-cache-memory/mem-example.cpp:11]   --->   Operation 13 'icmp' 'icmp_ln11' <Predicate = true> <Delay = 1.13> <CoreInst = "Cmp">   --->   Core 9 'Cmp' <Latency = 0> <II = 1> <Delay = 1.13> <FuncUnit> <Opcode : 'icmp'> <InPorts = 2> <OutPorts = 1>
ST_1 : Operation 14 [1/1] (0.00ns)   --->   "%empty = speclooptripcount i32 @_ssdm_op_SpecLoopTripCount, i64 4, i64 4, i64 4"   --->   Operation 14 'speclooptripcount' 'empty' <Predicate = true> <Delay = 0.00>
ST_1 : Operation 15 [1/1] (1.65ns)   --->   "%add_ln11_1 = add i3 %i_2, i3 1" [dsd2-cache-memory/mem-example.cpp:11]   --->   Operation 15 'add' 'add_ln11_1' <Predicate = true> <Delay = 1.65> <CoreInst = "Adder">   --->   Core 1 'Adder' <Latency = 0> <II = 1> <Delay = 1.65> <FuncUnit> <Opcode : 'add' 'sub'> <InPorts = 2> <OutPorts = 1>
ST_1 : Operation 16 [1/1] (0.00ns)   --->   "%br_ln11 = br i1 %icmp_ln11, void %for.inc.split, void %if.end.loopexit.exitStub" [dsd2-cache-memory/mem-example.cpp:11]   --->   Operation 16 'br' 'br_ln11' <Predicate = true> <Delay = 0.00>
ST_1 : Operation 17 [1/1] (0.00ns)   --->   "%i_cast4 = zext i3 %i_2" [dsd2-cache-memory/mem-example.cpp:11]   --->   Operation 17 'zext' 'i_cast4' <Predicate = (!icmp_ln11)> <Delay = 0.00>
ST_1 : Operation 18 [1/1] (0.00ns)   --->   "%newData_addr = getelementptr i8 %newData, i64 0, i64 %i_cast4" [dsd2-cache-memory/mem-example.cpp:11]   --->   Operation 18 'getelementptr' 'newData_addr' <Predicate = (!icmp_ln11)> <Delay = 0.00>
ST_1 : Operation 19 [2/2] (2.32ns)   --->   "%newData_load = load i2 %newData_addr" [dsd2-cache-memory/mem-example.cpp:11]   --->   Operation 19 'load' 'newData_load' <Predicate = (!icmp_ln11)> <Delay = 2.32> <CoreInst = "RAM">   --->   Core 82 'RAM' <Latency = 1> <II = 1> <Delay = 2.32> <Storage> <Opcode : 'load' 'store'> <Ports = 2> <Width = 8> <Depth = 4> <RAM>
ST_1 : Operation 20 [1/1] (1.58ns)   --->   "%store_ln11 = store i3 %add_ln11_1, i3 %i" [dsd2-cache-memory/mem-example.cpp:11]   --->   Operation 20 'store' 'store_ln11' <Predicate = (!icmp_ln11)> <Delay = 1.58>
ST_1 : Operation 38 [1/1] (0.00ns)   --->   "%ret_ln0 = ret"   --->   Operation 38 'ret' 'ret_ln0' <Predicate = (icmp_ln11)> <Delay = 0.00>

State 2 <SV = 1> <Delay = 7.79>
ST_2 : Operation 21 [1/1] (0.00ns)   --->   "%i_cast = zext i3 %i_2" [dsd2-cache-memory/mem-example.cpp:11]   --->   Operation 21 'zext' 'i_cast' <Predicate = true> <Delay = 0.00>
ST_2 : Operation 22 [1/1] (0.00ns)   --->   "%specloopname_ln11 = specloopname void @_ssdm_op_SpecLoopName, void @empty_4" [dsd2-cache-memory/mem-example.cpp:11]   --->   Operation 22 'specloopname' 'specloopname_ln11' <Predicate = true> <Delay = 0.00>
ST_2 : Operation 23 [1/2] (2.32ns)   --->   "%newData_load = load i2 %newData_addr" [dsd2-cache-memory/mem-example.cpp:11]   --->   Operation 23 'load' 'newData_load' <Predicate = true> <Delay = 2.32> <CoreInst = "RAM">   --->   Core 82 'RAM' <Latency = 1> <II = 1> <Delay = 2.32> <Storage> <Opcode : 'load' 'store'> <Ports = 2> <Width = 8> <Depth = 4> <RAM>
ST_2 : Operation 24 [1/1] (0.00ns)   --->   "%trunc_ln11 = trunc i3 %i_2" [dsd2-cache-memory/mem-example.cpp:11]   --->   Operation 24 'trunc' 'trunc_ln11' <Predicate = true> <Delay = 0.00>
ST_2 : Operation 25 [1/1] (1.82ns)   --->   "%add_ln11 = add i6 %i_cast, i6 %or_ln11_read" [dsd2-cache-memory/mem-example.cpp:11]   --->   Operation 25 'add' 'add_ln11' <Predicate = true> <Delay = 1.82> <CoreInst = "Adder">   --->   Core 1 'Adder' <Latency = 0> <II = 1> <Delay = 1.82> <FuncUnit> <Opcode : 'add' 'sub'> <InPorts = 2> <OutPorts = 1>
ST_2 : Operation 26 [1/1] (0.00ns)   --->   "%zext_ln11 = zext i8 %newData_load" [dsd2-cache-memory/mem-example.cpp:11]   --->   Operation 26 'zext' 'zext_ln11' <Predicate = true> <Delay = 0.00>
ST_2 : Operation 27 [1/1] (0.00ns)   --->   "%zext_ln11_1_cast = bitconcatenate i3 @_ssdm_op_BitConcatenate.i3.i1.i2, i1 1, i2 %trunc_ln11" [dsd2-cache-memory/mem-example.cpp:11]   --->   Operation 27 'bitconcatenate' 'zext_ln11_1_cast' <Predicate = true> <Delay = 0.00>
ST_2 : Operation 28 [1/1] (0.00ns)   --->   "%zext_ln11_1 = zext i3 %zext_ln11_1_cast" [dsd2-cache-memory/mem-example.cpp:11]   --->   Operation 28 'zext' 'zext_ln11_1' <Predicate = true> <Delay = 0.00>
ST_2 : Operation 29 [1/1] (2.12ns)   --->   "%shl_ln11 = shl i8 1, i8 %zext_ln11_1" [dsd2-cache-memory/mem-example.cpp:11]   --->   Operation 29 'shl' 'shl_ln11' <Predicate = true> <Delay = 2.12> <CoreInst = "Shifter">   --->   Core 75 'Shifter' <Latency = 0> <II = 1> <Delay = 2.12> <FuncUnit> <Opcode : 'shl' 'lshr' 'ashr'> <InPorts = 2> <OutPorts = 1>
ST_2 : Operation 30 [1/1] (0.00ns)   --->   "%zext_ln11_2_cast = bitconcatenate i6 @_ssdm_op_BitConcatenate.i6.i1.i2.i3, i1 1, i2 %trunc_ln11, i3 0" [dsd2-cache-memory/mem-example.cpp:11]   --->   Operation 30 'bitconcatenate' 'zext_ln11_2_cast' <Predicate = true> <Delay = 0.00>
ST_2 : Operation 31 [1/1] (0.00ns)   --->   "%zext_ln11_2 = zext i6 %zext_ln11_2_cast" [dsd2-cache-memory/mem-example.cpp:11]   --->   Operation 31 'zext' 'zext_ln11_2' <Predicate = true> <Delay = 0.00>
ST_2 : Operation 32 [1/1] (3.14ns)   --->   "%shl_ln11_1 = shl i64 %zext_ln11, i64 %zext_ln11_2" [dsd2-cache-memory/mem-example.cpp:11]   --->   Operation 32 'shl' 'shl_ln11_1' <Predicate = true> <Delay = 3.14> <CoreInst = "Shifter">   --->   Core 75 'Shifter' <Latency = 0> <II = 1> <Delay = 3.14> <FuncUnit> <Opcode : 'shl' 'lshr' 'ashr'> <InPorts = 2> <OutPorts = 1>
ST_2 : Operation 33 [1/1] (0.00ns)   --->   "%lshr_ln = partselect i3 @_ssdm_op_PartSelect.i3.i6.i32.i32, i6 %add_ln11, i32 3, i32 5" [dsd2-cache-memory/mem-example.cpp:11]   --->   Operation 33 'partselect' 'lshr_ln' <Predicate = true> <Delay = 0.00>
ST_2 : Operation 34 [1/1] (0.00ns)   --->   "%zext_ln11_3 = zext i3 %lshr_ln" [dsd2-cache-memory/mem-example.cpp:11]   --->   Operation 34 'zext' 'zext_ln11_3' <Predicate = true> <Delay = 0.00>
ST_2 : Operation 35 [1/1] (0.00ns)   --->   "%cacheMemory_addr = getelementptr i64 %cacheMemory, i64 0, i64 %zext_ln11_3" [dsd2-cache-memory/mem-example.cpp:11]   --->   Operation 35 'getelementptr' 'cacheMemory_addr' <Predicate = true> <Delay = 0.00>
ST_2 : Operation 36 [1/1] (2.32ns)   --->   "%store_ln11 = store void @_ssdm_op_Write.bram.p0L_a8i8packedL, i3 %cacheMemory_addr, i64 %shl_ln11_1, i8 %shl_ln11" [dsd2-cache-memory/mem-example.cpp:11]   --->   Operation 36 'store' 'store_ln11' <Predicate = true> <Delay = 2.32> <CoreInst = "RAM">   --->   Core 82 'RAM' <Latency = 1> <II = 1> <Delay = 2.32> <Storage> <Opcode : 'load' 'store'> <Ports = 2> <Width = 64> <Depth = 8> <RAM>
ST_2 : Operation 37 [1/1] (0.00ns)   --->   "%br_ln11 = br void %for.inc" [dsd2-cache-memory/mem-example.cpp:11]   --->   Operation 37 'br' 'br_ln11' <Predicate = true> <Delay = 0.00>


============================================================
+ Verbose Summary: Timing violations
============================================================
Target clock period: 10ns, clock uncertainty: 2ns.

 <State 1>: 3.24ns
The critical path consists of the following:
	'alloca' operation ('i') [3]  (0 ns)
	'load' operation ('i', dsd2-cache-memory/mem-example.cpp:11) on local variable 'i' [10]  (0 ns)
	'add' operation ('add_ln11_1', dsd2-cache-memory/mem-example.cpp:11) [14]  (1.65 ns)
	'store' operation ('store_ln11', dsd2-cache-memory/mem-example.cpp:11) of variable 'add_ln11_1', dsd2-cache-memory/mem-example.cpp:11 on local variable 'i' [35]  (1.59 ns)

 <State 2>: 7.79ns
The critical path consists of the following:
	'load' operation ('newData_load', dsd2-cache-memory/mem-example.cpp:11) on array 'newData' [21]  (2.32 ns)
	'shl' operation ('shl_ln11_1', dsd2-cache-memory/mem-example.cpp:11) [30]  (3.15 ns)
	'store' operation ('store_ln11', dsd2-cache-memory/mem-example.cpp:11) of constant <constant:_ssdm_op_Write.bram.p0L_a8i8packedL> on array 'cacheMemory' [34]  (2.32 ns)


============================================================
+ Verbose Summary: Binding
============================================================
N/A
* FSMD analyzer results:
  - Output states:
 - Input state : 
  - Chain level:
	State 1
	State 2


============================================================
+ Verbose Summary: Datapath Resource usage 
============================================================
N/A
