{
  "data": [
    {
      "schemaVersion": "1.12.0",
      "slug": "android-default-toolbar-placement-treatment-a-rollout",
      "id": "android-default-toolbar-placement-treatment-a-rollout",
      "arguments": {},
      "application": "org.mozilla.firefox",
      "appName": "fenix",
      "appId": "org.mozilla.firefox",
      "channel": "release",
      "userFacingName": "Android default toolbar placement - Treatment A Rollout",
      "userFacingDescription": "Testing default position of toolbar.",
      "isEnrollmentPaused": false,
      "isRollout": true,
      "bucketConfig": {
        "randomizationUnit": "nimbus_id",
        "namespace": "fenix-toolbar-release-mobile_first_run-rollout-1",
        "start": 0,
        "count": 10000,
        "total": 10000
      },
      "featureIds": [
        "toolbar"
      ],
      "probeSets": [],
      "outcomes": [],
      "branches": [
        {
          "slug": "treatment-a",
          "ratio": 1,
          "feature": {
            "featureId": "this-is-included-for-mobile-pre-96-support",
            "enabled": false,
            "value": {}
          },
          "features": [
            {
              "featureId": "toolbar",
              "enabled": true,
              "value": {
                "toolbar-position-top": true
              }
            }
          ]
        }
      ],
      "targeting": "((is_already_enrolled) || ((isFirstRun == 'true') && (app_version|versionCompare('116.!') >= 0)))",
      "startDate": "2023-08-09",
      "enrollmentEndDate": null,
      "endDate": null,
      "proposedDuration": 28,
      "proposedEnrollment": 7,
      "referenceBranch": "treatment-a",
      "featureValidationOptOut": false,
      "localizations": null,
      "locales": null,
      "publishedDate": null
    },
    {
      "schemaVersion": "1.12.0",
      "slug": "android-onboarding-remove-sync-card",
      "id": "android-onboarding-remove-sync-card",
      "arguments": {},
      "application": "org.mozilla.firefox",
      "appName": "fenix",
      "appId": "org.mozilla.firefox",
      "channel": "release",
      "userFacingName": "Android Onboarding - Remove Sync Card",
      "userFacingDescription": "Mobile Onboarding experiment",
      "isEnrollmentPaused": true,
      "isRollout": false,
      "bucketConfig": {
        "randomizationUnit": "nimbus_id",
        "namespace": "fenix-juno-onboarding-release-7",
        "start": 0,
        "count": 10000,
        "total": 10000
      },
      "featureIds": [
        "juno-onboarding"
      ],
      "probeSets": [],
      "outcomes": [
        {
          "slug": "onboarding",
          "priority": "primary"
        },
        {
          "slug": "default-browser",
          "priority": "secondary"
        }
      ],
      "branches": [
        {
          "slug": "control",
          "ratio": 1,
          "feature": {
            "featureId": "this-is-included-for-mobile-pre-96-support",
            "enabled": false,
            "value": {}
          },
          "features": [
            {
              "featureId": "juno-onboarding",
              "enabled": true,
              "value": {
                "cards": {}
              }
            }
          ]
        },
        {
          "slug": "treatment-a",
          "ratio": 1,
          "feature": {
            "featureId": "this-is-included-for-mobile-pre-96-support",
            "enabled": false,
            "value": {}
          },
          "features": [
            {
              "featureId": "juno-onboarding",
              "enabled": true,
              "value": {
                "cards": {
                  "sync-sign-in": {
                    "enabled": false
                  }
                }
              }
            }
          ]
        },
        {
          "slug": "treatment-b",
          "ratio": 1,
          "feature": {
            "featureId": "this-is-included-for-mobile-pre-96-support",
            "enabled": false,
            "value": {}
          },
          "features": [
            {
              "featureId": "juno-onboarding",
              "enabled": true,
              "value": {
                "cards": {
                  "notification-permission": {
                    "ordering": 40
                  },
                  "sync-sign-in": {
                    "ordering": 50
                  }
                }
              }
            }
          ]
        }
      ],
      "targeting": "((is_already_enrolled) || ((isFirstRun == 'true') && (app_version|versionCompare('126.!') >= 0) && (language in ['en'])))",
      "startDate": "2024-04-30",
      "enrollmentEndDate": "2024-05-30",
      "endDate": null,
      "proposedDuration": 42,
      "proposedEnrollment": 14,
      "referenceBranch": "control",
      "featureValidationOptOut": false,
      "localizations": null,
      "locales": null,
      "publishedDate": "2024-04-30T20:18:06.070479Z"
    }
  ]
}
