<?xml version="1.0" encoding="UTF-8" standalone="no"?>
<!-- Created with Inkscape (http://www.inkscape.org/) -->

<svg
   xmlns:dc="http://purl.org/dc/elements/1.1/"
   xmlns:cc="http://creativecommons.org/ns#"
   xmlns:rdf="http://www.w3.org/1999/02/22-rdf-syntax-ns#"
   xmlns:svg="http://www.w3.org/2000/svg"
   xmlns="http://www.w3.org/2000/svg"
   xmlns:sodipodi="http://sodipodi.sourceforge.net/DTD/sodipodi-0.dtd"
   xmlns:inkscape="http://www.inkscape.org/namespaces/inkscape"
   version="1.1"
   width="345.95032"
   height="554.34735"
   viewBox="0 0 345.95032 554.34735"
   id="svg2"
   inkscape:version="0.91 r13725"
   sodipodi:docname="JiTT_normal.svg">
  <sodipodi:namedview
     pagecolor="#ffffff"
     bordercolor="#666666"
     borderopacity="1"
     objecttolerance="10"
     gridtolerance="10"
     guidetolerance="10"
     inkscape:pageopacity="0"
     inkscape:pageshadow="2"
     inkscape:window-width="1278"
     inkscape:window-height="732"
     id="namedview169"
     showgrid="false"
     inkscape:zoom="1.7029034"
     inkscape:cx="172.97516"
     inkscape:cy="135.41578"
     inkscape:window-x="0"
     inkscape:window-y="0"
     inkscape:window-maximized="1"
     inkscape:current-layer="svg2" />
  <defs
     id="defs4">
    <marker
       refX="0"
       refY="0"
       orient="auto"
       id="Arrow2Mstart"
       style="overflow:visible">
      <path
         d="M 8.7185878,4.0337352 -2.2072895,0.01601326 8.7185884,-4.0017078 c -1.7454984,2.3720609 -1.7354408,5.6174519 -6e-7,8.035443 z"
         transform="scale(0.6,0.6)"
         id="path4743"
         style="fill-rule:evenodd;stroke-width:0.625;stroke-linejoin:round" />
    </marker>
    <marker
       refX="0"
       refY="0"
       orient="auto"
       id="Arrow2Mend"
       style="overflow:visible">
      <path
         d="M 8.7185878,4.0337352 -2.2072895,0.01601326 8.7185884,-4.0017078 c -1.7454984,2.3720609 -1.7354408,5.6174519 -6e-7,8.035443 z"
         transform="scale(-0.6,-0.6)"
         id="path4746"
         style="fill-rule:evenodd;stroke-width:0.625;stroke-linejoin:round" />
    </marker>
    <inkscape:path-effect
       effect="bend_path"
       id="path-effect5907" />
    <marker
       refX="0"
       refY="0"
       orient="auto"
       id="Arrow1Lstart"
       style="overflow:visible">
      <path
         d="M 0,0 5,-5 -12.5,0 5,5 z"
         transform="matrix(0.8,0,0,0.8,10,0)"
         id="path4719"
         style="fill-rule:evenodd;stroke:#000000;stroke-width:1pt" />
    </marker>
    <marker
       refX="0"
       refY="0"
       orient="auto"
       id="Arrow1Lend"
       style="overflow:visible">
      <path
         d="M 0,0 5,-5 -12.5,0 5,5 z"
         transform="matrix(-0.8,0,0,-0.8,-10,0)"
         id="path4722"
         style="fill-rule:evenodd;stroke:#000000;stroke-width:1pt" />
    </marker>
    <marker
       refX="0"
       refY="0"
       orient="auto"
       id="Arrow1Mstart"
       style="overflow:visible">
      <path
         d="M 0,0 5,-5 -12.5,0 5,5 z"
         transform="matrix(0.4,0,0,0.4,4,0)"
         id="path4725"
         style="fill-rule:evenodd;stroke:#000000;stroke-width:1pt" />
    </marker>
    <marker
       refX="0"
       refY="0"
       orient="auto"
       id="Arrow2Mend-3"
       style="overflow:visible">
      <path
         d="M 8.7185878,4.0337352 -2.2072895,0.01601326 8.7185884,-4.0017078 c -1.7454984,2.3720609 -1.7354408,5.6174519 -6e-7,8.035443 z"
         transform="scale(-0.6,-0.6)"
         id="path4746-6"
         style="fill-rule:evenodd;stroke-width:0.625;stroke-linejoin:round" />
    </marker>
    <marker
       refX="0"
       refY="0"
       orient="auto"
       id="Arrow2Mend-3-5"
       style="overflow:visible">
      <path
         d="M 8.7185878,4.0337352 -2.2072895,0.01601326 8.7185884,-4.0017078 c -1.7454984,2.3720609 -1.7354408,5.6174519 -6e-7,8.035443 z"
         transform="scale(-0.6,-0.6)"
         id="path4746-6-3"
         style="fill-rule:evenodd;stroke-width:0.625;stroke-linejoin:round" />
    </marker>
    <marker
       refX="0"
       refY="0"
       orient="auto"
       id="Arrow2Mend-3-6"
       style="overflow:visible">
      <path
         d="M 8.7185878,4.0337352 -2.2072895,0.01601326 8.7185884,-4.0017078 c -1.7454984,2.3720609 -1.7354408,5.6174519 -6e-7,8.035443 z"
         transform="scale(-0.6,-0.6)"
         id="path4746-6-2"
         style="fill-rule:evenodd;stroke-width:0.625;stroke-linejoin:round" />
    </marker>
    <marker
       refX="0"
       refY="0"
       orient="auto"
       id="Arrow2Mend-3-1"
       style="overflow:visible">
      <path
         d="M 8.7185878,4.0337352 -2.2072895,0.01601326 8.7185884,-4.0017078 c -1.7454984,2.3720609 -1.7354408,5.6174519 -6e-7,8.035443 z"
         transform="scale(-0.6,-0.6)"
         id="path4746-6-27"
         style="fill-rule:evenodd;stroke-width:0.625;stroke-linejoin:round" />
    </marker>
    <marker
       refX="0"
       refY="0"
       orient="auto"
       id="Arrow2Mend-9"
       style="overflow:visible">
      <path
         d="M 8.7185878,4.0337352 -2.2072895,0.01601326 8.7185884,-4.0017078 c -1.7454984,2.3720609 -1.7354408,5.6174519 -6e-7,8.035443 z"
         transform="scale(-0.6,-0.6)"
         id="path4746-3"
         style="fill-rule:evenodd;stroke-width:0.625;stroke-linejoin:round" />
    </marker>
    <marker
       refX="0"
       refY="0"
       orient="auto"
       id="Arrow2Mend-3-0"
       style="overflow:visible">
      <path
         d="M 8.7185878,4.0337352 -2.2072895,0.01601326 8.7185884,-4.0017078 c -1.7454984,2.3720609 -1.7354408,5.6174519 -6e-7,8.035443 z"
         transform="scale(-0.6,-0.6)"
         id="path4746-6-6"
         style="fill-rule:evenodd;stroke-width:0.625;stroke-linejoin:round" />
    </marker>
    <marker
       refX="0"
       refY="0"
       orient="auto"
       id="Arrow2Mstart-6"
       style="overflow:visible">
      <path
         d="M 8.7185878,4.0337352 -2.2072895,0.01601326 8.7185884,-4.0017078 c -1.7454984,2.3720609 -1.7354408,5.6174519 -6e-7,8.035443 z"
         transform="scale(0.6,0.6)"
         id="path4743-1"
         style="fill-rule:evenodd;stroke-width:0.625;stroke-linejoin:round" />
    </marker>
    <marker
       refX="0"
       refY="0"
       orient="auto"
       id="Arrow2Mend-3-8"
       style="overflow:visible">
      <path
         d="M 8.7185878,4.0337352 -2.2072895,0.01601326 8.7185884,-4.0017078 c -1.7454984,2.3720609 -1.7354408,5.6174519 -6e-7,8.035443 z"
         transform="scale(-0.6,-0.6)"
         id="path4746-6-7"
         style="fill-rule:evenodd;stroke-width:0.625;stroke-linejoin:round" />
    </marker>
    <marker
       refX="0"
       refY="0"
       orient="auto"
       id="Arrow2Mend-3-8-2"
       style="overflow:visible">
      <path
         d="M 8.7185878,4.0337352 -2.2072895,0.01601326 8.7185884,-4.0017078 c -1.7454984,2.3720609 -1.7354408,5.6174519 -6e-7,8.035443 z"
         transform="scale(-0.6,-0.6)"
         id="path4746-6-7-0"
         style="fill-rule:evenodd;stroke-width:0.625;stroke-linejoin:round" />
    </marker>
    <marker
       refX="0"
       refY="0"
       orient="auto"
       id="Arrow2Mend-3-8-2-3"
       style="overflow:visible">
      <path
         d="M 8.7185878,4.0337352 -2.2072895,0.01601326 8.7185884,-4.0017078 c -1.7454984,2.3720609 -1.7354408,5.6174519 -6e-7,8.035443 z"
         transform="scale(-0.6,-0.6)"
         id="path4746-6-7-0-7"
         style="fill-rule:evenodd;stroke-width:0.625;stroke-linejoin:round" />
    </marker>
    <marker
       refX="0"
       refY="0"
       orient="auto"
       id="Arrow2Mend-92"
       style="overflow:visible">
      <path
         d="M 8.7185878,4.0337352 -2.2072895,0.01601326 8.7185884,-4.0017078 c -1.7454984,2.3720609 -1.7354408,5.6174519 -6e-7,8.035443 z"
         transform="scale(-0.6,-0.6)"
         id="path4746-2"
         style="fill-rule:evenodd;stroke-width:0.625;stroke-linejoin:round" />
    </marker>
    <marker
       refX="0"
       refY="0"
       orient="auto"
       id="Arrow2Mstart-9"
       style="overflow:visible">
      <path
         d="M 8.7185878,4.0337352 -2.2072895,0.01601326 8.7185884,-4.0017078 c -1.7454984,2.3720609 -1.7354408,5.6174519 -6e-7,8.035443 z"
         transform="scale(0.6,0.6)"
         id="path4743-7"
         style="fill-rule:evenodd;stroke-width:0.625;stroke-linejoin:round" />
    </marker>
    <marker
       refX="0"
       refY="0"
       orient="auto"
       id="Arrow2Mend-36"
       style="overflow:visible">
      <path
         d="M 8.7185878,4.0337352 -2.2072895,0.01601326 8.7185884,-4.0017078 c -1.7454984,2.3720609 -1.7354408,5.6174519 -6e-7,8.035443 z"
         transform="scale(-0.6,-0.6)"
         id="path4746-1"
         style="fill-rule:evenodd;stroke-width:0.625;stroke-linejoin:round" />
    </marker>
    <marker
       refX="0"
       refY="0"
       orient="auto"
       id="Arrow2MstartD"
       style="overflow:visible">
      <path
         d="M 8.7185878,4.0337352 -2.2072895,0.01601326 8.7185884,-4.0017078 c -1.7454984,2.3720609 -1.7354408,5.6174519 -6e-7,8.035443 z"
         transform="scale(0.6,0.6)"
         id="path5432"
         style="fill:#800000;fill-opacity:1;fill-rule:evenodd;stroke:#800000;stroke-width:0.625;stroke-linejoin:round;stroke-opacity:1" />
    </marker>
    <marker
       refX="0"
       refY="0"
       orient="auto"
       id="Arrow2Mstarts"
       style="overflow:visible">
      <path
         d="M 8.7185878,4.0337352 -2.2072895,0.01601326 8.7185884,-4.0017078 c -1.7454984,2.3720609 -1.7354408,5.6174519 -6e-7,8.035443 z"
         transform="scale(0.6,0.6)"
         id="path5705"
         style="fill:#000080;fill-opacity:1;fill-rule:evenodd;stroke:#000080;stroke-width:0.625;stroke-linejoin:round;stroke-opacity:1" />
    </marker>
    <marker
       refX="0"
       refY="0"
       orient="auto"
       id="Arrow2Mstartq"
       style="overflow:visible">
      <path
         d="M 8.7185878,4.0337352 -2.2072895,0.01601326 8.7185884,-4.0017078 c -1.7454984,2.3720609 -1.7354408,5.6174519 -6e-7,8.035443 z"
         transform="scale(0.6,0.6)"
         id="path5980"
         style="fill:#000080;fill-opacity:1;fill-rule:evenodd;stroke:#000080;stroke-width:0.625;stroke-linejoin:round;stroke-opacity:1" />
    </marker>
    <marker
       refX="0"
       refY="0"
       orient="auto"
       id="Arrow2Mstart-9L"
       style="overflow:visible">
      <path
         d="M 8.7185878,4.0337352 -2.2072895,0.01601326 8.7185884,-4.0017078 c -1.7454984,2.3720609 -1.7354408,5.6174519 -6e-7,8.035443 z"
         transform="scale(0.6,0.6)"
         id="path6259"
         style="fill:#800000;fill-opacity:1;fill-rule:evenodd;stroke:#800000;stroke-width:0.625;stroke-linejoin:round;stroke-opacity:1" />
    </marker>
    <marker
       refX="0"
       refY="0"
       orient="auto"
       id="Arrow2Mende"
       style="overflow:visible">
      <path
         d="M 8.7185878,4.0337352 -2.2072895,0.01601326 8.7185884,-4.0017078 c -1.7454984,2.3720609 -1.7354408,5.6174519 -6e-7,8.035443 z"
         transform="scale(-0.6,-0.6)"
         id="path6542"
         style="fill:#800000;fill-opacity:1;fill-rule:evenodd;stroke:#800000;stroke-width:0.625;stroke-linejoin:round;stroke-opacity:1" />
    </marker>
    <marker
       refX="0"
       refY="0"
       orient="auto"
       id="Arrow2MendU"
       style="overflow:visible">
      <path
         d="M 8.7185878,4.0337352 -2.2072895,0.01601326 8.7185884,-4.0017078 c -1.7454984,2.3720609 -1.7354408,5.6174519 -6e-7,8.035443 z"
         transform="scale(-0.6,-0.6)"
         id="path6829"
         style="fill:#800000;fill-opacity:1;fill-rule:evenodd;stroke:#800000;stroke-width:0.625;stroke-linejoin:round;stroke-opacity:1" />
    </marker>
    <marker
       refX="0"
       refY="0"
       orient="auto"
       id="Arrow2Mendm"
       style="overflow:visible">
      <path
         d="M 8.7185878,4.0337352 -2.2072895,0.01601326 8.7185884,-4.0017078 c -1.7454984,2.3720609 -1.7354408,5.6174519 -6e-7,8.035443 z"
         transform="scale(-0.6,-0.6)"
         id="path7120"
         style="fill:#800000;fill-opacity:1;fill-rule:evenodd;stroke:#800000;stroke-width:0.625;stroke-linejoin:round;stroke-opacity:1" />
    </marker>
    <marker
       refX="0"
       refY="0"
       orient="auto"
       id="Arrow2Mend-36e"
       style="overflow:visible">
      <path
         d="M 8.7185878,4.0337352 -2.2072895,0.01601326 8.7185884,-4.0017078 c -1.7454984,2.3720609 -1.7354408,5.6174519 -6e-7,8.035443 z"
         transform="scale(-0.6,-0.6)"
         id="path7415"
         style="fill:#000080;fill-opacity:1;fill-rule:evenodd;stroke:#000080;stroke-width:0.625;stroke-linejoin:round;stroke-opacity:1" />
    </marker>
    <marker
       refX="0"
       refY="0"
       orient="auto"
       id="Arrow2Mend-36d"
       style="overflow:visible">
      <path
         d="M 8.7185878,4.0337352 -2.2072895,0.01601326 8.7185884,-4.0017078 c -1.7454984,2.3720609 -1.7354408,5.6174519 -6e-7,8.035443 z"
         transform="scale(-0.6,-0.6)"
         id="path7714"
         style="fill:#800000;fill-opacity:1;fill-rule:evenodd;stroke:#800000;stroke-width:0.625;stroke-linejoin:round;stroke-opacity:1" />
    </marker>
    <marker
       refX="0"
       refY="0"
       orient="auto"
       id="Arrow2MstartW"
       style="overflow:visible">
      <path
         d="M 8.7185878,4.0337352 -2.2072895,0.01601326 8.7185884,-4.0017078 c -1.7454984,2.3720609 -1.7354408,5.6174519 -6e-7,8.035443 z"
         transform="scale(0.6,0.6)"
         id="path8017"
         style="fill:#000080;fill-opacity:1;fill-rule:evenodd;stroke:#000080;stroke-width:0.625;stroke-linejoin:round;stroke-opacity:1" />
    </marker>
    <marker
       refX="0"
       refY="0"
       orient="auto"
       id="Arrow2MstartG"
       style="overflow:visible">
      <path
         d="M 8.7185878,4.0337352 -2.2072895,0.01601326 8.7185884,-4.0017078 c -1.7454984,2.3720609 -1.7354408,5.6174519 -6e-7,8.035443 z"
         transform="scale(0.6,0.6)"
         id="path8324"
         style="fill:#800000;fill-opacity:1;fill-rule:evenodd;stroke:#800000;stroke-width:0.625;stroke-linejoin:round;stroke-opacity:1" />
    </marker>
    <marker
       refX="0"
       refY="0"
       orient="auto"
       id="Arrow2Mend-360"
       style="overflow:visible">
      <path
         d="M 8.7185878,4.0337352 -2.2072895,0.01601326 8.7185884,-4.0017078 c -1.7454984,2.3720609 -1.7354408,5.6174519 -6e-7,8.035443 z"
         transform="scale(-0.6,-0.6)"
         id="path5184"
         style="fill:#800000;fill-rule:evenodd;stroke:#800000;stroke-width:0.625;stroke-linejoin:round" />
    </marker>
    <marker
       refX="0"
       refY="0"
       orient="auto"
       id="Arrow2Mend-36L"
       style="overflow:visible">
      <path
         d="M 8.7185878,4.0337352 -2.2072895,0.01601326 8.7185884,-4.0017078 c -1.7454984,2.3720609 -1.7354408,5.6174519 -6e-7,8.035443 z"
         transform="scale(-0.6,-0.6)"
         id="path5499"
         style="fill:#000080;fill-rule:evenodd;stroke:#000080;stroke-width:0.625;stroke-linejoin:round" />
    </marker>
    <marker
       refX="0"
       refY="0"
       orient="auto"
       id="Arrow2Mend-36W"
       style="overflow:visible">
      <path
         d="M 8.7185878,4.0337352 -2.2072895,0.01601326 8.7185884,-4.0017078 c -1.7454984,2.3720609 -1.7354408,5.6174519 -6e-7,8.035443 z"
         transform="scale(-0.6,-0.6)"
         id="path6062"
         style="fill:#800000;fill-rule:evenodd;stroke:#800000;stroke-width:0.625;stroke-linejoin:round" />
    </marker>
    <marker
       refX="0"
       refY="0"
       orient="auto"
       id="Arrow2Mend-36e1"
       style="overflow:visible">
      <path
         d="M 8.7185878,4.0337352 -2.2072895,0.01601326 8.7185884,-4.0017078 c -1.7454984,2.3720609 -1.7354408,5.6174519 -6e-7,8.035443 z"
         transform="scale(-0.6,-0.6)"
         id="path6631"
         style="fill:#000080;fill-rule:evenodd;stroke:#000080;stroke-width:0.625;stroke-linejoin:round" />
    </marker>
    <marker
       refX="0"
       refY="0"
       orient="auto"
       id="Arrow2Mend-36L-5"
       style="overflow:visible">
      <path
         d="M 8.7185878,4.0337352 -2.2072895,0.01601326 8.7185884,-4.0017078 c -1.7454984,2.3720609 -1.7354408,5.6174519 -6e-7,8.035443 z"
         transform="scale(-0.6,-0.6)"
         id="path5499-6"
         style="fill:#000080;fill-rule:evenodd;stroke:#000080;stroke-width:0.625;stroke-linejoin:round" />
    </marker>
    <marker
       refX="0"
       refY="0"
       orient="auto"
       id="Arrow2Mend-36Z"
       style="overflow:visible">
      <path
         d="M 8.7185878,4.0337352 -2.2072895,0.01601326 8.7185884,-4.0017078 c -1.7454984,2.3720609 -1.7354408,5.6174519 -6e-7,8.035443 z"
         transform="scale(-0.6,-0.6)"
         id="path7234"
         style="fill:#000080;fill-rule:evenodd;stroke:#000080;stroke-width:0.625;stroke-linejoin:round" />
    </marker>
    <marker
       refX="0"
       refY="0"
       orient="auto"
       id="Arrow2Mend-36p"
       style="overflow:visible">
      <path
         d="M 8.7185878,4.0337352 -2.2072895,0.01601326 8.7185884,-4.0017078 c -1.7454984,2.3720609 -1.7354408,5.6174519 -6e-7,8.035443 z"
         transform="scale(-0.6,-0.6)"
         id="path7819"
         style="fill:#800000;fill-rule:evenodd;stroke:#800000;stroke-width:0.625;stroke-linejoin:round" />
    </marker>
  </defs>
  <metadata
     id="metadata7">
    <rdf:RDF>
      <cc:Work
         rdf:about="">
        <dc:format>image/svg+xml</dc:format>
        <dc:type
           rdf:resource="http://purl.org/dc/dcmitype/StillImage" />
        <dc:title />
      </cc:Work>
    </rdf:RDF>
  </metadata>
  <g
     style="fill:#800000"
     id="g3077"
     transform="matrix(1.4330118,0,0,1.4330118,-6.73516,32.71233)">
    <path
       inkscape:connector-curvature="0"
       style="fill:#800000"
       id="path3079"
       d="M 28,28 25,30.3 22,28 c 1.1,0.4 2.2,0.6 3,0.6 0.8,-0.1 1.9,-0.3 3,-0.6 z" />
    <path
       inkscape:connector-curvature="0"
       style="fill:#800000"
       id="path3081"
       d="m 45.3,49.7 -40.6,0 c 0,0 1.1,-11.3 1.4,-13.2 0.3,-1.5 2.4,-2.8 3.8,-3.5 0.4,-0.2 3.3,-1.4 5.8,-2.6 l 2.4,-1 c 0,0 0.1,0 0.1,0 l 6.7,20 0.1,0.4 6.8,-20.3 c 0.1,0.1 0.3,0.1 0.5,0.2 l 2,0.9 c 2.6,1.1 5.4,2.4 5.8,2.6 1.4,0.7 3.5,2 3.7,3.5 0.4,1.7 1.5,13 1.5,13 z" />
    <path
       inkscape:connector-curvature="0"
       style="fill:#800000"
       id="path3083"
       d="m 22.9,13.3 c 0,1.5 -1.2,2.7 -2.7,2.7 -1.5,0 -2.7,-1.2 -2.7,-2.7 0,-1.5 1.2,-2.7 2.7,-2.7 1.5,0.1 2.7,1.3 2.7,2.7 z" />
    <path
       inkscape:connector-curvature="0"
       style="fill:#800000"
       id="path3085"
       d="m 32.4,13.3 c 0,1.5 -1.2,2.7 -2.7,2.7 -1.5,0 -2.7,-1.2 -2.7,-2.7 0,-1.5 1.2,-2.7 2.7,-2.7 1.5,0.1 2.7,1.3 2.7,2.7 z" />
    <path
       inkscape:connector-curvature="0"
       style="fill:#800000"
       id="path3087"
       d="m 36.7,10.7 c -0.5,-0.3 -1,-0.1 -1.3,0.1 l -0.3,-2 C 34.7,6.9 33.6,3.8 32,2.7 29,0.6 23.8,-1.5 17.9,2.9 16.4,4 15.4,7.1 15,8.9 l -0.3,1.8 c -0.3,-0.3 -0.8,-0.4 -1.3,-0.1 -1.5,0.7 0.1,4.9 0.2,6.1 0.1,0.9 0.7,1.5 1.2,1.4 l 0,0 c 0.2,3.6 2.9,5 4.4,6.9 3.2,3.4 8.8,3.1 11.7,0 1.6,-2 4.2,-3.4 4.4,-6.9 0.5,0 1.1,-0.5 1.2,-1.4 0.1,-1.1 1.7,-5.3 0.2,-6 z m -6.9,6.5 c -2.1,0 -3.8,-1.7 -3.8,-3.8 0,-0.6 0.2,-1.2 0.4,-1.7 -0.9,-0.5 -1.8,-0.5 -2.7,0 0.3,0.5 0.4,1.1 0.4,1.7 0,2.1 -1.7,3.8 -3.8,3.8 -2.1,0 -3.8,-1.7 -3.8,-3.8 0,-2.1 1.7,-3.8 3.8,-3.8 1.1,0 2,0.5 2.8,1.2 1.3,-0.8 2.7,-0.8 4,0 0.7,-0.7 1.7,-1.2 2.8,-1.2 2.1,0 3.8,1.7 3.8,3.8 -0.1,2.1 -1.8,3.8 -3.9,3.8 z" />
    <path
       inkscape:connector-curvature="0"
       style="fill:#800000"
       id="path3089"
       d="m 36.4,9.5 c -0.1,0 -0.1,0 -0.2,0 L 36,8.5 C 35.8,7.8 35,4.7 33.5,2.8 c 1.2,0.4 2.6,1.2 2.9,3.1 0.2,1.2 0.2,2.4 0,3.6 z" />
    <path
       inkscape:connector-curvature="0"
       style="fill:#800000"
       id="path3091"
       d="M 16.4,2.9 C 15,4.7 14.2,7.6 13.9,8.7 l -0.1,0.7 c -0.1,0 -0.1,0 -0.2,0 -0.1,-1.2 -0.2,-2.3 0,-3.4 0.2,-1.9 1.6,-2.7 2.8,-3.1 z" />
    <path
       inkscape:connector-curvature="0"
       style="fill:#800000"
       id="path3093"
       d="M 26.5,42.1 25,46.5 23.5,42 23.8,36.1 C 23.9,36 23.9,35.9 24,35.9 l 1,-1.9 1.1,1.9 c 0,0.1 0.1,0.2 0.1,0.2 z" />
    <path
       inkscape:connector-curvature="0"
       style="fill:#800000"
       id="path3095"
       d="m 31.8,29.3 0,0 -3.6,6.2 c -0.3,0.5 -1,0.5 -1.3,0 L 25,32 23.1,35.5 c -0.3,0.5 -1,0.5 -1.3,0 l -3.6,-6.2 1.7,-1.8 5.1,4 5.1,-4 z" />
  </g>
  <g
     style="fill:#000080"
     id="g3245"
     transform="matrix(1.6729207,0,0,1.6729207,254.06576,24.33281)">
    <path
       inkscape:connector-curvature="0"
       style="fill:#000080"
       id="path3247"
       d="m 27.8,19.9 c -0.9,0.4 -1.9,0.7 -2.9,0.7 -0.7,0 -1.4,-0.1 -2.1,-0.3 l 2.3,1.8 z" />
    <path
       inkscape:connector-curvature="0"
       style="fill:#000080"
       id="path3249"
       d="M 35.6,24.3 C 35.3,24.1 32.7,23 30.8,22.2 l -0.1,0.1 -2.5,4.3 c -0.3,0.5 -0.8,0.7 -1.3,0.7 -0.6,0 -1.1,-0.3 -1.3,-0.8 l -0.5,-0.8 -0.4,0.8 c -0.3,0.5 -0.8,0.8 -1.3,0.8 -0.5,0 -1,-0.3 -1.3,-0.8 l -2.6,-4.4 c -1.9,0.8 -4.5,2 -4.8,2.1 -0.5,0.3 -1.2,0.6 -1.7,1.1 l 10.1,2.7 0,0 4,0 0,0 10.2,-2.6 c -0.5,-0.5 -1.2,-0.9 -1.7,-1.1 z" />
    <path
       inkscape:connector-curvature="0"
       style="fill:#000080"
       id="path3251"
       d="m 20.4,21.8 2.5,4.3 c 0.2,0.3 0.7,0.3 0.9,0 l 1.3,-2.4 1.3,2.4 c 0.2,0.3 0.7,0.4 0.9,0 l 2.5,-4.3 0,0 -1.2,-1.2 -3.5,2.7 -3.5,-2.7 z" />
    <path
       inkscape:connector-curvature="0"
       style="fill:#000080"
       id="path3253"
       d="m 18.3,13.6 c 0.1,0 0.1,0 0.2,-0.1 l 0,0 c 0.8,3.5 3.4,6.1 6.5,6.1 3.1,0 5.7,-2.6 6.5,-6.1 0,0 0.1,0.1 0.2,0.1 0.6,0.1 1.3,-0.8 1.5,-2 0.2,-1.2 -0.1,-2.3 -0.8,-2.4 -0.1,0 -0.2,0 -0.3,0 0,-0.2 0,-0.3 0,-0.3 0.8,-4.5 -1.1,-6.2 -2.8,-6.4 -0.2,0 -0.4,0 -0.5,0 -0.1,-1 -0.4,-1.8 -1.6,-1.9 -2.1,-0.2 -9,0.6 -9.5,5.2 0,0 -0.3,1.5 -0.2,3.4 -0.5,0.2 -0.8,1.2 -0.6,2.3 0.1,1.3 0.7,2.2 1.4,2.1 z" />
    <rect
       style="fill:#000080"
       id="rect3255"
       y="29.1"
       x="23.1"
       height="20.299999"
       width="4" />
    <path
       inkscape:connector-curvature="0"
       style="fill:#000080"
       id="path3257"
       d="m 39.8,40.1 c -1.1,0 -2,-0.9 -2,-2 l 0,-4.4 c 0,-1 0.7,-1.8 1.7,-1.9 l 0.9,-0.1 0,-4.7 c 0,-0.7 -0.6,-1.2 -1.3,-1 L 28,28.9 28,49 39.4,45.2 C 40,45 40.3,44.5 40.3,43.9 l 0,-3.9 -0.4,0 c 0.1,0.1 0,0.1 -0.1,0.1 z" />
    <path
       inkscape:connector-curvature="0"
       style="fill:#000080"
       id="path3259"
       d="m 9.7,27 0,4.7 0.7,0.1 c 1,0.1 1.7,1 1.7,1.9 l 0,4.4 c 0,1.1 -0.9,2 -2,2 -0.1,0 -0.2,0 -0.2,0 l -0.2,0 0,3.9 c 0,0.6 0.4,1.1 0.9,1.3 L 22.1,49 22.1,28.8 11,25.9 C 10.4,25.8 9.7,26.3 9.7,27 Z" />
    <path
       inkscape:connector-curvature="0"
       style="fill:#000080"
       id="path3261"
       d="m 40.9,32.6 -1.1,0.1 c -0.5,0.1 -0.8,0.5 -0.8,1 l 0,4.4 c 0,0.6 0.5,1 1.1,1 L 41.2,39 C 41.7,38.9 42,38.5 42,38 l 0,-4.4 c -0.1,-0.6 -0.6,-1.1 -1.1,-1 z" />
    <path
       inkscape:connector-curvature="0"
       style="fill:#000080"
       id="path3263"
       d="m 11.1,38.1 0,-4.4 c 0,-0.5 -0.4,-0.9 -0.8,-1 L 9.2,32.6 C 8.6,32.5 8.1,33 8.1,33.6 l 0,4.4 c 0,0.5 0.4,0.9 0.8,1 l 1.1,0.1 c 0.6,0 1.1,-0.4 1.1,-1 z" />
  </g>
  <g
     id="g3368"
     transform="matrix(1.209205,0,0,1.209205,133.10355,141.823)">
    <path
       inkscape:connector-curvature="0"
       id="path3370"
       d="m 19.2,26.3 5.3,0 c 0.3,0 0.5,0.1 0.7,0.3 l 1.7,0 c 0.2,-0.2 0.4,-0.3 0.7,-0.3 l 4.3,0 4.7,-2.1 3,-2.4 0,-15.6 C 39.6,3.4 37.3,1.1 34.5,1.1 L 6.1,1.1 C 3.3,1.1 1,3.4 1,6.2 l 0,37.6 c 0,2.8 2.3,5.1 5.1,5.1 l 28.4,0 c 2.8,0 5.1,-2.3 5.1,-5.1 l 0,-0.3 -3,-2.5 -6.8,-3.1 c -0.4,0.5 -0.9,0.8 -1.6,0.8 l -3.7,0 c -0.8,0 -1.4,-0.4 -1.7,-1.1 l -3.5,0 c -0.6,0 -1,-0.5 -1,-1 0,-0.6 0.4,-1 1,-1 l 3.3,0 0,-7 c 0,-0.1 0,-0.2 0,-0.3 l -3.3,0 c -0.6,0 -1,-0.4 -1,-1 -0.1,-0.5 0.4,-1 0.9,-1 z m 5.2,13.9 8.4,0 c 0.6,0 1,0.5 1,1 0,0.5 -0.4,1 -1,1 l -8.4,0 c -0.5,0 -1,-0.4 -1,-1 0,-0.6 0.5,-1 1,-1 z m 8.4,-16.5 -8.4,0 c -0.5,0 -1,-0.4 -1,-1 0,-0.5 0.4,-1 1,-1 l 8.4,0 c 0.6,0 1,0.5 1,1 0,0.5 -0.4,1 -1,1 z M 19.2,19 c -0.6,0 -1,-0.4 -1,-1 0,-0.5 0.4,-1 1,-1 l 5.3,0 c 0.5,0 1,0.4 1,1 0,0.6 -0.4,1 -1,1 z m 13.6,0 -5.3,0 c -0.5,0 -1,-0.4 -1,-1 0,-0.5 0.4,-1 1,-1 l 5.3,0 c 0.6,0 1,0.4 1,1 0,0.6 -0.4,1 -1,1 z m 0,-4.6 -8.4,0 c -0.5,0 -1,-0.4 -1,-1 0,-0.6 0.4,-1 1,-1 l 8.4,0 c 0.6,0 1,0.4 1,1 0,0.6 -0.4,1 -1,1 z m -5.3,-6.6 5.3,0 c 0.6,0 1,0.4 1,1 0,0.6 -0.4,1 -1,1 l -5.3,0 c -0.5,0 -1,-0.4 -1,-1 0.1,-0.6 0.5,-1 1,-1 z m -8.3,0 5.3,0 c 0.5,0 1,0.4 1,1 0,0.6 -0.4,1 -1,1 l -5.3,0 c -0.6,0 -1,-0.4 -1,-1 0,-0.6 0.5,-1 1,-1 z m -11.5,0 8.4,0 c 0.6,0 1,0.4 1,1 0,0.6 -0.4,1 -1,1 l -8.4,0 c -0.6,0 -1,-0.4 -1,-1 0,-0.6 0.5,-1 1,-1 z m 0,4.6 13.6,0 c 0.6,0 1,0.4 1,1 0,0.6 -0.4,1 -1,1 l -13.6,0 c -0.6,0 -1,-0.4 -1,-1 0,-0.6 0.5,-1 1,-1 z m 0,4.7 8.4,0 c 0.6,0 1,0.4 1,1 0,0.6 -0.4,1 -1,1 l -8.4,0 c -0.6,0 -1,-0.4 -1,-1 0,-0.6 0.5,-1 1,-1 z m 13.6,23.1 c 0.6,0 1,0.5 1,1 0,0.5 -0.4,1 -1,1 l -13.6,0 c -0.6,0 -1,-0.4 -1,-1 0,-0.6 0.4,-1 1,-1 z M 6.7,36.6 c 0,-0.6 0.4,-1 1,-1 l 8.4,0 c 0.6,0 1,0.4 1,1 0,0.5 -0.4,1 -1,1 l -8.4,0 c -0.5,0 -1,-0.5 -1,-1 z M 21.3,31 c 0.6,0 1,0.4 1,1 0,0.6 -0.4,1 -1,1 L 7.7,33 c -0.6,0 -1,-0.5 -1,-1 0,-0.5 0.4,-1 1,-1 z M 6.7,27.3 c 0,-0.5 0.4,-1 1,-1 l 8.4,0 c 0.6,0 1,0.4 1,1 0,0.6 -0.4,1 -1,1 l -8.4,0 c -0.5,0 -1,-0.4 -1,-1 z m 1,-3.6 c -0.6,0 -1,-0.4 -1,-1 0,-0.5 0.4,-1 1,-1 l 13.6,0 c 0.6,0 1,0.5 1,1 0,0.6 -0.4,1 -1,1 z" />
    <g
       id="g3372">
      <path
         inkscape:connector-curvature="0"
         id="path3374"
         d="m 45.9,19.9 -0.1,25.4 c 0,0.7 -0.6,1.3 -1.3,1.3 -0.7,0 -1.3,-0.6 -1.3,-1.3 l 0.1,-25.5 c 0,-0.7 0.6,-1.3 1.3,-1.3 0.7,0.1 1.3,0.7 1.3,1.4 z" />
      <path
         inkscape:connector-curvature="0"
         id="path3376"
         d="m 49,30.2 0,4.8 c 0,0.7 -0.6,1.2 -1.2,1.2 l -0.9,0 0,-7.2 0.9,0 c 0.6,0 1.2,0.5 1.2,1.2 z" />
      <path
         inkscape:connector-curvature="0"
         id="path3378"
         d="m 29.2,28.6 0,8.1 c 0,0.5 -0.4,1 -1,1 l -3.7,0 c -0.5,0 -1,-0.4 -1,-1 l 0,-8.1 c 0,-0.5 0.4,-1 1,-1 l 3.7,0 c 0.5,0 1,0.4 1,1 z" />
      <path
         inkscape:connector-curvature="0"
         id="path3380"
         d="m 37.1,25 5.1,-4.2 -0.1,23.6 -5.1,-4.2 -0.1,0 -6.8,-3.2 c 0,-0.1 0,-0.2 0,-0.3 l 0,-8.1 c 0,-0.1 0,-0.3 0,-0.4 z" />
    </g>
  </g>
  <g
     id="g3479"
     transform="matrix(1.3578885,0,0,1.3578885,128.10724,232.43486)">
    <path
       inkscape:connector-curvature="0"
       id="path3481"
       d="m 35,45.3 -2.6,0 0,-2.5 -14.7,0 0,2.5 -2.7,0 c -1,0 -1.8,0.8 -1.8,1.8 0,1 0.8,1.8 1.8,1.8 l 20,0 c 1,0 1.8,-0.8 1.8,-1.8 0,-1 -0.8,-1.8 -1.8,-1.8 z" />
    <path
       inkscape:connector-curvature="0"
       id="path3483"
       d="m 5.3,12.2 c 0,0 0,-0.1 0,0 l 5.3,-0.1 0,-2.1 c 0,0 0,0 0.1,-0.1 l -5.3,0 c -1.3,0 -2.3,1 -2.3,2.3 l 0,22 2.2,0 z" />
    <path
       inkscape:connector-curvature="0"
       id="path3485"
       d="m 44.6,10 -5.2,0 0,2.2 5.2,0 c 0.1,0 0.1,0 0.1,0.1 l 0,22 2.2,0 0,-22 C 46.9,11 45.8,10 44.6,10 Z" />
    <path
       inkscape:connector-curvature="0"
       id="path3487"
       d="m 3.1,39.5 c 0,1.3 1,2.3 2.3,2.3 l 39.2,0 c 1.3,0 2.3,-1 2.3,-2.3 l 0,-4.3 -43.8,0 z m 39,-2.3 c 0.7,0 1.3,0.6 1.3,1.3 0,0.7 -0.6,1.3 -1.3,1.3 -0.7,0 -1.3,-0.6 -1.3,-1.3 0,-0.7 0.6,-1.3 1.3,-1.3 z m -4.4,0 c 0.7,0 1.3,0.6 1.3,1.3 0,0.7 -0.6,1.3 -1.3,1.3 -0.7,0 -1.3,-0.6 -1.3,-1.3 0,-0.7 0.6,-1.3 1.3,-1.3 z m -4.3,0 c 0.7,0 1.3,0.6 1.3,1.3 0,0.7 -0.6,1.3 -1.3,1.3 -0.7,0 -1.3,-0.6 -1.3,-1.3 0,-0.7 0.5,-1.3 1.3,-1.3 z" />
    <path
       inkscape:connector-curvature="0"
       id="path3489"
       d="m 21.1,7.2 0,-6.2 c -2.5,2.5 -6.8,6.8 -9.5,9.5 l 6.2,0 c 1.8,0 3.3,-1.5 3.3,-3.3 z" />
    <path
       inkscape:connector-curvature="0"
       id="path3491"
       d="m 17.8,11.5 -6.2,0 0,22.8 26.9,0 0,-30 C 38.4,2.5 37,1 35.1,1 l -13,0 0,6.2 c 0,2.3 -2,4.3 -4.3,4.3 z m 2.4,19.9 c 0,0.3 -0.3,0.6 -0.6,0.6 l -4.2,0 c -0.3,0 -0.6,-0.3 -0.6,-0.6 l 0,-4.2 c 0,-0.3 0.3,-0.6 0.6,-0.6 l 4.2,0 c 0.3,0 0.6,0.3 0.6,0.6 z m 0,-7.3 c 0,0.3 -0.3,0.6 -0.6,0.6 l -4.2,0 c -0.3,0 -0.6,-0.3 -0.6,-0.6 l 0,-4.2 c 0,-0.3 0.3,-0.6 0.6,-0.6 l 4.2,0 c 0.3,0 0.6,0.3 0.6,0.6 z m 0,-7.3 c 0,0.3 -0.3,0.6 -0.6,0.6 l -4.2,0 c -0.3,0 -0.6,-0.3 -0.6,-0.6 l 0,-4.2 c 0,-0.3 0.3,-0.6 0.6,-0.6 l 4.2,0 c 0.3,0 0.6,0.3 0.6,0.6 z m 14.3,14.3 -5.2,0 c -0.3,0 -0.6,-0.3 -0.6,-0.6 0,-0.3 0.3,-0.6 0.6,-0.6 l 5.2,0 c 0.3,0 0.6,0.3 0.6,0.6 0,0.3 -0.3,0.6 -0.6,0.6 z m -8.5,-3.6 3.3,0 c 0.3,0 0.6,0.3 0.6,0.6 0,0.3 -0.3,0.6 -0.6,0.6 l -3.3,0 c -0.3,0 -0.6,-0.3 -0.6,-0.6 0,-0.4 0.2,-0.6 0.6,-0.6 z m -0.6,-4.3 c 0,-0.3 0.3,-0.6 0.6,-0.6 l 3.3,0 c 0.3,0 0.6,0.3 0.6,0.6 0,0.3 -0.3,0.6 -0.6,0.6 l -3.3,0 c -0.4,0 -0.6,-0.2 -0.6,-0.6 z m 9.1,5.5 -3.3,0 c -0.3,0 -0.6,-0.3 -0.6,-0.6 0,-0.3 0.3,-0.6 0.6,-0.6 l 3.3,0 c 0.3,0 0.6,0.3 0.6,0.6 0,0.3 -0.3,0.6 -0.6,0.6 z m 0,-4.9 -3.3,0 c -0.3,0 -0.6,-0.3 -0.6,-0.6 0,-0.3 0.3,-0.6 0.6,-0.6 l 3.3,0 c 0.3,0 0.6,0.3 0.6,0.6 0,0.4 -0.3,0.6 -0.6,0.6 z m 0,-2.4 -5.2,0 c -0.3,0 -0.6,-0.3 -0.6,-0.6 0,-0.3 0.3,-0.6 0.6,-0.6 l 5.2,0 c 0.3,0 0.6,0.3 0.6,0.6 0,0.3 -0.3,0.6 -0.6,0.6 z m 0,-4.8 -5.2,0 c -0.3,0 -0.6,-0.3 -0.6,-0.6 0,-0.3 0.3,-0.6 0.6,-0.6 l 5.2,0 c 0.3,0 0.6,0.3 0.6,0.6 0,0.3 -0.3,0.6 -0.6,0.6 z m -3.3,-3.7 3.3,0 c 0.3,0 0.6,0.3 0.6,0.6 0,0.3 -0.3,0.6 -0.6,0.6 l -3.3,0 c -0.3,0 -0.6,-0.3 -0.6,-0.6 0,-0.3 0.3,-0.6 0.6,-0.6 z m -5.2,0 3.3,0 c 0.3,0 0.6,0.3 0.6,0.6 0,0.3 -0.3,0.6 -0.6,0.6 l -3.3,0 c -0.3,0 -0.6,-0.3 -0.6,-0.6 0,-0.3 0.2,-0.6 0.6,-0.6 z m -4.3,0 2.3,0 c 0.3,0 0.6,0.3 0.6,0.6 0,0.3 -0.3,0.6 -0.6,0.6 l -2.3,0 c -0.3,0 -0.6,-0.3 -0.6,-0.6 0,-0.3 0.3,-0.6 0.6,-0.6 z m 0,2.4 2.9,0 0.4,0 2.3,0 c 0.3,0 0.6,0.3 0.6,0.6 0,0.3 -0.3,0.6 -0.6,0.6 l -2.3,0 -0.4,0 -2.9,0 c -0.3,0 -0.6,-0.3 -0.6,-0.6 0,-0.3 0.3,-0.6 0.6,-0.6 z m 0,4.9 2.9,0 0.4,0 2.3,0 c 0.3,0 0.6,0.3 0.6,0.6 0,0.3 -0.3,0.6 -0.6,0.6 l -2.3,0 -0.4,0 -2.9,0 c -0.3,0 -0.6,-0.3 -0.6,-0.6 0,-0.3 0.3,-0.6 0.6,-0.6 z m 0,2.4 2.3,0 c 0.3,0 0.6,0.3 0.6,0.6 0,0.3 -0.3,0.6 -0.6,0.6 l -2.3,0 c -0.3,0 -0.6,-0.3 -0.6,-0.6 0,-0.3 0.3,-0.6 0.6,-0.6 z m 0,4.9 2.3,0 c 0.3,0 0.6,0.3 0.6,0.6 0,0.3 -0.3,0.6 -0.6,0.6 l -2.3,0 c -0.3,0 -0.6,-0.3 -0.6,-0.6 0,-0.4 0.3,-0.6 0.6,-0.6 z m 0,2.4 2.9,0 0.4,0 2.3,0 c 0.3,0 0.6,0.3 0.6,0.6 0,0.3 -0.3,0.6 -0.6,0.6 l -2.3,0 -0.4,0 -2.9,0 c -0.3,0 -0.6,-0.3 -0.6,-0.6 0,-0.3 0.3,-0.6 0.6,-0.6 z" />
  </g>
  <g
     id="g3913"
     transform="translate(137.26234,15.55626)">
    <path
       inkscape:connector-curvature="0"
       id="path3915"
       d="m 49,24 0,12.1 c 0,1 -0.8,1.9 -1.9,1.9 l -3,0 0,3.9 c 0,0.7 -0.8,1 -1.3,0.5 L 38.5,38 17,38 c -1,0 -1.9,-0.8 -1.9,-1.9 l 0,-1.7 0.6,-0.7 15.8,0 c 3.2,0 5.8,-2.6 5.8,-5.8 l 0,-5.8 9.8,0 c 1.1,0 1.9,0.9 1.9,1.9 z" />
    <path
       inkscape:connector-curvature="0"
       id="path3917"
       d="M 31.5,7.4 5.8,7.4 C 3.1,7.4 1,9.5 1,12.1 l 0,15.8 c 0,2.6 2.1,4.8 4.8,4.8 l 2.1,0 0,5.7 c 0,1 1.3,1.5 1.9,0.7 l 5.5,-6.4 16.3,0 c 2.6,0 4.8,-2.1 4.8,-4.8 l 0,-15.8 C 36.3,9.5 34.2,7.4 31.5,7.4 Z m -9.8,16 c 0,0.3 -0.1,0.5 -0.3,0.7 0.1,0.2 0.1,0.4 0.1,0.6 0,0.2 0,0.4 -0.1,0.5 0.1,0.2 0.1,0.3 0.1,0.5 0,0.5 -0.3,0.9 -0.6,1.1 -0.3,0.4 -0.7,0.7 -1.2,0.8 -0.3,0.5 -0.9,0.8 -1.5,0.8 -0.6,0 -1.2,-0.3 -1.5,-0.8 -0.5,0 -1,-0.3 -1.3,-0.8 -0.4,-0.2 -0.6,-0.6 -0.6,-1.1 0,-0.2 0,-0.4 0.1,-0.5 -0.1,-0.1 -0.1,-0.3 -0.1,-0.5 0,-0.2 0,-0.4 0.1,-0.6 -0.1,-0.2 -0.2,-0.4 -0.3,-0.7 -0.4,-2.5 -2.8,-2.8 -2.8,-6.8 0,-3.5 2.8,-6.3 6.3,-6.3 3.5,0 6.3,2.8 6.3,6.3 0,4 -2.3,4.5 -2.7,6.8 z" />
    <path
       inkscape:connector-curvature="0"
       id="path3919"
       d="m 18.2,11.3 c -2.9,0 -5.3,2.4 -5.3,5.3 0,3.5 2.3,4 2.8,6.6 0,0.3 0.3,0.5 0.5,0.6 l 0,0.5 -0.2,0 c -0.1,0 -0.3,0.1 -0.3,0.3 0,0.1 0.1,0.3 0.3,0.3 l 0.1,0 0,0.5 -0.1,0 c -0.1,0 -0.3,0.1 -0.3,0.3 0,0.1 0.1,0.3 0.3,0.3 l 0.1,0 0,0 c 0,0.3 0.3,0.6 0.6,0.6 l 0.5,0 c 0.1,0.4 0.4,0.8 0.9,0.8 0.5,0 0.8,-0.3 0.9,-0.8 l 0.5,0 c 0.3,0 0.6,-0.3 0.6,-0.6 l 0,0 0.1,0 c 0.1,0 0.3,-0.1 0.3,-0.3 0,-0.1 -0.1,-0.3 -0.3,-0.3 l -0.1,0 0,-0.4 0.1,0 c 0.1,0 0.3,-0.1 0.3,-0.3 0,-0.1 -0.1,-0.3 -0.3,-0.3 l -0.1,0 0,-0.5 c 0.3,-0.1 0.5,-0.3 0.5,-0.6 0.4,-2.7 2.8,-3.1 2.8,-6.6 0,-3 -2.3,-5.4 -5.2,-5.4 z" />
  </g>
  <path
     inkscape:connector-curvature="0"
     style="opacity:0.6;fill:none;stroke:#800000;stroke-width:3;stroke-linecap:butt;stroke-linejoin:miter;stroke-miterlimit:4;stroke-dasharray:6, 3;stroke-dashoffset:0;stroke-opacity:1;marker-end:url(#Arrow2MendU)"
     id="path5719"
     d="m 23.41234,111.40626 c 1.93431,80.01886 60,65 105,65" />
  <g
     style="stroke:none"
     id="g7028"
     transform="matrix(1.5686975,0,0,1.5686975,84.57139,363.76306)">
    <path
       inkscape:connector-curvature="0"
       style="stroke:none"
       id="path7030"
       d="m 96.322,48.945 c -0.748,0.033 -1.891,-0.127 -2.479,-0.491 2.54,-1.338 4.185,-3.985 4.185,-6.924 0,-4.325 -3.519,-7.843 -7.844,-7.843 -2.285,0 -4.325,0.999 -5.761,2.562 l 0,-35.2 c 0,-0.58 -0.469,-1.048 -1.048,-1.048 l -73.429,0 c -0.58,0 -1.048,0.469 -1.048,1.048 l 0,25.549 c -3.478,0.658 -6.117,3.709 -6.117,7.375 0,2.65 1.403,5.068 3.629,6.414 C 6.398,40.402 6.404,40.42 6.389,40.434 5.906,40.901 4.489,41.059 3.53,41.06 2.308,41.192 0,42.286 0,45.477 l 0,6.397 c 0.006,0.147 0.086,1.464 1.12,2.308 0.346,0.28 0.903,0.563 1.689,0.616 l 0,6.328 0,13.35 c 0,0.58 0.469,1.049 1.048,1.049 0.58,0 1.049,-0.469 1.049,-1.049 l 0,-12.301 9.926,0 0,12.301 c 0,0.58 0.469,1.049 1.048,1.049 0.579,0 1.049,-0.469 1.049,-1.049 l 0,-13.35 0,-8.595 29.46,0 c 0.401,0.336 0.833,0.629 1.298,0.878 -0.542,0.401 -1.767,0.545 -2.695,0.549 -1.198,0.15 -3.461,1.266 -3.461,4.416 l 0,6.368 c 0.002,0.147 0.049,1.475 1.069,2.326 0.377,0.315 0.995,0.649 1.925,0.649 0.014,0 0.033,-0.004 0.049,-0.004 l 0,6.021 0,13.352 c 0,0.58 0.469,1.049 1.048,1.049 0.58,0 1.049,-0.469 1.049,-1.049 l 0,-12.303 9.695,0 0,12.303 c 0,0.58 0.469,1.049 1.048,1.049 0.58,0 1.049,-0.469 1.049,-1.049 l 0,-13.352 0,-6.033 c 0.811,-0.041 1.389,-0.325 1.749,-0.605 1.062,-0.828 1.2,-2.134 1.216,-2.368 l 0,-5.467 c 0.371,0.225 0.885,0.411 1.575,0.411 0.028,0 0.063,-0.008 0.092,-0.008 l 0,5.171 0,11.867 c 0,0.579 0.469,1.048 1.049,1.048 0.579,0 1.049,-0.469 1.049,-1.048 l 0,-10.819 9.717,0 0,10.819 c 0,0.579 0.469,1.048 1.048,1.048 0.58,0 1.049,-0.469 1.049,-1.048 l 0,-11.867 0,-5.204 c 0.76,-0.058 1.335,-0.305 1.686,-0.569 1.083,-0.817 1.26,-2.117 1.282,-2.38 l 0,-4.15 0.206,0 c -0.038,0.266 -0.077,0.534 -0.077,0.838 l 0.002,6.422 c 0.01,0.146 0.123,1.456 1.171,2.289 0.365,0.291 0.952,0.586 1.792,0.618 l 0,6.586 0,12.608 c 0,0.58 0.469,1.049 1.049,1.049 0.579,0 1.048,-0.469 1.048,-1.049 l 0,-11.56 9.771,0 0,11.56 c 0,0.58 0.469,1.049 1.049,1.049 0.579,0 1.048,-0.469 1.048,-1.049 l 0,-12.609 0,-6.579 c 0.881,-0.019 1.483,-0.334 1.854,-0.635 1.032,-0.844 1.108,-2.163 1.114,-2.348 l 0,-6.354 C 100,50.17 97.688,49.08 96.322,48.945 Z M 84.424,46.832 c 0.576,0.627 1.249,1.165 2.009,1.583 -0.439,0.293 -1.238,0.454 -2.009,0.51 z M 16.246,43.799 c -0.082,-0.021 -0.16,-0.008 -0.24,-0.01 -0.043,-0.004 -0.08,-0.025 -0.125,-0.025 -0.58,0 -1.048,0.473 -1.048,1.053 l 0,15.26 -9.926,0 0,-12.301 c 0,-0.58 -0.469,-1.049 -1.049,-1.049 -0.579,0 -1.048,0.469 -1.048,1.049 l 0,4.921 C 2.667,52.673 2.542,52.632 2.452,52.559 2.153,52.322 2.102,51.829 2.098,51.829 l 0,-6.353 c 0,-2.003 1.395,-2.296 1.513,-2.327 0.281,-0.006 2.928,0.055 4.237,-1.21 0.228,-0.219 0.389,-0.475 0.516,-0.743 0.631,0.168 1.272,0.285 1.933,0.285 0.649,0 1.28,-0.11 1.898,-0.272 0.125,0.246 0.268,0.485 0.477,0.688 1.311,1.276 3.969,1.233 4.233,1.231 0.178,0 4.008,-0.031 5.361,-2.554 l 1.153,0.127 c -0.28,1.065 -0.809,1.859 -1.597,2.413 -2.149,1.504 -5.54,0.691 -5.576,0.685 z m 42.679,21.639 c -0.119,0.095 -0.276,0.146 -0.461,0.168 l 0,-4.48 c 0,-0.58 -0.469,-1.049 -1.049,-1.049 -0.579,0 -1.048,0.469 -1.048,1.049 l 0,11.56 -9.695,0 0,-11.56 c 0,-0.58 -0.469,-1.049 -1.049,-1.049 -0.579,0 -1.048,0.469 -1.048,1.049 l 0,4.48 c -0.229,0.008 -0.463,-0.012 -0.623,-0.142 -0.248,-0.2 -0.319,-0.63 -0.323,-0.737 l 0,-6.354 c 0,-2.008 1.354,-2.298 1.46,-2.327 0.295,-0.002 2.881,0.056 4.175,-1.197 0.201,-0.192 0.332,-0.422 0.455,-0.655 0.541,0.118 1.098,0.188 1.671,0.188 0.532,0 1.053,-0.056 1.557,-0.158 0.116,0.209 0.233,0.422 0.415,0.598 1.299,1.256 3.84,1.239 4.192,1.219 0.297,0.037 1.777,0.328 1.777,2.333 l 0.004,6.266 c 10e-4,0.006 -0.07,0.535 -0.41,0.798 z m 1.152,-10.407 c -0.773,-0.7 -1.73,-1.014 -2.437,-1.081 -0.756,0.037 -1.997,-0.131 -2.605,-0.51 0.485,-0.258 0.937,-0.56 1.354,-0.909 l 3.688,0 z m 17.354,2.356 c -0.112,0.088 -0.256,0.141 -0.424,0.17 l 0,-4.589 c 0,-0.58 -0.469,-1.049 -1.049,-1.049 -0.579,0 -1.048,0.469 -1.048,1.049 l 0,10.818 -9.717,0 0,-10.818 c 0,-0.58 -0.47,-1.049 -1.049,-1.049 -0.58,0 -1.049,0.469 -1.049,1.049 l 0,4.591 c -0.235,0.015 -0.477,0 -0.633,-0.129 -0.229,-0.192 -0.286,-0.614 -0.288,-0.748 l 0,-6.348 c 0,-0.987 0.315,-1.544 0.696,-1.887 0.878,0.856 2.629,1.676 6.104,1.98 0,0 0.518,0.08 1.322,0.08 0.002,0 0.002,0 0.002,0 1.51,0 3.709,-0.271 5.482,-1.482 0.312,-0.149 0.547,-0.463 0.729,-0.909 0.561,0.209 1.365,0.762 1.365,2.218 l 0.007,6.231 c 0.003,0.004 -0.086,0.547 -0.45,0.822 z m 3.754,-7.096 -1.219,-0.033 c -0.032,-2.615 -1.697,-3.792 -3.073,-4.191 0.137,-2.114 -0.117,-5.316 -0.754,-9.476 0,-2.748 -1.566,-5.114 -3.84,-6.326 0.004,-0.031 0.019,-0.058 0.019,-0.088 0,-0.58 -0.469,-1.048 -1.049,-1.048 l -19.647,0 c -0.58,0 -1.049,0.469 -1.049,1.048 0,0.579 0.469,1.049 1.049,1.049 l 12.514,0 c -0.852,0.786 -1.472,1.794 -1.828,2.949 l -10.686,0 c -0.58,0 -1.049,0.469 -1.049,1.048 0,0.579 0.469,1.049 1.049,1.049 l 10.342,0 c 0,0.014 -0.005,0.026 -0.005,0.041 l 0.109,10.108 c -0.894,0.528 -1.991,1.641 -1.991,3.914 l 0,0.101 -1.923,0 c 0.668,-1.153 1.077,-2.473 1.077,-3.896 0,-4.325 -3.518,-7.843 -7.841,-7.843 -4.325,0 -7.843,3.518 -7.843,7.843 0,1.423 0.41,2.742 1.077,3.896 l -27.694,0 0,-4.403 c 0.409,0.047 0.878,0.09 1.423,0.09 1.428,0 3.197,-0.262 4.661,-1.284 1.536,-1.069 2.435,-2.734 2.676,-4.946 0.031,-0.276 -0.051,-0.553 -0.225,-0.77 -0.174,-0.217 -0.428,-0.354 -0.705,-0.385 l -3.063,-0.334 c -0.512,-0.049 -1.003,0.281 -1.13,0.789 -0.444,1.773 -3.633,1.839 -3.69,1.839 -0.801,0.045 -2.22,-0.16 -2.722,-0.625 2.247,-1.343 3.657,-3.77 3.657,-6.434 0,-3.905 -3.004,-7.085 -6.817,-7.446 l 0,-24.43 71.333,0 0,47.298 c -0.4,0.209 -0.794,0.504 -1.143,0.896 z m 16.718,9.396 c 0,0.004 -0.048,0.516 -0.347,0.762 -0.12,0.098 -0.307,0.139 -0.524,0.149 l 0,-4.663 c 0,-0.579 -0.469,-1.049 -1.048,-1.049 -0.58,0 -1.049,0.47 -1.049,1.049 l 0,12.302 -9.771,0 0,-12.302 c 0,-0.579 -0.469,-1.049 -1.048,-1.049 -0.58,0 -1.049,0.47 -1.049,1.049 l 0,4.665 c -0.194,-0.019 -0.36,-0.063 -0.479,-0.155 -0.312,-0.242 -0.383,-0.728 -0.389,-0.728 l 0,-6.348 c 0,-2.01 1.438,-2.296 1.572,-2.327 0.313,0.002 2.979,0.052 4.295,-1.22 0.196,-0.193 0.327,-0.418 0.45,-0.649 0.549,0.121 1.106,0.2 1.667,0.2 0.519,0 1.034,-0.067 1.544,-0.17 0.121,0.222 0.244,0.442 0.437,0.629 1.305,1.262 3.936,1.219 4.079,1.204 0.067,0.008 1.659,0.201 1.659,2.333 l 0,6.318 z" />
    <path
       inkscape:connector-curvature="0"
       style="stroke:none"
       id="path7032"
       d="m 41.977,8.945 -21.81,0 c -0.58,0 -1.048,0.469 -1.048,1.049 0,0.579 0.469,1.048 1.048,1.048 l 21.81,0 c 0.58,0 1.048,-0.469 1.048,-1.048 0,-0.58 -0.469,-1.049 -1.048,-1.049 z" />
    <path
       inkscape:connector-curvature="0"
       style="stroke:none"
       id="path7034"
       d="m 8.594,67.562 0,6.794 c 0,0.579 0.47,1.048 1.049,1.048 0.58,0 1.049,-0.469 1.049,-1.048 l 0,-6.794 c 0,-0.58 -0.469,-1.049 -1.049,-1.049 -0.58,10e-4 -1.049,0.469 -1.049,1.049 z" />
    <path
       inkscape:connector-curvature="0"
       style="stroke:none"
       id="path7036"
       d="m 50.511,80.345 0,6.794 c 0,0.579 0.47,1.048 1.048,1.048 0.58,0 1.049,-0.469 1.049,-1.048 l 0,-6.794 c 0,-0.58 -0.469,-1.049 -1.049,-1.049 -0.578,0 -1.048,0.469 -1.048,1.049 z" />
    <path
       inkscape:connector-curvature="0"
       style="stroke:none"
       id="path7038"
       d="m 88.858,75.27 0,6.794 c 0,0.579 0.469,1.048 1.048,1.048 0.58,0 1.049,-0.469 1.049,-1.048 l 0,-6.794 c 0,-0.58 -0.469,-1.049 -1.049,-1.049 -0.579,0 -1.048,0.468 -1.048,1.049 z" />
    <path
       inkscape:connector-curvature="0"
       style="stroke:none"
       id="path7040"
       d="m 68.933,70.758 0,5.794 c 0,0.579 0.471,1.048 1.049,1.048 0.58,0 1.049,-0.469 1.049,-1.048 l 0,-5.794 c 0,-0.58 -0.469,-1.049 -1.049,-1.049 -0.579,0 -1.049,0.469 -1.049,1.049 z" />
    <path
       inkscape:connector-curvature="0"
       style="stroke:none"
       id="path7042"
       d="m 20.167,16.088 15.32,0 c 0.58,0 1.049,-0.469 1.049,-1.049 0,-0.579 -0.469,-1.048 -1.049,-1.048 l -15.32,0 c -0.58,0 -1.048,0.469 -1.048,1.048 0,0.58 0.468,1.049 1.048,1.049 z" />
    <path
       inkscape:connector-curvature="0"
       style="stroke:none"
       id="path7044"
       d="m 20.167,21.134 19.647,0 c 0.58,0 1.048,-0.469 1.048,-1.049 0,-0.579 -0.469,-1.048 -1.048,-1.048 l -19.647,0 c -0.58,0 -1.048,0.469 -1.048,1.048 0,0.58 0.468,1.049 1.048,1.049 z" />
    <path
       inkscape:connector-curvature="0"
       style="stroke:none"
       id="path7046"
       d="m 20.167,26.18 17.484,0 c 0.58,0 1.049,-0.469 1.049,-1.049 0,-0.58 -0.469,-1.048 -1.049,-1.048 l -17.484,0 c -0.58,0 -1.048,0.469 -1.048,1.048 0,0.579 0.468,1.049 1.048,1.049 z" />
    <path
       inkscape:connector-curvature="0"
       style="stroke:none"
       id="path7048"
       d="m 20.167,31.226 19.647,0 c 0.58,0 1.048,-0.469 1.048,-1.049 0,-0.58 -0.469,-1.048 -1.048,-1.048 l -19.647,0 c -0.58,0 -1.048,0.469 -1.048,1.048 0,0.579 0.468,1.049 1.048,1.049 z" />
    <path
       inkscape:connector-curvature="0"
       style="stroke:none"
       id="path7050"
       d="m 41.977,34.174 -21.81,0 c -0.58,0 -1.048,0.469 -1.048,1.048 0,0.579 0.469,1.049 1.048,1.049 l 21.81,0 c 0.58,0 1.048,-0.469 1.048,-1.049 0,-0.58 -0.469,-1.048 -1.048,-1.048 z" />
    <path
       inkscape:connector-curvature="0"
       style="stroke:none"
       id="path7052"
       d="m 73.432,8.945 -21.81,0 c -0.58,0 -1.049,0.469 -1.049,1.049 0,0.579 0.469,1.048 1.049,1.048 l 21.81,0 c 0.579,0 1.048,-0.469 1.048,-1.048 -0.001,-0.58 -0.469,-1.049 -1.048,-1.049 z" />
    <path
       inkscape:connector-curvature="0"
       style="stroke:none"
       id="path7054"
       d="m 51.622,16.088 15.319,0 c 0.58,0 1.049,-0.469 1.049,-1.049 0,-0.579 -0.469,-1.048 -1.049,-1.048 l -15.319,0 c -0.58,0 -1.049,0.469 -1.049,1.048 0,0.58 0.469,1.049 1.049,1.049 z" />
    <path
       inkscape:connector-curvature="0"
       style="stroke:none"
       id="path7056"
       d="m 71.269,19.037 -19.647,0 c -0.58,0 -1.049,0.469 -1.049,1.048 0,0.58 0.469,1.049 1.049,1.049 l 19.646,0 c 0.58,0 1.049,-0.469 1.049,-1.049 0,-0.579 -0.468,-1.048 -1.048,-1.048 z" />
    <path
       inkscape:connector-curvature="0"
       style="stroke:none"
       id="path7058"
       d="m 69.106,24.083 -17.484,0 c -0.58,0 -1.049,0.469 -1.049,1.048 0,0.579 0.469,1.049 1.049,1.049 l 17.484,0 c 0.579,0 1.049,-0.469 1.049,-1.049 0,-0.58 -0.469,-1.048 -1.049,-1.048 z" />
  </g>
  <path
     inkscape:connector-curvature="0"
     style="opacity:0.6;fill:none;stroke:#800000;stroke-width:3;stroke-linecap:butt;stroke-linejoin:miter;stroke-miterlimit:4;stroke-dasharray:6, 3;stroke-dashoffset:0;stroke-opacity:1;marker-end:url(#Arrow2Mende)"
     id="path5719-6"
     d="m 193.41234,166.40625 c 64.05423,-10.79952 60.60454,-34.56551 74.04829,-55.18741" />
  <path
     inkscape:connector-curvature="0"
     style="opacity:0.6;fill:none;stroke:#800000;stroke-width:3;stroke-linecap:butt;stroke-linejoin:miter;stroke-miterlimit:4;stroke-dasharray:6, 3;stroke-dashoffset:0;stroke-opacity:1;marker-end:url(#Arrow2Mendm)"
     id="path5719-8"
     d="m 23.41234,111.40626 c -2.3099,44.1033 25,110 100,130" />
  <path
     inkscape:connector-curvature="0"
     style="opacity:0.6;fill:none;stroke:#000080;stroke-width:3;stroke-linecap:butt;stroke-linejoin:miter;stroke-miterlimit:4;stroke-dasharray:6, 3;stroke-dashoffset:0;stroke-opacity:1;marker-start:none;marker-end:url(#Arrow2Mend-36e)"
     id="path6703-2-9-2"
     d="m 313.41234,111.40626 c 0,80 0,159.99999 -120,159.99999" />
  <path
     inkscape:connector-curvature="0"
     style="opacity:0.6;fill:none;stroke:#800000;stroke-width:3;stroke-linecap:butt;stroke-linejoin:miter;stroke-miterlimit:4;stroke-dasharray:6, 3;stroke-dashoffset:0;stroke-opacity:1;marker-end:url(#Arrow2Mend-36d)"
     id="path12586"
     d="m 3.41234,111.40625 c 0,110 0,260 90,260" />
  <text
     sodipodi:linespacing="0%"
     style="font-style:normal;font-weight:normal;font-size:12px;line-height:0%;font-family:sans-serif;letter-spacing:0px;word-spacing:0px;fill:#000000;fill-opacity:1;stroke:none"
     xml:space="preserve"
     id="text12823"
     y="131.40627"
     x="38.412338"><tspan
       style="font-size:10px;line-height:1.25;font-family:sans-serif"
       id="tspan12825"
       y="131.40627"
       x="38.412338">1.a) Lehr-/Lernmaterial</tspan><tspan
       style="font-size:10px;line-height:1.25;font-family:sans-serif"
       id="tspan12911"
       y="143.90627"
       x="38.412338">1.b) Aufgaben</tspan></text>
  <text
     sodipodi:linespacing="0%"
     style="font-style:normal;font-weight:normal;font-size:12px;line-height:0%;font-family:sans-serif;letter-spacing:0px;word-spacing:0px;fill:#000000;fill-opacity:1;stroke:none"
     xml:space="preserve"
     id="text12823-3"
     y="216.40627"
     x="118.41234"><tspan
       style="font-size:10px;line-height:1.25;font-family:sans-serif"
       id="tspan12825-1"
       y="216.40627"
       x="118.41234">2. Selbststudium</tspan></text>
  <text
     sodipodi:linespacing="0%"
     style="font-style:normal;font-weight:normal;font-size:12px;line-height:0%;font-family:sans-serif;letter-spacing:0px;word-spacing:0px;fill:#000000;fill-opacity:1;stroke:none"
     xml:space="preserve"
     id="text12823-9"
     y="87.18779"
     x="86.770905"><tspan
       style="font-size:10px;line-height:1.25;font-family:sans-serif"
       id="tspan12825-4"
       y="87.18779"
       x="86.770905">Fortlaufend: Online-Diskussion</tspan></text>
  <text
     sodipodi:linespacing="0%"
     style="font-style:normal;font-weight:normal;font-size:12px;line-height:0%;font-family:sans-serif;letter-spacing:0px;word-spacing:0px;fill:#000000;fill-opacity:1;stroke:none"
     xml:space="preserve"
     id="text12823-3-7"
     y="281.90625"
     x="214.78734"><tspan
       style="font-size:10px;line-height:1.25;font-family:sans-serif"
       id="tspan12825-1-8"
       y="281.90625"
       x="214.78734">3. Lösung</tspan></text>
  <text
     sodipodi:linespacing="0%"
     style="font-style:normal;font-weight:normal;font-size:12px;line-height:0%;font-family:sans-serif;letter-spacing:0px;word-spacing:0px;fill:#000000;fill-opacity:1;stroke:none"
     xml:space="preserve"
     id="text12823-0"
     y="311.40625"
     x="113.41234"><tspan
       style="font-size:10px;line-height:1.25;font-family:sans-serif"
       id="tspan12825-3"
       y="311.40625"
       x="113.41234">4.a) Fehleranalyse</tspan><tspan
       style="font-size:10px;line-height:1.25;font-family:sans-serif"
       id="tspan12911-6"
       y="323.90625"
       x="113.41234">4.b) Präsenzplanung</tspan><tspan
       style="font-size:10px;line-height:1.25;font-family:sans-serif"
       id="tspan12937"
       y="336.40625"
       x="113.41234">4.c) Feedback</tspan></text>
  <text
     sodipodi:linespacing="0%"
     style="font-style:normal;font-weight:normal;font-size:12px;line-height:0%;font-family:sans-serif;letter-spacing:0px;word-spacing:0px;fill:#000000;fill-opacity:1;stroke:none"
     xml:space="preserve"
     id="text12823-3-7-1"
     y="266.40625"
     x="109.41234"><tspan
       style="font-size:10px;line-height:1.25;font-family:sans-serif"
       id="tspan12825-1-8-0"
       y="266.40625"
       x="109.41234">4.a)</tspan></text>
  <text
     sodipodi:linespacing="0%"
     style="font-style:normal;font-weight:normal;font-size:12px;line-height:0%;font-family:sans-serif;letter-spacing:0px;word-spacing:0px;fill:#000000;fill-opacity:1;stroke:none"
     xml:space="preserve"
     id="text12823-3-7-1-6"
     y="356.04913"
     x="74.260559"><tspan
       style="font-size:10px;line-height:1.25;font-family:sans-serif"
       id="tspan12825-1-8-0-3"
       y="356.04913"
       x="74.260559">4.b)</tspan></text>
  <text
     sodipodi:linespacing="0%"
     style="font-style:normal;font-weight:normal;font-size:12px;line-height:0%;font-family:sans-serif;letter-spacing:0px;word-spacing:0px;fill:#000000;fill-opacity:1;stroke:none"
     xml:space="preserve"
     id="text12823-3-7-1-6-5"
     y="241.40627"
     x="203.41234"><tspan
       style="font-size:10px;line-height:1.25;font-family:sans-serif"
       id="tspan12825-1-8-0-3-5"
       y="241.40627"
       x="203.41234">4.c)</tspan></text>
  <path
     inkscape:connector-curvature="0"
     style="fill:none;stroke:#000080;stroke-width:2.8125;stroke-linecap:butt;stroke-linejoin:miter;stroke-miterlimit:4;stroke-dasharray:none;stroke-opacity:1"
     id="path4790"
     d="m 223.41234,384.53125 c 45,0 89.16173,17.39344 89.16173,37.39344" />
  <path
     inkscape:connector-curvature="0"
     style="fill:none;stroke:#800000;stroke-width:2.8125;stroke-linecap:butt;stroke-linejoin:miter;stroke-miterlimit:4;stroke-dasharray:none;stroke-opacity:1"
     id="path4790-5-5"
     d="m 71.06859,452.03125 c -45,0 -62.2445199,-17.60656 -62.2445199,-37.60656" />
  <text
     sodipodi:linespacing="0%"
     style="font-style:normal;font-weight:normal;font-size:12px;line-height:0%;font-family:sans-serif;letter-spacing:0px;word-spacing:0px;fill:#000000;fill-opacity:1;stroke:none"
     xml:space="preserve"
     id="text12823-3-7-6"
     y="517.62054"
     x="102.73376"><tspan
       style="font-size:10px;line-height:1.25;font-family:sans-serif"
       id="tspan12825-1-8-2"
       y="517.62054"
       x="102.73376">5. Präsenzveranstaltung</tspan></text>
  <path
     inkscape:connector-curvature="0"
     style="fill:none;stroke:#800000;stroke-width:2.8125;stroke-linecap:butt;stroke-linejoin:miter;stroke-miterlimit:4;stroke-dasharray:none;stroke-opacity:1;marker-end:url(#Arrow2Mend-360)"
     id="path4332"
     d="m 162.57407,0.04967913 c 28.125,0 75,0 75,28.12500087" />
  <path
     inkscape:connector-curvature="0"
     style="fill:none;stroke:#800000;stroke-width:2.8125;stroke-linecap:butt;stroke-linejoin:miter;stroke-miterlimit:4;stroke-dasharray:none;stroke-opacity:1"
     id="path4332-7"
     d="m 162.57407,0.04968 c -28.125,0 -75,0 -75,28.125" />
  <path
     inkscape:connector-curvature="0"
     style="fill:none;stroke:#000080;stroke-width:2.81249976;stroke-linecap:butt;stroke-linejoin:miter;stroke-miterlimit:4;stroke-dasharray:none;stroke-opacity:1"
     id="path4332-7-5"
     d="m 162.57407,65.67468 c 28.125,0 75,0 75,-28.125" />
  <path
     inkscape:connector-curvature="0"
     style="fill:none;stroke:#000080;stroke-width:2.8125;stroke-linecap:butt;stroke-linejoin:miter;stroke-miterlimit:4;stroke-dasharray:none;stroke-opacity:1;marker-end:url(#Arrow2Mend-36L)"
     id="path4332-7-5-3"
     d="m 162.57407,65.67468 c -28.125,0 -75,0 -75,-28.125" />
  <path
     inkscape:connector-curvature="0"
     style="opacity:0.6;fill:none;stroke:#800000;stroke-width:2.8125;stroke-linecap:butt;stroke-linejoin:miter;stroke-miterlimit:4;stroke-dasharray:5.62500009, 2.81250004;stroke-dashoffset:0;stroke-opacity:1;marker-end:url(#Arrow2Mend-36W)"
     id="path5750"
     d="m 190.69907,253.17468 c 94.92359,-4.36217 87.18627,-80.80539 103.125,-140.625" />
  <path
     inkscape:connector-curvature="0"
     style="opacity:0.6;fill:none;stroke:#000080;stroke-width:2.8125;stroke-linecap:butt;stroke-linejoin:miter;stroke-miterlimit:4;stroke-dasharray:5.62500009, 2.81250004;stroke-dashoffset:0;stroke-opacity:1;marker-end:url(#Arrow2Mend-36e1)"
     id="path6315"
     d="M 125.07407,271.92468 C 38.523448,258.25344 17.722349,191.69671 12.574068,112.54968" />
  <path
     inkscape:connector-curvature="0"
     style="fill:none;stroke:#000080;stroke-width:2.8125;stroke-linecap:butt;stroke-linejoin:miter;stroke-miterlimit:4;stroke-dasharray:none;stroke-opacity:1;marker-end:url(#Arrow2Mend-36Z)"
     id="path6910"
     d="m 312.57407,421.92469 c -1.48838,20.49497 -24.86272,29.05215 -65.625,28.125" />
  <path
     inkscape:connector-curvature="0"
     style="fill:none;stroke:#800000;stroke-width:2.8125;stroke-linecap:butt;stroke-linejoin:miter;stroke-miterlimit:4;stroke-dasharray:none;stroke-opacity:1;marker-end:url(#Arrow2Mend-36p)"
     id="path7491"
     d="M 8.8240701,414.42469 C 6.6381502,385.5641 45.93274,383.36955 93.19907,386.29969" />
</svg>
