<svg
   xmlns:dc="http://purl.org/dc/elements/1.1/"
   xmlns:cc="http://creativecommons.org/ns#"
   xmlns:rdf="http://www.w3.org/1999/02/22-rdf-syntax-ns#"
   xmlns:svg="http://www.w3.org/2000/svg"
   xmlns="http://www.w3.org/2000/svg"
   xmlns:inkscape="http://www.inkscape.org/namespaces/inkscape"
   version="1.1"
   width="674.14844"
   height="576.20312"
   viewBox="0 0 674.14844 576.20312"
   id="svg-7-PI-spin-2">
  <defs
     id="defs4">
    <marker
       refX="0"
       refY="0"
       orient="auto"
       id="Arrow2Lend"
       style="overflow:visible">
      <path
         d="M 8.7185878,4.0337352 -2.2072895,0.01601326 8.7185884,-4.0017078 c -1.7454984,2.3720609 -1.7354408,5.6174519 -6e-7,8.035443 z"
         transform="matrix(-1.1,0,0,-1.1,-1.1,0)"
         id="path3786"
         style="fill-rule:evenodd;stroke-width:0.625;stroke-linejoin:round" />
    </marker>
    <marker
       refX="0"
       refY="0"
       orient="auto"
       id="Arrow1Lend"
       style="overflow:visible">
      <path
         d="M 0,0 5,-5 -12.5,0 5,5 0,0 z"
         transform="matrix(-0.8,0,0,-0.8,-10,0)"
         id="path3768"
         style="fill-rule:evenodd;stroke:#000000;stroke-width:1pt" />
    </marker>
    <inkscape:path-effect
       effect="skeletal"
       id="path-effect2989" />
  </defs>
  <metadata
     id="metadata7">
    <rdf:RDF>
      <cc:Work
         rdf:about="">
        <dc:format>image/svg+xml</dc:format>
        <dc:type
           rdf:resource="http://purl.org/dc/dcmitype/StillImage" />
        <dc:title></dc:title>
      </cc:Work>
    </rdf:RDF>
  </metadata>
  <g
     transform="translate(-19.90625,-8.6121826)"
     id="layer1">
    <path
       d="m 60,144.36218 0,400"
       id="path2991"
       style="fill:none;stroke:#000000;stroke-width:3;stroke-linecap:butt;stroke-linejoin:miter;stroke-miterlimit:4;stroke-opacity:1;stroke-dasharray:none;marker-end:url(#Arrow2Lend)" />
    <text
       x="20"
       y="584.36218"
       id="text4391"
       xml:space="preserve"
       style="font-size:40px;font-style:normal;font-weight:normal;line-height:125%;letter-spacing:0px;word-spacing:0px;fill:#000000;fill-opacity:1;stroke:none;font-family:Sans"><tspan
         x="20"
         y="584.36218"
         id="tspan4393"
         style="font-size:32px">Time</tspan></text>
    <text
       x="106"
       y="32.362183"
       id="text4395"
       xml:space="preserve"
       style="font-size:40px;font-style:normal;font-weight:normal;line-height:125%;letter-spacing:0px;word-spacing:0px;fill:#000000;fill-opacity:1;stroke:none;font-family:Sans"><tspan
         x="106"
         y="32.362183"
         id="tspan4397"
         style="font-size:32px">Two CPU cores</tspan></text>
    <path
       d="m 140,152.36218 0,360"
       id="path4399"
       style="fill:#ff0000;stroke:#008000;stroke-width:5;stroke-linecap:butt;stroke-linejoin:miter;stroke-miterlimit:4;stroke-opacity:1;stroke-dasharray:none" />
    <path
       d="m 260,312.36218 0,200"
       id="path4401"
       style="fill:#ff0000;stroke:#ff0000;stroke-width:5;stroke-linecap:butt;stroke-linejoin:miter;stroke-miterlimit:4;stroke-opacity:1;stroke-dasharray:none" />
    <path
       d="m 40,224.36218 300,0"
       id="path4403"
       style="fill:none;stroke:#000000;stroke-width:2;stroke-linecap:butt;stroke-linejoin:miter;stroke-miterlimit:4;stroke-opacity:1;stroke-dasharray:4, 2;stroke-dashoffset:0" />
    <text
       x="360"
       y="244.36218"
       id="text4405"
       xml:space="preserve"
       style="font-size:40px;font-style:normal;font-weight:normal;line-height:125%;letter-spacing:0px;word-spacing:0px;fill:#000000;fill-opacity:1;stroke:none;font-family:Sans"><tspan
         x="360"
         y="244.36218"
         id="tspan4407"
         style="font-size:24px"><tspan
   id="tspan4433"
   style="fill:#008000">T0</tspan> enters CS.</tspan></text>
    <text
       x="360"
       y="324.36218"
       id="text4409"
       xml:space="preserve"
       style="font-size:40px;font-style:normal;font-weight:normal;line-height:125%;letter-spacing:0px;word-spacing:0px;fill:#000000;fill-opacity:1;stroke:none;font-family:Sans"><tspan
         x="360"
         y="324.36218"
         id="tspan4413"
         style="font-size:24px">OS dispatches <tspan
   id="tspan4447"
   style="fill:#ff0000">T1</tspan> on core 1.</tspan><tspan
         x="360"
         y="354.36218"
         id="tspan4511"
         style="font-size:24px">(<tspan
   id="tspan4513"
   style="fill:#008000">T0</tspan> continues on core 0.)</tspan><tspan
         x="360"
         y="384.36218"
         id="tspan4439"
         style="font-size:24px" /><tspan
         x="360"
         y="414.36218"
         id="tspan4443"
         style="font-size:24px"><tspan
   id="tspan4449"
   style="fill:#ff0000">T1</tspan> spins on lock held by <tspan
   id="tspan4451"
   style="fill:#008000">T0.</tspan></tspan></text>
    <path
       d="m 40,312.36218 300,0"
       id="path4403-3"
       style="fill:none;stroke:#000000;stroke-width:2;stroke-linecap:butt;stroke-linejoin:miter;stroke-miterlimit:4;stroke-opacity:1;stroke-dasharray:4, 2;stroke-dashoffset:0" />
    <text
       x="238.33092"
       y="56.647896"
       id="text4455"
       xml:space="preserve"
       style="font-size:40px;font-style:normal;font-weight:normal;text-align:center;line-height:125%;letter-spacing:0px;word-spacing:0px;text-anchor:middle;fill:#000000;fill-opacity:1;stroke:none;font-family:Sans"><tspan
         x="238.33092"
         y="56.647896"
         id="tspan4457"
         style="font-size:16px;text-align:center;text-anchor:middle">(Color indicates which thread executes;</tspan><tspan
         x="238.33092"
         y="76.647896"
         id="tspan4482"
         style="font-size:16px;text-align:center;text-anchor:middle">black indicates idle core.)</tspan></text>
    <text
       x="108.57143"
       y="113.79075"
       id="text4484"
       xml:space="preserve"
       style="font-size:40px;font-style:normal;font-weight:normal;line-height:125%;letter-spacing:0px;word-spacing:0px;fill:#000000;fill-opacity:1;stroke:none;font-family:Sans"><tspan
         x="108.57143"
         y="113.79075"
         id="tspan4486"
         style="font-size:20px">Core 0</tspan></text>
    <text
       x="240"
       y="112.36218"
       id="text4484-6"
       xml:space="preserve"
       style="font-size:40px;font-style:normal;font-weight:normal;line-height:125%;letter-spacing:0px;word-spacing:0px;fill:#000000;fill-opacity:1;stroke:none;font-family:Sans"><tspan
         x="240"
         y="112.36218"
         id="tspan4486-7"
         style="font-size:20px">Core 1</tspan></text>
    <path
       d="m 40,452.36218 300,0"
       id="path4403-3-5"
       style="fill:none;stroke:#000000;stroke-width:2;stroke-linecap:butt;stroke-linejoin:miter;stroke-miterlimit:4;stroke-opacity:1;stroke-dasharray:4, 2;stroke-dashoffset:0" />
    <text
       x="360"
       y="472.36218"
       id="text4405-3"
       xml:space="preserve"
       style="font-size:40px;font-style:normal;font-weight:normal;line-height:125%;letter-spacing:0px;word-spacing:0px;fill:#000000;fill-opacity:1;stroke:none;font-family:Sans"><tspan
         x="360"
         y="472.36218"
         id="tspan4407-5"
         style="font-size:24px"><tspan
   id="tspan4433-6"
   style="fill:#008000">T0</tspan> leaves CS.</tspan><tspan
         x="360"
         y="502.36218"
         id="tspan4572"
         style="font-size:24px"><tspan
   id="tspan4576"
   style="fill:#ff0000">T1</tspan> enters CS (after delay).</tspan></text>
    <path
       d="m 260,312.36218 0,-160"
       id="path4574"
       style="fill:none;stroke:#000000;stroke-width:5;stroke-linecap:butt;stroke-linejoin:miter;stroke-miterlimit:4;stroke-opacity:1;stroke-dasharray:none" />
  </g>
</svg>
