<?xml version="1.0" encoding="utf-8"  standalone="no"?>
<!DOCTYPE svg PUBLIC "-//W3C//DTD SVG 1.1//EN"
 "http://www.w3.org/Graphics/SVG/1.1/DTD/svg11.dtd">
<svg
 width="1920" height="1440"
 viewBox="0 0 1920 1440"
 xmlns="http://www.w3.org/2000/svg"
 xmlns:xlink="http://www.w3.org/1999/xlink"
>

<title>Gnuplot</title>
<desc>Produced by GNUPLOT 5.0 patchlevel 5 </desc>

<g id="gnuplot_canvas">

<rect x="0" y="0" width="1920" height="1440" fill="none"/>
<defs>

	<circle id='gpDot' r='0.5' stroke-width='0.5'/>
	<path id='gpPt0' stroke-width='0.074' stroke='currentColor' d='M-1,0 h2 M0,-1 v2'/>
	<path id='gpPt1' stroke-width='0.074' stroke='currentColor' d='M-1,-1 L1,1 M1,-1 L-1,1'/>
	<path id='gpPt2' stroke-width='0.074' stroke='currentColor' d='M-1,0 L1,0 M0,-1 L0,1 M-1,-1 L1,1 M-1,1 L1,-1'/>
	<rect id='gpPt3' stroke-width='0.074' stroke='currentColor' x='-1' y='-1' width='2' height='2'/>
	<rect id='gpPt4' stroke-width='0.074' stroke='currentColor' fill='currentColor' x='-1' y='-1' width='2' height='2'/>
	<circle id='gpPt5' stroke-width='0.074' stroke='currentColor' cx='0' cy='0' r='1'/>
	<use xlink:href='#gpPt5' id='gpPt6' fill='currentColor' stroke='none'/>
	<path id='gpPt7' stroke-width='0.074' stroke='currentColor' d='M0,-1.33 L-1.33,0.67 L1.33,0.67 z'/>
	<use xlink:href='#gpPt7' id='gpPt8' fill='currentColor' stroke='none'/>
	<use xlink:href='#gpPt7' id='gpPt9' stroke='currentColor' transform='rotate(180)'/>
	<use xlink:href='#gpPt9' id='gpPt10' fill='currentColor' stroke='none'/>
	<use xlink:href='#gpPt3' id='gpPt11' stroke='currentColor' transform='rotate(45)'/>
	<use xlink:href='#gpPt11' id='gpPt12' fill='currentColor' stroke='none'/>
	<path id='gpPt13' stroke-width='0.074' stroke='currentColor' d='M0,1.330 L1.265,0.411 L0.782,-1.067 L-0.782,-1.076 L-1.265,0.411 z'/>
	<use xlink:href='#gpPt13' id='gpPt14' fill='currentColor' stroke='none'/>
	<filter id='textbox' filterUnits='objectBoundingBox' x='0' y='0' height='1' width='1'>
	  <feFlood flood-color='white' flood-opacity='1' result='bgnd'/>
	  <feComposite in='SourceGraphic' in2='bgnd' operator='atop'/>
	</filter>
	<filter id='greybox' filterUnits='objectBoundingBox' x='0' y='0' height='1' width='1'>
	  <feFlood flood-color='lightgrey' flood-opacity='1' result='grey'/>
	  <feComposite in='SourceGraphic' in2='grey' operator='atop'/>
	</filter>
</defs>
<g fill="none" color="white" stroke="currentColor" stroke-width="1.00" stroke-linecap="butt" stroke-linejoin="miter">
</g>
<g fill="none" color="black" stroke="currentColor" stroke-width="1.00" stroke-linecap="butt" stroke-linejoin="miter">
	<path stroke='black'  d='M219.6,1062.8 L192.6,1062.8  '/>	<g transform="translate(167.4,1074.5)" stroke="none" fill="black" font-family="Arial" font-size="36.00"  text-anchor="end">
		<text><tspan font-family="Arial" > 0</tspan></text>
	</g>
</g>
<g fill="none" color="black" stroke="currentColor" stroke-width="1.00" stroke-linecap="butt" stroke-linejoin="miter">
	<path stroke='black'  d='M219.6,912.7 L192.6,912.7  '/>	<g transform="translate(167.4,924.4)" stroke="none" fill="black" font-family="Arial" font-size="36.00"  text-anchor="end">
		<text><tspan font-family="Arial" > 10</tspan></text>
	</g>
</g>
<g fill="none" color="black" stroke="currentColor" stroke-width="1.00" stroke-linecap="butt" stroke-linejoin="miter">
	<path stroke='black'  d='M219.6,762.6 L192.6,762.6  '/>	<g transform="translate(167.4,774.3)" stroke="none" fill="black" font-family="Arial" font-size="36.00"  text-anchor="end">
		<text><tspan font-family="Arial" > 20</tspan></text>
	</g>
</g>
<g fill="none" color="black" stroke="currentColor" stroke-width="1.00" stroke-linecap="butt" stroke-linejoin="miter">
	<path stroke='black'  d='M219.6,612.4 L192.6,612.4  '/>	<g transform="translate(167.4,624.1)" stroke="none" fill="black" font-family="Arial" font-size="36.00"  text-anchor="end">
		<text><tspan font-family="Arial" > 30</tspan></text>
	</g>
</g>
<g fill="none" color="black" stroke="currentColor" stroke-width="1.00" stroke-linecap="butt" stroke-linejoin="miter">
	<path stroke='black'  d='M219.6,462.3 L192.6,462.3  '/>	<g transform="translate(167.4,474.0)" stroke="none" fill="black" font-family="Arial" font-size="36.00"  text-anchor="end">
		<text><tspan font-family="Arial" > 40</tspan></text>
	</g>
</g>
<g fill="none" color="black" stroke="currentColor" stroke-width="1.00" stroke-linecap="butt" stroke-linejoin="miter">
	<path stroke='black'  d='M219.6,312.2 L192.6,312.2  '/>	<g transform="translate(167.4,323.9)" stroke="none" fill="black" font-family="Arial" font-size="36.00"  text-anchor="end">
		<text><tspan font-family="Arial" > 50</tspan></text>
	</g>
</g>
<g fill="none" color="black" stroke="currentColor" stroke-width="1.00" stroke-linecap="butt" stroke-linejoin="miter">
	<path stroke='black'  d='M219.6,162.1 L192.6,162.1  '/>	<g transform="translate(167.4,173.8)" stroke="none" fill="black" font-family="Arial" font-size="36.00"  text-anchor="end">
		<text><tspan font-family="Arial" > 60</tspan></text>
	</g>
</g>
<g fill="none" color="black" stroke="currentColor" stroke-width="1.00" stroke-linecap="butt" stroke-linejoin="miter">
	<path stroke='black'  d='M476.7,1062.8 L476.7,1089.8  '/>	<g transform="translate(483.5,1124.5) rotate(-36)" stroke="none" fill="black" font-family="Arial" font-size="36.00"  text-anchor="end">
		<text><tspan font-family="Arial" >definitiv verbessert</tspan></text>
	</g>
</g>
<g fill="none" color="black" stroke="currentColor" stroke-width="1.00" stroke-linecap="butt" stroke-linejoin="miter">
	<path stroke='black'  d='M733.8,1062.8 L733.8,1089.8  '/>	<g transform="translate(740.6,1124.5) rotate(-36)" stroke="none" fill="black" font-family="Arial" font-size="36.00"  text-anchor="end">
		<text><tspan font-family="Arial" >etwas verbessert</tspan></text>
	</g>
</g>
<g fill="none" color="black" stroke="currentColor" stroke-width="1.00" stroke-linecap="butt" stroke-linejoin="miter">
	<path stroke='black'  d='M990.9,1062.8 L990.9,1089.8  '/>	<g transform="translate(997.7,1124.5) rotate(-36)" stroke="none" fill="black" font-family="Arial" font-size="36.00"  text-anchor="end">
		<text><tspan font-family="Arial" >etwa gleich</tspan></text>
	</g>
</g>
<g fill="none" color="black" stroke="currentColor" stroke-width="1.00" stroke-linecap="butt" stroke-linejoin="miter">
	<path stroke='black'  d='M1247.9,1062.8 L1247.9,1089.8  '/>	<g transform="translate(1254.7,1124.5) rotate(-36)" stroke="none" fill="black" font-family="Arial" font-size="36.00"  text-anchor="end">
		<text><tspan font-family="Arial" >etwas schlechter</tspan></text>
	</g>
</g>
<g fill="none" color="black" stroke="currentColor" stroke-width="1.00" stroke-linecap="butt" stroke-linejoin="miter">
	<path stroke='black'  d='M1505.0,1062.8 L1505.0,1089.8  '/>	<g transform="translate(1511.8,1124.5) rotate(-36)" stroke="none" fill="black" font-family="Arial" font-size="36.00"  text-anchor="end">
		<text><tspan font-family="Arial" >definitiv schlechter</tspan></text>
	</g>
</g>
<g fill="none" color="black" stroke="currentColor" stroke-width="1.00" stroke-linecap="butt" stroke-linejoin="miter">
</g>
<g fill="none" color="black" stroke="currentColor" stroke-width="1.00" stroke-linecap="butt" stroke-linejoin="miter">
	<path stroke='black'  d='M219.6,162.1 L219.6,1062.8 L1762.1,1062.8 L1762.1,162.1 L219.6,162.1 Z  '/></g>
<g fill="none" color="black" stroke="currentColor" stroke-width="1.00" stroke-linecap="butt" stroke-linejoin="miter">
	<g transform="translate(51.3,612.5) rotate(270)" stroke="none" fill="black" font-family="Arial" font-size="36.00"  text-anchor="middle">
		<text><tspan font-family="Arial" >Prozent der Antworten</tspan></text>
	</g>
</g>
<g fill="none" color="black" stroke="currentColor" stroke-width="1.00" stroke-linecap="butt" stroke-linejoin="miter">
	<g transform="translate(990.8,92.8)" stroke="none" fill="black" font-family="Arial" font-size="36.00"  text-anchor="middle">
		<text><tspan font-family="Arial" >Effekt von JiTT auf Verständnis</tspan></text>
	</g>
</g>
	<g id="gnuplot_plot_1" ><title>2017 (%)</title>
<g fill="none" color="black" stroke="currentColor" stroke-width="1.00" stroke-linecap="butt" stroke-linejoin="miter">
	<g transform="translate(1558.7,227.8)" stroke="none" fill="black" font-family="Arial" font-size="36.00"  text-anchor="end">
		<text><tspan font-family="Arial" >2017 (%)</tspan></text>
	</g>
</g>
<g fill="none" color="black" stroke="currentColor" stroke-width="1.00" stroke-linecap="butt" stroke-linejoin="miter">
	<g stroke='none' shape-rendering='crispEdges'>
		<polygon fill = 'rgb(148,   0, 211)' fill-opacity = '0.500000' points = '1583.9,229.6 1711.7,229.6 1711.7,202.6 1583.9,202.6 '/>
	</g>
	<path stroke='rgb(148,   0, 211)'  d='M1583.9,229.6 L1711.7,229.6 L1711.7,202.6 L1583.9,202.6 L1583.9,229.6 Z  '/></g>
<g fill="none" color="black" stroke="currentColor" stroke-width="1.00" stroke-linecap="butt" stroke-linejoin="miter">
	<g stroke='none' shape-rendering='crispEdges'>
		<polygon fill = 'rgb(148,   0, 211)' fill-opacity = '0.500000' points = '380.3,1062.8 444.6,1062.8 444.6,173.1 380.3,173.1 '/>
	</g>
	<path stroke='rgb(148,   0, 211)'  d='M380.3,1062.8 L380.3,173.2 L444.5,173.2 L444.5,1062.8 L380.3,1062.8 Z  '/>	<g stroke='none' shape-rendering='crispEdges'>
		<polygon fill = 'rgb(148,   0, 211)' fill-opacity = '0.500000' points = '637.4,1062.8 701.7,1062.8 701.7,590.1 637.4,590.1 '/>
	</g>
	<path stroke='rgb(148,   0, 211)'  d='M637.4,1062.8 L637.4,590.2 L701.6,590.2 L701.6,1062.8 L637.4,1062.8 Z  '/>	<g stroke='none' shape-rendering='crispEdges'>
		<polygon fill = 'rgb(148,   0, 211)' fill-opacity = '0.500000' points = '894.4,1062.8 958.8,1062.8 958.8,951.6 894.4,951.6 '/>
	</g>
	<path stroke='rgb(148,   0, 211)'  d='M894.4,1062.8 L894.4,951.7 L958.7,951.7 L958.7,1062.8 L894.4,1062.8 Z  '/>	<g stroke='none' shape-rendering='crispEdges'>
		<polygon fill = 'rgb(148,   0, 211)' fill-opacity = '0.500000' points = '1408.6,1062.8 1473.0,1062.8 1473.0,1034.9 1408.6,1034.9 '/>
	</g>
	<path stroke='rgb(148,   0, 211)'  d='M1408.6,1062.8 L1408.6,1035.0 L1472.9,1035.0 L1472.9,1062.8 L1408.6,1062.8 Z  '/></g>
	</g>
	<g id="gnuplot_plot_2" ><title>2018 (%)</title>
<g fill="none" color="black" stroke="currentColor" stroke-width="1.00" stroke-linecap="butt" stroke-linejoin="miter">
	<g transform="translate(1558.7,281.8)" stroke="none" fill="black" font-family="Arial" font-size="36.00"  text-anchor="end">
		<text><tspan font-family="Arial" >2018 (%)</tspan></text>
	</g>
</g>
<g fill="none" color="black" stroke="currentColor" stroke-width="1.00" stroke-linecap="butt" stroke-linejoin="miter">
	<g stroke='none' shape-rendering='crispEdges'>
		<polygon fill = 'rgb(  0, 158, 115)' fill-opacity = '0.500000' points = '1583.9,283.6 1711.7,283.6 1711.7,256.6 1583.9,256.6 '/>
	</g>
	<path stroke='rgb(  0, 158, 115)'  d='M1583.9,283.6 L1711.7,283.6 L1711.7,256.6 L1583.9,256.6 L1583.9,283.6 Z  '/></g>
<g fill="none" color="black" stroke="currentColor" stroke-width="1.00" stroke-linecap="butt" stroke-linejoin="miter">
	<g stroke='none' shape-rendering='crispEdges'>
		<polygon fill = 'rgb(  0, 158, 115)' fill-opacity = '0.500000' points = '444.5,1062.8 508.9,1062.8 508.9,369.9 444.5,369.9 '/>
	</g>
	<path stroke='rgb(  0, 158, 115)'  d='M444.5,1062.8 L444.5,370.0 L508.8,370.0 L508.8,1062.8 L444.5,1062.8 Z  '/>	<g stroke='none' shape-rendering='crispEdges'>
		<polygon fill = 'rgb(  0, 158, 115)' fill-opacity = '0.500000' points = '701.6,1062.8 766.0,1062.8 766.0,514.2 701.6,514.2 '/>
	</g>
	<path stroke='rgb(  0, 158, 115)'  d='M701.6,1062.8 L701.6,514.3 L765.9,514.3 L765.9,1062.8 L701.6,1062.8 Z  '/>	<g stroke='none' shape-rendering='crispEdges'>
		<polygon fill = 'rgb(  0, 158, 115)' fill-opacity = '0.500000' points = '958.7,1062.8 1023.1,1062.8 1023.1,947.3 958.7,947.3 '/>
	</g>
	<path stroke='rgb(  0, 158, 115)'  d='M958.7,1062.8 L958.7,947.4 L1023.0,947.4 L1023.0,1062.8 L958.7,1062.8 Z  '/>	<g stroke='none' shape-rendering='crispEdges'>
		<polygon fill = 'rgb(  0, 158, 115)' fill-opacity = '0.500000' points = '1215.8,1062.8 1280.2,1062.8 1280.2,918.3 1215.8,918.3 '/>
	</g>
	<path stroke='rgb(  0, 158, 115)'  d='M1215.8,1062.8 L1215.8,918.4 L1280.1,918.4 L1280.1,1062.8 L1215.8,1062.8 Z  '/></g>
	</g>
	<g id="gnuplot_plot_3" ><title>2019 (%)</title>
<g fill="none" color="black" stroke="currentColor" stroke-width="1.00" stroke-linecap="butt" stroke-linejoin="miter">
	<g transform="translate(1558.7,335.8)" stroke="none" fill="black" font-family="Arial" font-size="36.00"  text-anchor="end">
		<text><tspan font-family="Arial" >2019 (%)</tspan></text>
	</g>
</g>
<g fill="none" color="black" stroke="currentColor" stroke-width="1.00" stroke-linecap="butt" stroke-linejoin="miter">
	<g stroke='none' shape-rendering='crispEdges'>
		<polygon fill = 'rgb( 86, 180, 233)' fill-opacity = '0.500000' points = '1583.9,337.6 1711.7,337.6 1711.7,310.6 1583.9,310.6 '/>
	</g>
	<path stroke='rgb( 86, 180, 233)'  d='M1583.9,337.6 L1711.7,337.6 L1711.7,310.6 L1583.9,310.6 L1583.9,337.6 Z  '/></g>
<g fill="none" color="black" stroke="currentColor" stroke-width="1.00" stroke-linecap="butt" stroke-linejoin="miter">
	<g stroke='none' shape-rendering='crispEdges'>
		<polygon fill = 'rgb( 86, 180, 233)' fill-opacity = '0.500000' points = '508.8,1062.8 573.2,1062.8 573.2,506.7 508.8,506.7 '/>
	</g>
	<path stroke='rgb( 86, 180, 233)'  d='M508.8,1062.8 L508.8,506.8 L573.1,506.8 L573.1,1062.8 L508.8,1062.8 Z  '/>	<g stroke='none' shape-rendering='crispEdges'>
		<polygon fill = 'rgb( 86, 180, 233)' fill-opacity = '0.500000' points = '765.9,1062.8 830.3,1062.8 830.3,451.1 765.9,451.1 '/>
	</g>
	<path stroke='rgb( 86, 180, 233)'  d='M765.9,1062.8 L765.9,451.2 L830.2,451.2 L830.2,1062.8 L765.9,1062.8 Z  '/>	<g stroke='none' shape-rendering='crispEdges'>
		<polygon fill = 'rgb( 86, 180, 233)' fill-opacity = '0.500000' points = '1023.0,1062.8 1087.4,1062.8 1087.4,840.4 1023.0,840.4 '/>
	</g>
	<path stroke='rgb( 86, 180, 233)'  d='M1023.0,1062.8 L1023.0,840.5 L1087.3,840.5 L1087.3,1062.8 L1023.0,1062.8 Z  '/>	<g stroke='none' shape-rendering='crispEdges'>
		<polygon fill = 'rgb( 86, 180, 233)' fill-opacity = '0.500000' points = '1280.1,1062.8 1344.4,1062.8 1344.4,951.5 1280.1,951.5 '/>
	</g>
	<path stroke='rgb( 86, 180, 233)'  d='M1280.1,1062.8 L1280.1,951.6 L1344.3,951.6 L1344.3,1062.8 L1280.1,1062.8 Z  '/></g>
	</g>
<g fill="none" color="white" stroke="rgb( 86, 180, 233)" stroke-width="2.00" stroke-linecap="butt" stroke-linejoin="miter">
</g>
<g fill="none" color="black" stroke="currentColor" stroke-width="2.00" stroke-linecap="butt" stroke-linejoin="miter">
</g>
<g fill="none" color="black" stroke="black" stroke-width="1.00" stroke-linecap="butt" stroke-linejoin="miter">
</g>
<g fill="none" color="black" stroke="currentColor" stroke-width="1.00" stroke-linecap="butt" stroke-linejoin="miter">
	<path stroke='black'  d='M219.6,162.1 L219.6,1062.8 L1762.1,1062.8 L1762.1,162.1 L219.6,162.1 Z  '/></g>
<g fill="none" color="black" stroke="currentColor" stroke-width="1.00" stroke-linecap="butt" stroke-linejoin="miter">
</g>
</g>
</svg>
