<?xml version="1.0" encoding="UTF-8" standalone="no"?>
<!-- Created with Inkscape (http://www.inkscape.org/) -->

<svg
   xmlns:dc="http://purl.org/dc/elements/1.1/"
   xmlns:cc="http://creativecommons.org/ns#"
   xmlns:rdf="http://www.w3.org/1999/02/22-rdf-syntax-ns#"
   xmlns:svg="http://www.w3.org/2000/svg"
   xmlns="http://www.w3.org/2000/svg"
   xmlns:xlink="http://www.w3.org/1999/xlink"
   version="1.1"
   width="235"
   height="539"
   viewBox="0 0 234.82458 538.59907"
   id="svg2">
  <metadata
     id="metadata155">
    <rdf:RDF>
      <cc:Work
         rdf:about="">
        <dc:format>image/svg+xml</dc:format>
        <dc:type
           rdf:resource="http://purl.org/dc/dcmitype/StillImage" />
        <dc:title></dc:title>
      </cc:Work>
    </rdf:RDF>
  </metadata>
  <defs
     id="defs4">
    <marker
       refX="0"
       refY="0"
       orient="auto"
       id="Arrow1Send"
       style="overflow:visible">
      <path
         d="M 0,0 5,-5 -12.5,0 5,5 0,0 z"
         transform="matrix(-0.2,0,0,-0.2,-1.2,0)"
         id="path4185"
         style="fill-rule:evenodd;stroke:#000000;stroke-width:1pt" />
    </marker>
    <marker
       refX="0"
       refY="0"
       orient="auto"
       id="Arrow1Lend"
       style="overflow:visible">
      <path
         d="M 0,0 5,-5 -12.5,0 5,5 0,0 z"
         transform="matrix(-0.8,0,0,-0.8,-10,0)"
         id="path4173"
         style="fill-rule:evenodd;stroke:#000000;stroke-width:1pt" />
    </marker>
    <marker
       refX="0"
       refY="0"
       orient="auto"
       id="Arrow2Lend"
       style="overflow:visible">
      <path
         d="M 8.7185878,4.0337352 -2.2072895,0.01601326 8.7185884,-4.0017078 c -1.7454984,2.3720609 -1.7354408,5.6174519 -6e-7,8.035443 z"
         transform="matrix(-1.1,0,0,-1.1,-1.1,0)"
         id="path4191"
         style="fill-rule:evenodd;stroke-width:0.625;stroke-linejoin:round" />
    </marker>
    <linearGradient
       x1="23.132746"
       y1="5.4588513"
       x2="22.559851"
       y2="34.50066"
       id="q"
       gradientUnits="userSpaceOnUse"
       gradientTransform="matrix(5.6004445,0,0,4.4639315,-5.378923,-9.972)">
      <stop
         id="stop7"
         style="stop-color:#fafafa;stop-opacity:1"
         offset="0" />
      <stop
         id="stop9"
         style="stop-color:#a8a8a8;stop-opacity:1"
         offset="0.5" />
      <stop
         id="stop11"
         style="stop-color:#cdcdcd;stop-opacity:1"
         offset="1" />
    </linearGradient>
    <linearGradient
       x1="12.33426"
       y1="9.3392601"
       x2="21.452785"
       y2="26.243361"
       id="o"
       gradientUnits="userSpaceOnUse"
       gradientTransform="matrix(3.6470257,0,0,6.854901,-5.378913,-9.972)">
      <stop
         id="stop14"
         style="stop-color:#ffffff;stop-opacity:0.70099998"
         offset="0" />
      <stop
         id="stop16"
         style="stop-color:#ffffff;stop-opacity:0"
         offset="1" />
    </linearGradient>
    <linearGradient
       x1="19.122713"
       y1="28.288237"
       x2="19.441633"
       y2="52.512054"
       id="m"
       gradientUnits="userSpaceOnUse"
       gradientTransform="scale(1.4215226,0.70347104)">
      <stop
         id="stop19"
         style="stop-color:#ffffff;stop-opacity:1"
         offset="0" />
      <stop
         id="stop21"
         style="stop-color:#ffffff;stop-opacity:0"
         offset="1" />
    </linearGradient>
    <linearGradient
       x1="16.439808"
       y1="32.144943"
       x2="23.933199"
       y2="47.557709"
       id="n"
       gradientUnits="userSpaceOnUse"
       gradientTransform="matrix(8.006709,0,0,3.1223816,-5.378913,-9.972)">
      <stop
         id="stop24"
         style="stop-color:#ffffff;stop-opacity:0.134"
         offset="0" />
      <stop
         id="stop26"
         style="stop-color:#ffffff;stop-opacity:0.052"
         offset="1" />
    </linearGradient>
    <linearGradient
       x1="19.305639"
       y1="43.363392"
       x2="17.136339"
       y2="17.143608"
       id="l"
       gradientUnits="userSpaceOnUse"
       gradientTransform="scale(1.1525115,0.86767028)">
      <stop
         id="stop29"
         style="stop-color:#000000;stop-opacity:1"
         offset="0" />
      <stop
         id="stop31"
         style="stop-color:#000000;stop-opacity:0"
         offset="1" />
    </linearGradient>
    <linearGradient
       id="a">
      <stop
         id="stop34"
         style="stop-color:#000000;stop-opacity:1"
         offset="0" />
      <stop
         id="stop36"
         style="stop-color:#000000;stop-opacity:0"
         offset="1" />
    </linearGradient>
    <linearGradient
       x1="-628.64136"
       y1="-252.1866"
       x2="-628.64136"
       y2="548.31934"
       id="p"
       gradientUnits="userSpaceOnUse"
       gradientTransform="scale(1.67344,0.59757147)">
      <stop
         id="stop39"
         style="stop-color:#000000;stop-opacity:0"
         offset="0" />
      <stop
         id="stop41"
         style="stop-color:#000000;stop-opacity:1"
         offset="0.5" />
      <stop
         id="stop43"
         style="stop-color:#000000;stop-opacity:0"
         offset="1" />
    </linearGradient>
    <radialGradient
       cx="26.107"
       cy="38.195"
       r="32.259998"
       id="r"
       gradientUnits="userSpaceOnUse"
       gradientTransform="matrix(1.0156,0,0.1031,1.0005,1.0393,-0.083695)">
      <stop
         id="stop46"
         style="stop-color:#a0a0a0;stop-opacity:1"
         offset="0" />
      <stop
         id="stop48"
         style="stop-color:#a8a8a8;stop-opacity:1"
         offset="1" />
    </radialGradient>
    <radialGradient
       cx="605.71002"
       cy="486.64999"
       r="117.14"
       id="s"
       xlink:href="#a"
       gradientUnits="userSpaceOnUse"
       gradientTransform="matrix(2.7744,0,0,1.9697,-1843.6,-872.88)" />
    <radialGradient
       cx="8.8243999"
       cy="3.7560999"
       r="37.751999"
       id="u"
       gradientUnits="userSpaceOnUse"
       gradientTransform="matrix(4.84135,0,0,5.2335,216.44108,-95.007008)">
      <stop
         id="stop52"
         style="stop-color:#a3a3a3;stop-opacity:1"
         offset="0" />
      <stop
         id="stop54"
         style="stop-color:#4c4c4c;stop-opacity:1"
         offset="1" />
    </radialGradient>
    <radialGradient
       cx="605.71002"
       cy="486.64999"
       r="117.14"
       id="t"
       xlink:href="#a"
       gradientUnits="userSpaceOnUse"
       gradientTransform="matrix(-2.7744,0,0,1.9697,160.76,-872.88)" />
    <radialGradient
       cx="26.107"
       cy="38.195"
       r="32.259998"
       id="r-3"
       gradientUnits="userSpaceOnUse"
       gradientTransform="matrix(1.0156,0,0.1031,1.0005,1.0393,-0.083695)">
      <stop
         id="stop46-6"
         style="stop-color:#a0a0a0;stop-opacity:1"
         offset="0" />
      <stop
         id="stop48-7"
         style="stop-color:#a8a8a8;stop-opacity:1"
         offset="1" />
    </radialGradient>
    <linearGradient
       x1="-628.64136"
       y1="-252.1866"
       x2="-628.64136"
       y2="548.31934"
       id="p-5"
       gradientUnits="userSpaceOnUse"
       gradientTransform="scale(1.67344,0.59757147)">
      <stop
         id="stop39-3"
         style="stop-color:#000000;stop-opacity:0"
         offset="0" />
      <stop
         id="stop41-5"
         style="stop-color:#000000;stop-opacity:1"
         offset="0.5" />
      <stop
         id="stop43-6"
         style="stop-color:#000000;stop-opacity:0"
         offset="1" />
    </linearGradient>
    <radialGradient
       cx="605.71002"
       cy="486.64999"
       r="117.14"
       id="s-2"
       xlink:href="#a-9"
       gradientUnits="userSpaceOnUse"
       gradientTransform="matrix(2.7744,0,0,1.9697,-1843.6,-872.88)" />
    <linearGradient
       id="a-9">
      <stop
         id="stop34-1"
         style="stop-color:#000000;stop-opacity:1"
         offset="0" />
      <stop
         id="stop36-2"
         style="stop-color:#000000;stop-opacity:0"
         offset="1" />
    </linearGradient>
    <radialGradient
       cx="605.71002"
       cy="486.64999"
       r="117.14"
       id="t-7"
       xlink:href="#a-9"
       gradientUnits="userSpaceOnUse"
       gradientTransform="matrix(-2.7744,0,0,1.9697,160.76,-872.88)" />
    <linearGradient
       id="linearGradient3154">
      <stop
         id="stop3156"
         style="stop-color:#000000;stop-opacity:1"
         offset="0" />
      <stop
         id="stop3158"
         style="stop-color:#000000;stop-opacity:0"
         offset="1" />
    </linearGradient>
    <linearGradient
       x1="12.33426"
       y1="9.3392601"
       x2="21.452785"
       y2="26.243361"
       id="o-0"
       gradientUnits="userSpaceOnUse"
       gradientTransform="matrix(3.6470257,0,0,6.854901,1.2420424,322.73912)">
      <stop
         id="stop14-9"
         style="stop-color:#ffffff;stop-opacity:0.70099998"
         offset="0" />
      <stop
         id="stop16-3"
         style="stop-color:#ffffff;stop-opacity:0"
         offset="1" />
    </linearGradient>
    <linearGradient
       x1="19.305639"
       y1="43.363392"
       x2="17.136339"
       y2="17.143608"
       id="l-6"
       gradientUnits="userSpaceOnUse"
       gradientTransform="scale(1.1525115,0.86767028)">
      <stop
         id="stop29-0"
         style="stop-color:#000000;stop-opacity:1"
         offset="0" />
      <stop
         id="stop31-6"
         style="stop-color:#000000;stop-opacity:0"
         offset="1" />
    </linearGradient>
    <linearGradient
       x1="23.132746"
       y1="5.4588513"
       x2="22.559851"
       y2="34.50066"
       id="q-2"
       gradientUnits="userSpaceOnUse"
       gradientTransform="matrix(5.6004445,0,0,4.4639315,1.2420424,322.73912)">
      <stop
         id="stop7-6"
         style="stop-color:#fafafa;stop-opacity:1"
         offset="0" />
      <stop
         id="stop9-1"
         style="stop-color:#a8a8a8;stop-opacity:1"
         offset="0.5" />
      <stop
         id="stop11-8"
         style="stop-color:#cdcdcd;stop-opacity:1"
         offset="1" />
    </linearGradient>
    <radialGradient
       cx="8.8243999"
       cy="3.7560999"
       r="37.751999"
       id="u-7"
       gradientUnits="userSpaceOnUse"
       gradientTransform="matrix(4.84135,0,0,5.2335,223.06204,237.70413)">
      <stop
         id="stop52-9"
         style="stop-color:#a3a3a3;stop-opacity:1"
         offset="0" />
      <stop
         id="stop54-2"
         style="stop-color:#4c4c4c;stop-opacity:1"
         offset="1" />
    </radialGradient>
    <linearGradient
       x1="16.439808"
       y1="32.144943"
       x2="23.933199"
       y2="47.557709"
       id="n-0"
       gradientUnits="userSpaceOnUse"
       gradientTransform="matrix(8.006709,0,0,3.1223816,1.2420424,322.73912)">
      <stop
         id="stop24-2"
         style="stop-color:#ffffff;stop-opacity:0.134"
         offset="0" />
      <stop
         id="stop26-3"
         style="stop-color:#ffffff;stop-opacity:0.052"
         offset="1" />
    </linearGradient>
    <linearGradient
       x1="19.122713"
       y1="28.288237"
       x2="19.441633"
       y2="52.512054"
       id="m-7"
       gradientUnits="userSpaceOnUse"
       gradientTransform="scale(1.4215226,0.70347104)">
      <stop
         id="stop19-5"
         style="stop-color:#ffffff;stop-opacity:1"
         offset="0" />
      <stop
         id="stop21-9"
         style="stop-color:#ffffff;stop-opacity:0"
         offset="1" />
    </linearGradient>
    <linearGradient
       x1="19.122713"
       y1="28.288237"
       x2="19.441633"
       y2="52.512054"
       id="linearGradient5907"
       xlink:href="#m-7"
       gradientUnits="userSpaceOnUse"
       gradientTransform="matrix(7.107613,0,0,3.5173552,1.2420424,322.73912)" />
  </defs>
  <g
     transform="matrix(5,0,0,5,-5.378913,-9.972)"
     id="g57"
     style="stroke-linecap:round">
    <g
       id="g59"
       style="stroke-linejoin:round">
      <path
         d="m 4.62,38.651 c 0.04181,0.42045 0.49738,0.8409 0.91115,0.8409 h 31.136 c 0.41377,0 0.78573,-0.42045 0.74392,-0.8409 l -2.6966,-27.119 c -0.04181,-0.42046 -0.49738,-0.84091 -0.91115,-0.84091 h -12.723 c -0.59054,0 -1.2091,-0.37955 -1.4029,-0.96034 l -1.103,-3.3059 c -0.16925,-0.50728 -0.54715,-0.7358 -1.3145,-0.7358 h -14.937 c -0.41377,0 -0.78573,0.42046 -0.74392,0.84091 l 3.0415,32.121 z"
         id="path61"
         style="fill:url(#r);stroke:#5a5a5a" />
      <g
         id="g63"
         style="fill:#729fcf;stroke:#000000">
        <path
           d="m 3.3386,17.534 h 31.15"
           id="path65"
           style="opacity:0.11400003" />
        <path
           d="m 5.3301,37.534 h 29.988"
           id="path67"
           style="opacity:0.11400003" />
        <path
           d="m 5.3301,35.534 h 29.988"
           id="path69"
           style="opacity:0.11400003" />
      </g>
    </g>
    <g
       transform="matrix(0.021652,0,0,0.019038,42.415,36.934)"
       id="g71">
      <rect
         width="1339.6"
         height="478.35999"
         x="-1559.3"
         y="-150.7"
         id="rect73"
         style="opacity:0.40200004;fill:url(#p)" />
      <path
         d="m -219.62,-150.68 v 478.33 c 142.87,0.90045 345.4,-107.17 345.4,-239.2 0,-132.03 -159.44,-239.14 -345.4,-239.14 z"
         id="path75"
         style="opacity:0.40200004;fill:url(#s)" />
      <path
         d="m -1559.3,-150.68 v 478.33 c -142.87,0.90045 -345.4,-107.17 -345.4,-239.2 0,-132.03 159.44,-239.14 345.4,-239.14 z"
         id="path77"
         style="opacity:0.40200004;fill:url(#t)" />
    </g>
  </g>
  <path
     d="m 25.480087,182.12299 c 0.1568,1.55165 -0.7731,2.5861 -2.377,2.06885 -1.6039,-0.5172 -2.74285,-1.5516 -2.89965,-3.10325 L 5.055437,24.2536 c -0.1568,-1.5516 0.78295,-2.4886 2.3346,-2.4886 l 73.74999,-0.4575 c 2.6564,-0.015 3.69715,0.2665 4.399,2.5861 0,0 5.427,15.564 6.231,18.4905 l -7.778,-14.585 c -1.3259,-2.48635 -2.99375,-2.06885 -4.86395,-2.06885 h -65.64499 c -1.55165,0 -2.48155,1.0344 -2.32475,2.58605 l 14.894,154.32499 -0.5695,-0.5175 z"
     id="path79"
     style="fill:url(#o);stroke-width:1.17299998" />
  <g
     transform="matrix(5,0,0,5,-5.378913,-9.972)"
     id="g81"
     style="stroke:#000000;display:block">
    <g
       id="g83"
       style="fill:#729fcf;stroke-linecap:round;stroke-linejoin:round">
      <path
         d="m 2.3052,7.5335 h 14.784"
         id="path85"
         style="opacity:0.11400003" />
      <path
         d="m 2.7573,11.534 h 30.739"
         id="path87"
         style="opacity:0.11400003" />
    </g>
    <g
       transform="matrix(1.0344,0,0.10452,1.0344,-10.032,2.6319)"
       id="g89"
       style="fill:#ffffff;fill-opacity:0.57999998">
      <path
         d="M 41.786,9.0364 C 41.7956,8.56181 41.80119,8.31189 41.36261,8.31219 l -12.556,0.0087 c -0.3,0 -0.32461,-0.14321 0,0 0.32461,0.14321 1.2471,0.65827 2.1827,0.701 0,0 10.796,0.016459 10.796,0.01455 z"
         id="path91" />
    </g>
    <g
       id="g93"
       style="fill:#729fcf;stroke-linecap:round;stroke-linejoin:round">
      <path
         d="m 3.1629,15.534 h 30.83"
         id="path95"
         style="opacity:0.11400003" />
      <path
         d="m 5.1595,33.534 h 29.988"
         id="path97"
         style="opacity:0.11400003" />
      <path
         d="m 4.8658,31.534 h 30.109"
         id="path99"
         style="opacity:0.11400003" />
      <path
         d="m 4.6336,29.534 h 30.169"
         id="path101"
         style="opacity:0.11400003" />
      <path
         d="M 4.463,27.534 H 34.632"
         id="path103"
         style="opacity:0.11400003" />
      <path
         d="m 4.2557,25.534 h 30.205"
         id="path105"
         style="opacity:0.11400003" />
      <path
         d="m 4.0235,23.534 h 30.266"
         id="path107"
         style="opacity:0.11400003" />
      <path
         d="m 3.8528,21.534 h 30.266"
         id="path109"
         style="opacity:0.11400003" />
    </g>
    <g
       transform="matrix(1.0344,0,0.10452,1.0344,-10.032,2.6319)"
       id="g111"
       style="fill:#ffffff;fill-opacity:0.57999998">
      <path
         d="M 41.786,9.0364 C 41.7956,8.56181 41.80119,8.31189 41.36261,8.31219 l -12.556,0.0087 c -0.3,0 -0.32461,-0.14321 0,0 0.32461,0.14321 1.2471,0.65827 2.1827,0.701 0,0 10.796,0.016459 10.796,0.01455 z"
         id="path113" />
    </g>
  </g>
  <g
     transform="matrix(5,0,0,5,-5.378913,-9.972)"
     id="g115"
     style="stroke-linejoin:round">
    <g
       id="g117"
       style="fill:#729fcf;stroke:#000000;stroke-linecap:round">
      <path
         d="m 2.9642,13.534 h 31.026"
         id="path119"
         style="opacity:0.11400003" />
      <path
         d="m 3.6514,19.534 h 30.296"
         id="path121"
         style="opacity:0.11400003" />
      <path
         d="m 2.5243,9.5335 h 15.281"
         id="path123"
         style="opacity:0.11400003" />
    </g>
    <path
       d="M 34.375,14.125 37,38.75 6,38.875 4.125,14.125 h 30.25 z"
       id="path125"
       style="opacity:0.39200003;fill:url(#l)" />
  </g>
  <path
     d="m 211.49609,2.5 c 2.5,84.394996 -45.3755,92.639996 -30.063,144.99999 l -157.435003,4.4297 C 14.623087,87.664696 65.873077,45.8597 50.873077,3.2747 L 211.49809,2.5002 z"
     id="path127"
     style="fill:url(#q);stroke:url(#u);stroke-width:5" />
  <path
     d="M 71.811077,22.8405 H 189.62109"
     id="path129"
     style="fill:none;stroke:#a1a1a1;stroke-width:5" />
  <path
     d="m 18.895087,185.35799 c 0.5172,1.05735 1.5516,2.11465 3.10325,2.11465 H 188.53834 c 1.03445,0 2.6058,-0.63155 3.54085,-1.32175 2.65205,-1.9577 3.27435,-3.06195 4.4639,-4.86735 12.2405,-18.5775 29.026,-96.384994 29.026,-96.384994 0.5172,-1.0573 -0.5172,-2.1146 -2.06885,-2.1146 H 48.880237 c -1.55165,0 -8.28,80.534994 -24.315,96.434994 l -6.191,6.1385 h 0.51725 z"
     id="path131"
     style="fill:#c8ce27;stroke:#a3a334;stroke-width:5;stroke-linejoin:round" />
  <path
     d="M 71.401077,32.8405 H 170.02609"
     id="path133"
     style="fill:none;stroke:#a1a1a1;stroke-width:5" />
  <path
     d="m 60.291077,90.722996 c -3.86375,24.953994 -7.5065,45.045994 -13.57999,67.569994 11.93249,-3.5355 35.58049,-16.0225 85.579993,-16.0225 50.00001,0 83.62001,-46.243494 88.26001,-51.769994 l -160.260013,0.221 z"
     id="path135"
     style="fill:url(#n);fill-rule:evenodd" />
  <g
     transform="matrix(5,0,0,5,-5.378913,-9.972)"
     id="g137"
     style="fill:none">
    <path
       d="M 15.143,10.562 H 39.458"
       id="path139"
       style="stroke:#a1a1a1" />
    <path
       d="M 45.82,19.688 H 12.662 c 0,0 -2.1478,16.02 -4.7223,18.241 8.1211,0 31.571,-0.04864 31.591,-0.04864 1.7517,0 4.9076,-12.636 6.2898,-18.192 z"
       id="path141"
       style="opacity:0.52300002;stroke:url(#m);stroke-linecap:round" />
    <g
       id="g143"
       style="stroke:#a1a1a1">
      <path
         d="M 14.399,12.562 H 38.252"
         id="path145" />
      <path
         d="M 13.629,14.562 H 36.975"
         id="path147" />
      <path
         d="M 12.521,16.562 H 31.167"
         id="path149" />
    </g>
  </g>
  <path
     d="M 26.496087,148.77799 C 20.289087,87.587996 62.433577,53.467996 54.621077,5.028 H 208.99609 L 58.996077,8.153 c 6.25,47.812496 -30.98199,73.229996 -32.49999,140.62499 z"
     id="path151"
     style="fill:#ffffff" />
  <g
     transform="matrix(5,0,0,5,1.2420424,322.73912)"
     id="g57-2"
     style="stroke-linecap:round">
    <g
       id="g59-2"
       style="stroke-linejoin:round">
      <path
         d="m 4.62,38.651 c 0.04181,0.42045 0.49738,0.8409 0.91115,0.8409 h 31.136 c 0.41377,0 0.78573,-0.42045 0.74392,-0.8409 l -2.6966,-27.119 c -0.04181,-0.42046 -0.49738,-0.84091 -0.91115,-0.84091 h -12.723 c -0.59054,0 -1.2091,-0.37955 -1.4029,-0.96034 l -1.103,-3.3059 c -0.16925,-0.50728 -0.54715,-0.7358 -1.3145,-0.7358 h -14.937 c -0.41377,0 -0.78573,0.42046 -0.74392,0.84091 l 3.0415,32.121 z"
         id="path61-8"
         style="fill:url(#r-3);stroke:#5a5a5a" />
      <g
         id="g63-9"
         style="fill:#729fcf;stroke:#000000">
        <path
           d="m 3.3386,17.534 h 31.15"
           id="path65-7"
           style="opacity:0.11400003" />
        <path
           d="m 5.3301,37.534 h 29.988"
           id="path67-3"
           style="opacity:0.11400003" />
        <path
           d="m 5.3301,35.534 h 29.988"
           id="path69-6"
           style="opacity:0.11400003" />
      </g>
    </g>
    <g
       transform="matrix(0.021652,0,0,0.019038,42.415,36.934)"
       id="g71-1">
      <rect
         width="1339.6"
         height="478.35999"
         x="-1559.3"
         y="-150.7"
         id="rect73-2"
         style="opacity:0.40200004;fill:url(#p-5)" />
      <path
         d="m -219.62,-150.68 v 478.33 c 142.87,0.90045 345.4,-107.17 345.4,-239.2 0,-132.03 -159.44,-239.14 -345.4,-239.14 z"
         id="path75-9"
         style="opacity:0.40200004;fill:url(#s-2)" />
      <path
         d="m -1559.3,-150.68 v 478.33 c -142.87,0.90045 -345.4,-107.17 -345.4,-239.2 0,-132.03 159.44,-239.14 345.4,-239.14 z"
         id="path77-3"
         style="opacity:0.40200004;fill:url(#t-7)" />
    </g>
  </g>
  <path
     d="m 32.101043,514.83411 c 0.1568,1.55165 -0.7731,2.5861 -2.377,2.06885 -1.6039,-0.5172 -2.74285,-1.5516 -2.89965,-3.10325 l -15.148,-156.83499 c -0.1568,-1.5516 0.78295,-2.4886 2.3346,-2.4886 l 73.75,-0.4575 c 2.6564,-0.015 3.69715,0.2665 4.399,2.5861 0,0 5.427,15.564 6.231,18.4905 l -7.778,-14.585 c -1.3259,-2.48635 -2.99375,-2.06885 -4.86395,-2.06885 h -65.645 c -1.55165,0 -2.48155,1.0344 -2.32475,2.58605 l 14.894,154.32499 -0.5695,-0.5175 z"
     id="path79-1"
     style="fill:url(#o-0);stroke-width:1.17299998" />
  <g
     transform="matrix(5,0,0,5,1.2420424,322.73912)"
     id="g81-9"
     style="stroke:#000000;display:block">
    <g
       id="g83-4"
       style="fill:#729fcf;stroke-linecap:round;stroke-linejoin:round">
      <path
         d="m 2.3052,7.5335 h 14.784"
         id="path85-7"
         style="opacity:0.11400003" />
      <path
         d="m 2.7573,11.534 h 30.739"
         id="path87-8"
         style="opacity:0.11400003" />
    </g>
    <g
       transform="matrix(1.0344,0,0.10452,1.0344,-10.032,2.6319)"
       id="g89-4"
       style="fill:#ffffff;fill-opacity:0.57999998">
      <path
         d="M 41.786,9.0364 C 41.7956,8.56181 41.80119,8.31189 41.36261,8.31219 l -12.556,0.0087 c -0.3,0 -0.32461,-0.14321 0,0 0.32461,0.14321 1.2471,0.65827 2.1827,0.701 0,0 10.796,0.016459 10.796,0.01455 z"
         id="path91-5" />
    </g>
    <g
       id="g93-0"
       style="fill:#729fcf;stroke-linecap:round;stroke-linejoin:round">
      <path
         d="m 3.1629,15.534 h 30.83"
         id="path95-3"
         style="opacity:0.11400003" />
      <path
         d="m 5.1595,33.534 h 29.988"
         id="path97-6"
         style="opacity:0.11400003" />
      <path
         d="m 4.8658,31.534 h 30.109"
         id="path99-1"
         style="opacity:0.11400003" />
      <path
         d="m 4.6336,29.534 h 30.169"
         id="path101-0"
         style="opacity:0.11400003" />
      <path
         d="M 4.463,27.534 H 34.632"
         id="path103-6"
         style="opacity:0.11400003" />
      <path
         d="m 4.2557,25.534 h 30.205"
         id="path105-3"
         style="opacity:0.11400003" />
      <path
         d="m 4.0235,23.534 h 30.266"
         id="path107-2"
         style="opacity:0.11400003" />
      <path
         d="m 3.8528,21.534 h 30.266"
         id="path109-0"
         style="opacity:0.11400003" />
    </g>
    <g
       transform="matrix(1.0344,0,0.10452,1.0344,-10.032,2.6319)"
       id="g111-6"
       style="fill:#ffffff;fill-opacity:0.57999998">
      <path
         d="M 41.786,9.0364 C 41.7956,8.56181 41.80119,8.31189 41.36261,8.31219 l -12.556,0.0087 c -0.3,0 -0.32461,-0.14321 0,0 0.32461,0.14321 1.2471,0.65827 2.1827,0.701 0,0 10.796,0.016459 10.796,0.01455 z"
         id="path113-1" />
    </g>
  </g>
  <g
     transform="matrix(5,0,0,5,1.2420424,322.73912)"
     id="g115-5"
     style="stroke-linejoin:round">
    <g
       id="g117-5"
       style="fill:#729fcf;stroke:#000000;stroke-linecap:round">
      <path
         d="m 2.9642,13.534 h 31.026"
         id="path119-4"
         style="opacity:0.11400003" />
      <path
         d="m 3.6514,19.534 h 30.296"
         id="path121-7"
         style="opacity:0.11400003" />
      <path
         d="m 2.5243,9.5335 h 15.281"
         id="path123-6"
         style="opacity:0.11400003" />
    </g>
    <path
       d="M 34.375,14.125 37,38.75 6,38.875 4.125,14.125 h 30.25 z"
       id="path125-5"
       style="opacity:0.39200003;fill:url(#l-6)" />
  </g>
  <path
     d="m 218.11704,335.21112 c 2.5,84.395 -45.3755,92.64 -30.063,144.99999 l -157.434997,4.4297 c -9.375,-64.26499 41.875,-106.06999 26.875,-148.65499 l 160.624997,-0.7745 z"
     id="path127-6"
     style="fill:url(#q-2);stroke:url(#u-7);stroke-width:5" />
  <path
     d="M 78.432043,355.55162 H 196.24204"
     id="path129-9"
     style="fill:none;stroke:#a1a1a1;stroke-width:5" />
  <path
     d="m 25.516043,518.06911 c 0.5172,1.05735 1.5516,2.11465 3.10325,2.11465 H 195.15929 c 1.03445,0 2.6058,-0.63155 3.54085,-1.32175 2.65205,-1.9577 3.27435,-3.06195 4.4639,-4.86735 12.2405,-18.5775 29.026,-96.38499 29.026,-96.38499 0.5172,-1.0573 -0.5172,-2.1146 -2.06885,-2.1146 H 55.501193 c -1.55165,0 -8.28,80.53499 -24.315,96.43499 l -6.191,6.1385 h 0.51725 z"
     id="path131-3"
     style="fill:#c8ce27;stroke:#a3a334;stroke-width:5;stroke-linejoin:round" />
  <path
     d="M 78.022043,365.55162 H 143.3019"
     id="path133-7"
     style="fill:none;stroke:#fb0000;stroke-width:4.06786108;stroke-opacity:1" />
  <path
     d="m 66.912043,423.43412 c -3.86375,24.95399 -7.5065,45.04599 -13.58,67.56999 11.9325,-3.5355 35.5805,-16.0225 85.579997,-16.0225 50,0 83.62,-46.2435 88.26,-51.76999 l -160.259997,0.221 z"
     id="path135-4"
     style="fill:url(#n-0);fill-rule:evenodd" />
  <path
     d="M 76.957043,375.54912 H 169.0249"
     id="path139-2"
     style="fill:none;stroke:#a1a1ff;stroke-width:4.3511281;stroke-opacity:1" />
  <path
     d="M 230.34205,421.17912 H 64.552043 c 0,0 -10.739,80.1 -23.6115,91.205 40.6055,0 157.855007,-0.2432 157.955007,-0.2432 8.7585,0 24.538,-63.18 31.449,-90.96 z"
     id="path141-5"
     style="opacity:0.52300002;fill:none;stroke:url(#linearGradient5907);stroke-width:5;stroke-linecap:round" />
  <path
     d="M 73.237043,385.54912 H 202.86554"
     id="path145-7"
     style="fill:none;stroke:#a1a1ff;stroke-width:5.21271229;stroke-opacity:1" />
  <path
     d="M 69.387043,395.54912 H 145.47765"
     id="path147-4"
     style="fill:none;stroke:#ff0000;stroke-width:4.03686523;stroke-opacity:1" />
  <path
     d="M 63.847043,405.54912 H 157.07705"
     id="path149-4"
     style="fill:none;stroke:#a1a1a1;stroke-width:5" />
  <path
     d="m 33.117043,481.48911 c -6.207,-61.18999 35.9375,-95.30999 28.125,-143.74999 H 215.61704 l -149.999997,3.125 c 6.25,47.8125 -30.982,73.23 -32.5,140.62499 z"
     id="path151-3"
     style="fill:#ffffff" />
  <path
     d="m 126.52573,210.17747 0,87.45762"
     id="path3396"
     style="fill:none;stroke:#000000;stroke-width:10;stroke-linecap:butt;stroke-linejoin:miter;stroke-miterlimit:4;stroke-opacity:1;stroke-dasharray:none;marker-end:url(#Arrow1Send)" />
</svg>
