PCBNEW-LibModule-V1  
# encoding utf-8
Units mm
$INDEX
AMPHENOL_10018784-10210TLF
$EndINDEX
$MODULE AMPHENOL_10018784-10210TLF
Po 0 0 0 15 00000000 00000000 ~~
Li AMPHENOL_10018784-10210TLF
Cd PCI EXPRESS CARD CONNECTOR ,64 PINS.
Sc 00000000
At STD
Op 0 0 0
.SolderMask 0
.SolderPaste 0
T0 -11.96 -5.075 1 1 0 0.05 N V 21 "AMPHENOL_10018784-10210TLF"
T1 -11.325 6.265 1 1 0 0.05 N V 21 "VAL**"
DS -14.5 -3.7 10.5 -3.7 0.127 27
DS 10.5 -3.7 10.5 5.1 0.127 27
DS 10.5 5.1 -14.5 5.1 0.127 27
DS -14.5 5.1 -14.5 -3.7 0.127 27
DS -14.5 5.1 -14.5 -3.7 0.127 21
DS 10.5 -3.7 10.5 5.1 0.127 21
DS 10.5 5.1 -14.5 5.1 0.127 21
DS -14.5 -3.7 -11.75 -3.7 0.127 21
DS 10.5 -3.7 8.45 -3.7 0.127 21
T2 -16.850000 -0.650000 1 1 0 .05 N V 51 "A1"
T2 -16.850000 1.750000 1 1 0 .05 N V 51 "B1"
DS -14.75 -4.11 10.75 -4.11 0.05 26
DS 10.75 -4.11 10.75 5.35 0.05 26
DS 10.75 5.35 -14.75 5.35 0.05 26
DS -14.75 5.35 -14.75 -4.11 0.05 26
T2 -16.850000 -0.650000 1 1 0 .05 N V 21 "A1"
T2 -16.850000 1.750000 1 1 0 .05 N V 21 "B1"
$PAD
Sh "Hole" C 2.35 2.35 0 0 0
Dr 2.35 0 0
At HOLE N 00E0FFFF
Po 0 0
$EndPAD
$PAD
Sh "Hole" C 2.35 2.35 0 0 0
Dr 2.35 0 0
At HOLE N 00E0FFFF
Po 9.15 0
$EndPAD
$PAD
Sh "A1" R 1.208 1.208 0 0 0
Dr 0.7 0 0
At STD N 00C0FFFF
.SolderMask 0
Ne 0 ""
Po -11.65 -1.25
$EndPAD
$PAD
Sh "A2" C 1.208 1.208 0 0 0
Dr 0.7 0 0
At STD N 00C0FFFF
.SolderMask 0
Ne 0 ""
Po -10.65 -3.25
$EndPAD
$PAD
Sh "A3" C 1.208 1.208 0 0 0
Dr 0.7 0 0
At STD N 00C0FFFF
.SolderMask 0
Ne 0 ""
Po -9.65 -1.25
$EndPAD
$PAD
Sh "A4" C 1.208 1.208 0 0 0
Dr 0.7 0 0
At STD N 00C0FFFF
.SolderMask 0
Ne 0 ""
Po -8.65 -3.25
$EndPAD
$PAD
Sh "A5" C 1.208 1.208 0 0 0
Dr 0.7 0 0
At STD N 00C0FFFF
.SolderMask 0
Ne 0 ""
Po -7.65 -1.25
$EndPAD
$PAD
Sh "A6" C 1.208 1.208 0 0 0
Dr 0.7 0 0
At STD N 00C0FFFF
.SolderMask 0
Ne 0 ""
Po -6.65 -3.25
$EndPAD
$PAD
Sh "A7" C 1.208 1.208 0 0 0
Dr 0.7 0 0
At STD N 00C0FFFF
.SolderMask 0
Ne 0 ""
Po -5.65 -1.25
$EndPAD
$PAD
Sh "A8" C 1.208 1.208 0 0 0
Dr 0.7 0 0
At STD N 00C0FFFF
.SolderMask 0
Ne 0 ""
Po -4.65 -3.25
$EndPAD
$PAD
Sh "A9" C 1.208 1.208 0 0 0
Dr 0.7 0 0
At STD N 00C0FFFF
.SolderMask 0
Ne 0 ""
Po -3.65 -1.25
$EndPAD
$PAD
Sh "A10" C 1.208 1.208 0 0 0
Dr 0.7 0 0
At STD N 00C0FFFF
.SolderMask 0
Ne 0 ""
Po -2.65 -3.25
$EndPAD
$PAD
Sh "A12" C 1.208 1.208 0 0 0
Dr 0.7 0 0
At STD N 00C0FFFF
.SolderMask 0
Ne 0 ""
Po 1.35 -3.25
$EndPAD
$PAD
Sh "A13" C 1.208 1.208 0 0 0
Dr 0.7 0 0
At STD N 00C0FFFF
.SolderMask 0
Ne 0 ""
Po 2.35 -1.25
$EndPAD
$PAD
Sh "A14" C 1.208 1.208 0 0 0
Dr 0.7 0 0
At STD N 00C0FFFF
.SolderMask 0
Ne 0 ""
Po 3.35 -3.25
$EndPAD
$PAD
Sh "A15" C 1.208 1.208 0 0 0
Dr 0.7 0 0
At STD N 00C0FFFF
.SolderMask 0
Ne 0 ""
Po 4.35 -1.25
$EndPAD
$PAD
Sh "A16" C 1.208 1.208 0 0 0
Dr 0.7 0 0
At STD N 00C0FFFF
.SolderMask 0
Ne 0 ""
Po 5.35 -3.25
$EndPAD
$PAD
Sh "A17" C 1.208 1.208 0 0 0
Dr 0.7 0 0
At STD N 00C0FFFF
.SolderMask 0
Ne 0 ""
Po 6.35 -1.25
$EndPAD
$PAD
Sh "A18" C 1.208 1.208 0 0 0
Dr 0.7 0 0
At STD N 00C0FFFF
.SolderMask 0
Ne 0 ""
Po 7.35 -3.25
$EndPAD
$PAD
Sh "B1" R 1.208 1.208 0 0 0
Dr 0.7 0 0
At STD N 00C0FFFF
.SolderMask 0
Ne 0 ""
Po -11.65 1.25
$EndPAD
$PAD
Sh "B2" C 1.208 1.208 0 0 0
Dr 0.7 0 0
At STD N 00C0FFFF
.SolderMask 0
Ne 0 ""
Po -10.65 3.25
$EndPAD
$PAD
Sh "B3" C 1.208 1.208 0 0 0
Dr 0.7 0 0
At STD N 00C0FFFF
.SolderMask 0
Ne 0 ""
Po -9.65 1.25
$EndPAD
$PAD
Sh "B4" C 1.208 1.208 0 0 0
Dr 0.7 0 0
At STD N 00C0FFFF
.SolderMask 0
Ne 0 ""
Po -8.65 3.25
$EndPAD
$PAD
Sh "B5" C 1.208 1.208 0 0 0
Dr 0.7 0 0
At STD N 00C0FFFF
.SolderMask 0
Ne 0 ""
Po -7.65 1.25
$EndPAD
$PAD
Sh "B6" C 1.208 1.208 0 0 0
Dr 0.7 0 0
At STD N 00C0FFFF
.SolderMask 0
Ne 0 ""
Po -6.65 3.25
$EndPAD
$PAD
Sh "B7" C 1.208 1.208 0 0 0
Dr 0.7 0 0
At STD N 00C0FFFF
.SolderMask 0
Ne 0 ""
Po -5.65 1.25
$EndPAD
$PAD
Sh "B8" C 1.208 1.208 0 0 0
Dr 0.7 0 0
At STD N 00C0FFFF
.SolderMask 0
Ne 0 ""
Po -4.65 3.25
$EndPAD
$PAD
Sh "B9" C 1.208 1.208 0 0 0
Dr 0.7 0 0
At STD N 00C0FFFF
.SolderMask 0
Ne 0 ""
Po -3.65 1.25
$EndPAD
$PAD
Sh "B10" C 1.208 1.208 0 0 0
Dr 0.7 0 0
At STD N 00C0FFFF
.SolderMask 0
Ne 0 ""
Po -2.65 3.25
$EndPAD
$PAD
Sh "B12" C 1.208 1.208 0 0 0
Dr 0.7 0 0
At STD N 00C0FFFF
.SolderMask 0
Ne 0 ""
Po 1.35 3.25
$EndPAD
$PAD
Sh "B13" C 1.208 1.208 0 0 0
Dr 0.7 0 0
At STD N 00C0FFFF
.SolderMask 0
Ne 0 ""
Po 2.35 1.25
$EndPAD
$PAD
Sh "B14" C 1.208 1.208 0 0 0
Dr 0.7 0 0
At STD N 00C0FFFF
.SolderMask 0
Ne 0 ""
Po 3.35 3.25
$EndPAD
$PAD
Sh "B15" C 1.208 1.208 0 0 0
Dr 0.7 0 0
At STD N 00C0FFFF
.SolderMask 0
Ne 0 ""
Po 4.35 1.25
$EndPAD
$PAD
Sh "B16" C 1.208 1.208 0 0 0
Dr 0.7 0 0
At STD N 00C0FFFF
.SolderMask 0
Ne 0 ""
Po 5.35 3.25
$EndPAD
$PAD
Sh "B17" C 1.208 1.208 0 0 0
Dr 0.7 0 0
At STD N 00C0FFFF
.SolderMask 0
Ne 0 ""
Po 6.35 1.25
$EndPAD
$PAD
Sh "B18" C 1.208 1.208 0 0 0
Dr 0.7 0 0
At STD N 00C0FFFF
.SolderMask 0
Ne 0 ""
Po 7.35 3.25
$EndPAD
$PAD
Sh "A11" C 1.208 1.208 0 0 0
Dr 0.7 0 0
At STD N 00C0FFFF
.SolderMask 0
Ne 0 ""
Po -1.65 -1.25
$EndPAD
$PAD
Sh "B11" C 1.208 1.208 0 0 0
Dr 0.7 0 0
At STD N 00C0FFFF
.SolderMask 0
Ne 0 ""
Po -1.65 1.25
$EndPAD
$EndMODULE AMPHENOL_10018784-10210TLF
