(module custom_inductor (layer F.Cu) (tedit 5E299D0D)
  (descr "Inductor, Radial series, Radial, pin pitch=9.00mm, , diameter=12.5mm, Fastron, 09HCP, http://cdn-reichelt.de/documents/datenblatt/B400/DS_09HCP.pdf")
  (tags "Inductor Radial series Radial pin pitch 9.00mm  diameter 12.5mm Fastron 09HCP")
  (fp_text reference REF** (at 4.5 -7.5) (layer F.SilkS)
    (effects (font (size 1 1) (thickness 0.15)))
  )
  (fp_text value custom_inductor (at 4.5 7.5) (layer F.Fab)
    (effects (font (size 1 1) (thickness 0.15)))
  )
  (fp_circle (center -4.11 0) (end 8.89 0) (layer F.Fab) (width 0.1))
  (fp_circle (center -4.11 0) (end 8.89 0) (layer F.SilkS) (width 0.12))
  (fp_circle (center -4.11 0) (end 8.89 0) (layer F.CrtYd) (width 0.05))
  (fp_text user %R (at 4.5 0) (layer F.Fab)
    (effects (font (size 1 1) (thickness 0.15)))
  )
  (pad 1 thru_hole circle (at 8.89 0) (size 4 4) (drill 2) (layers *.Cu *.Mask)
    (die_length 1))
  (pad 2 thru_hole circle (at 0 0) (size 4 4) (drill 2) (layers *.Cu *.Mask))
  (model ${KISYS3DMOD}/Inductor_THT.3dshapes/L_Radial_D12.5mm_P9.00mm_Fastron_09HCP.wrl
    (at (xyz 0 0 0))
    (scale (xyz 1 1 1))
    (rotate (xyz 0 0 0))
  )
  (model ${KISYS3DMOD}/Inductor_THT.3dshapes/L_Radial_D24.4mm_P23.90mm_muRATA_1400series.wrl
    (offset (xyz -16 0 0))
    (scale (xyz 1 1 1))
    (rotate (xyz 0 0 0))
  )
)
