EESchema Schematic File Version 4
EELAYER 30 0
EELAYER END
$Descr A4 11693 8268
encoding utf-8
Sheet 2 3
Title ""
Date ""
Rev ""
Comp ""
Comment1 ""
Comment2 ""
Comment3 ""
Comment4 ""
$EndDescr
Wire Wire Line
	7150 650  4850 650 
$Comp
L Device:CP_Small C204
U 1 1 5E53BA7C
P 3350 2700
F 0 "C204" V 3400 2850 50  0000 C CNN
F 1 "470u" V 3400 2550 50  0000 C CNN
F 2 "Capacitor_THT:CP_Radial_D12.5mm_P5.00mm" H 3350 2700 50  0001 C CNN
F 3 "~" H 3350 2700 50  0001 C CNN
	1    3350 2700
	-1   0    0    -1  
$EndComp
Connection ~ 3550 2400
$Comp
L Device:L L201
U 1 1 5FBE0DDE
P 5850 2400
F 0 "L201" V 5600 2400 50  0000 C CNN
F 1 "47uH 12A" V 5700 2400 50  0000 C CNN
F 2 "michal_custom_edge:custom_inductor" H 5850 2400 50  0001 C CNN
F 3 "~" H 5850 2400 50  0001 C CNN
	1    5850 2400
	0    1    1    0   
$EndComp
Wire Wire Line
	3900 2400 3900 2550
Connection ~ 3900 2400
$Comp
L Transistor_FET:Si7141DP Q205
U 1 1 5FFCF737
P 7650 2500
F 0 "Q205" V 8050 2500 50  0000 C CNN
F 1 "SI7155DP-T1" V 7950 2500 50  0000 C CNN
F 2 "Package_SO:PowerPAK_SO-8_Single" H 7850 2425 50  0001 L CIN
F 3 "http://www.jaolen.com/images/pdf/QM6015D.pdf" V 7650 2500 50  0001 L CNN
	1    7650 2500
	0    -1   -1   0   
$EndComp
Connection ~ 6250 2400
$Comp
L Device:Fuse F201
U 1 1 5DF6DB20
P 9050 2400
F 0 "F201" V 8850 2400 50  0000 C CNN
F 1 "8A F" V 8950 2400 50  0000 C CNN
F 2 "fuses:Fuseholder5x20_horiz_open_universal_Type-III" V 8980 2400 50  0001 C CNN
F 3 "~" H 9050 2400 50  0001 C CNN
	1    9050 2400
	0    -1   1    0   
$EndComp
Connection ~ 6050 2400
Wire Wire Line
	6050 2400 6250 2400
Connection ~ 7950 2800
Wire Wire Line
	7950 2800 7950 2850
Wire Wire Line
	8700 2800 8700 2700
$Comp
L Transistor_FET:Si7141DP Q207
U 1 1 5DF6DB29
P 8700 2500
F 0 "Q207" V 9100 2500 50  0000 C CNN
F 1 "SI7155DP-T1" V 9000 2500 50  0000 C CNN
F 2 "Package_SO:PowerPAK_SO-8_Single" H 8900 2425 50  0001 L CIN
F 3 "http://www.jaolen.com/images/pdf/QM6015D.pdf" V 8700 2500 50  0001 L CNN
	1    8700 2500
	0    1    -1   0   
$EndComp
$Comp
L michal_lib:XL4016 U205
U 1 1 5DF6DAD1
P 5050 2500
F 0 "U205" H 5000 2867 50  0000 C CNN
F 1 "XL4016" H 5000 2776 50  0000 C CNN
F 2 "Package_TO_SOT_THT:TO-220-5_Horizontal_TabUp" H 5050 2250 50  0001 L CIN
F 3 "http://www.ti.com/lit/ds/symlink/lm2576.pdf" H 5050 2500 50  0001 C CNN
	1    5050 2500
	1    0    0    -1  
$EndComp
Wire Wire Line
	4550 2600 4550 2850
Wire Wire Line
	3550 2400 3900 2400
$Comp
L Device:CP_Small C206
U 1 1 5DF6DAD4
P 3550 2700
F 0 "C206" V 3600 2850 50  0000 C CNN
F 1 "470u" V 3600 2550 50  0000 C CNN
F 2 "Capacitor_THT:CP_Radial_D12.5mm_P5.00mm" H 3550 2700 50  0001 C CNN
F 3 "~" H 3550 2700 50  0001 C CNN
	1    3550 2700
	-1   0    0    -1  
$EndComp
Wire Wire Line
	3350 2800 3350 3200
Wire Wire Line
	3550 2800 3550 3200
Wire Wire Line
	3550 2600 3550 2400
Wire Wire Line
	3350 2600 3350 2400
Connection ~ 3350 2400
Wire Wire Line
	3350 2400 3550 2400
Wire Wire Line
	6250 2400 6250 2700
Wire Wire Line
	6050 2700 6050 2400
$Comp
L Device:CP_Small C211
U 1 1 5DF6DAE4
P 6250 2800
F 0 "C211" V 6300 2950 50  0000 C CNN
F 1 "1000uF" V 6300 2600 50  0000 C CNN
F 2 "Capacitor_THT:CP_Radial_D12.5mm_P5.00mm" H 6250 2800 50  0001 C CNN
F 3 "~" H 6250 2800 50  0001 C CNN
	1    6250 2800
	-1   0    0    -1  
$EndComp
$Comp
L Device:CP_Small C210
U 1 1 5E06F402
P 6050 2800
F 0 "C210" V 6100 2950 50  0000 C CNN
F 1 "1000uF" V 6100 2600 50  0000 C CNN
F 2 "Capacitor_THT:CP_Radial_D12.5mm_P5.00mm" H 6050 2800 50  0001 C CNN
F 3 "~" H 6050 2800 50  0001 C CNN
	1    6050 2800
	-1   0    0    -1  
$EndComp
$Comp
L Device:D_Schottky_AKA D203
U 1 1 5DF6DAE2
P 5650 2750
F 0 "D203" H 5550 2850 50  0000 L CNN
F 1 "MBR20100CT" H 5450 2650 50  0000 L CNN
F 2 "Package_TO_SOT_THT:TO-220-3_Horizontal_TabUp" H 5650 2750 50  0001 C CNN
F 3 "~" H 5650 2750 50  0001 C CNN
	1    5650 2750
	0    1    1    0   
$EndComp
Wire Wire Line
	5750 3200 5650 3200
Connection ~ 5750 3200
Wire Wire Line
	5750 2950 5750 3200
Wire Wire Line
	5650 3200 5050 3200
Connection ~ 5650 3200
Wire Wire Line
	5650 2950 5650 3200
Wire Wire Line
	6050 3200 5750 3200
Connection ~ 6050 3200
Wire Wire Line
	6050 2900 6050 3200
Wire Wire Line
	6250 3200 6050 3200
Wire Wire Line
	5050 2800 5050 3200
Connection ~ 5050 3200
Wire Wire Line
	6250 2900 6250 3200
Wire Wire Line
	6250 2400 6400 2400
Wire Wire Line
	6050 2400 6000 2400
Wire Wire Line
	5700 2400 5650 2400
Wire Wire Line
	5650 2600 5650 2400
Connection ~ 5650 2400
Wire Wire Line
	5650 2400 5450 2400
Wire Wire Line
	5450 2600 5500 2600
Wire Wire Line
	3550 3200 3350 3200
Connection ~ 3550 3200
Wire Wire Line
	3900 2850 4550 2850
Wire Wire Line
	3900 2400 4550 2400
$Comp
L Device:R R231
U 1 1 602227CD
P 7950 2600
F 0 "R231" V 7850 2600 50  0000 C CNN
F 1 "200k" V 7950 2600 50  0000 C CNN
F 2 "Resistor_SMD:R_1206_3216Metric_Pad1.42x1.75mm_HandSolder" V 7880 2600 50  0001 C CNN
F 3 "~" H 7950 2600 50  0001 C CNN
	1    7950 2600
	1    0    0    1   
$EndComp
$Comp
L Device:LED D205
U 1 1 604DF7F9
P 9100 3500
F 0 "D205" V 9150 3750 50  0000 R CNN
F 1 "LED" V 9050 3700 50  0000 R CNN
F 2 "Diode_SMD:D_1206_3216Metric_Pad1.42x1.75mm_HandSolder" H 9100 3500 50  0001 C CNN
F 3 "~" H 9100 3500 50  0001 C CNN
	1    9100 3500
	0    1    -1   0   
$EndComp
Text Notes 10400 3050 2    50   ~ 0
H=off, L=on
$Comp
L Device:R R234
U 1 1 604D78B0
P 9100 3800
F 0 "R234" V 9000 3800 50  0000 C CNN
F 1 "330" V 9100 3800 50  0000 C CNN
F 2 "Resistor_SMD:R_1206_3216Metric_Pad1.42x1.75mm_HandSolder" V 9030 3800 50  0001 C CNN
F 3 "~" H 9100 3800 50  0001 C CNN
	1    9100 3800
	-1   0    0    -1  
$EndComp
Wire Wire Line
	7650 2800 7650 2700
Wire Wire Line
	7950 2400 7950 2450
Connection ~ 7950 2400
Wire Wire Line
	7950 2400 7850 2400
Wire Wire Line
	7950 2750 7950 2800
Wire Wire Line
	7950 2800 7650 2800
$Comp
L power:-5V #PWR0214
U 1 1 5DF6DB13
P 7950 4000
F 0 "#PWR0214" H 7950 4100 50  0001 C CNN
F 1 "-5V" H 7965 4173 50  0000 C CNN
F 2 "" H 7950 4000 50  0001 C CNN
F 3 "" H 7950 4000 50  0001 C CNN
	1    7950 4000
	1    0    0    1   
$EndComp
Wire Wire Line
	7950 4000 7950 3900
Connection ~ 7950 3900
$Comp
L Device:R R233
U 1 1 5DF6DB15
P 8750 3600
F 0 "R233" V 8850 3600 50  0000 C CNN
F 1 "10k" V 8750 3600 50  0000 C CNN
F 2 "Resistor_SMD:R_1206_3216Metric_Pad1.42x1.75mm_HandSolder" V 8680 3600 50  0001 C CNN
F 3 "~" H 8750 3600 50  0001 C CNN
	1    8750 3600
	-1   0    0    1   
$EndComp
Wire Wire Line
	8750 3750 8750 3900
Wire Wire Line
	8750 3900 7950 3900
$Comp
L Device:R R232
U 1 1 5F73611B
P 8450 3350
F 0 "R232" V 8550 3350 50  0000 C CNN
F 1 "100" V 8450 3350 50  0000 C CNN
F 2 "Resistor_SMD:R_1206_3216Metric_Pad1.42x1.75mm_HandSolder" V 8380 3350 50  0001 C CNN
F 3 "~" H 8450 3350 50  0001 C CNN
	1    8450 3350
	0    -1   -1   0   
$EndComp
$Comp
L Transistor_FET:2N7002 Q206
U 1 1 5F9CB9D2
P 8050 3350
F 0 "Q206" H 8350 3600 50  0000 L CNN
F 1 "2N7002" H 8250 3500 50  0000 L CNN
F 2 "Package_TO_SOT_SMD:SOT-23" H 8250 3275 50  0001 L CIN
F 3 "https://www.fairchildsemi.com/datasheets/2N/2N7002.pdf" H 8050 3350 50  0001 L CNN
	1    8050 3350
	-1   0    0    -1  
$EndComp
Text GLabel 9850 2400 2    50   Output ~ 0
bat_plus
Wire Wire Line
	9850 2400 9200 2400
Wire Wire Line
	3550 3200 5050 3200
Connection ~ 6400 2400
Wire Wire Line
	6250 3300 6250 3500
$Comp
L Device:R_POT RV203
U 1 1 5DF6DAE5
P 6400 3300
F 0 "RV203" H 6350 3300 50  0000 R CNN
F 1 "10k" V 6400 3350 50  0000 R CNN
F 2 "Potentiometer_THT:Potentiometer_Bourns_3296W_Vertical" H 6400 3300 50  0001 C CNN
F 3 "~" H 6400 3300 50  0001 C CNN
	1    6400 3300
	-1   0    0    -1  
$EndComp
Wire Wire Line
	6400 3500 6400 3450
Wire Wire Line
	6250 3500 6400 3500
Wire Wire Line
	6400 3500 6400 3600
Connection ~ 6400 3500
Wire Wire Line
	6400 3600 6200 3600
$Comp
L Device:R R226
U 1 1 5E3D48DA
P 6200 3750
F 0 "R226" V 6300 3750 50  0000 C CNN
F 1 "360" V 6200 3750 50  0000 C CNN
F 2 "Resistor_SMD:R_1206_3216Metric_Pad1.42x1.75mm_HandSolder" V 6130 3750 50  0001 C CNN
F 3 "~" H 6200 3750 50  0001 C CNN
	1    6200 3750
	-1   0    0    1   
$EndComp
Wire Wire Line
	6400 2400 6400 3150
Wire Wire Line
	6400 2400 6750 2400
Wire Notes Line
	3000 700  5000 700 
Wire Wire Line
	4850 650  4850 750 
Connection ~ 7150 2400
Wire Wire Line
	7150 2400 7450 2400
Wire Wire Line
	4050 1600 4400 1600
$Comp
L Device:R R?
U 1 1 5DAEE4CF
P 3900 1600
AR Path="/5D7E2920/5DAEE4CF" Ref="R?"  Part="1" 
AR Path="/5DAD577F/5DAEE4CF" Ref="R?"  Part="1" 
AR Path="/5D7E29BE/5DAEE4CF" Ref="R218"  Part="1" 
AR Path="/5EC577BA/5EC9625C/5DAEE4CF" Ref="R?"  Part="1" 
F 0 "R218" V 3800 1600 50  0000 C CNN
F 1 "1k" V 3900 1600 50  0000 C CNN
F 2 "Resistor_SMD:R_1206_3216Metric_Pad1.42x1.75mm_HandSolder" V 3830 1600 50  0001 C CNN
F 3 "~" H 3900 1600 50  0001 C CNN
	1    3900 1600
	0    1    1    0   
$EndComp
Wire Notes Line
	3000 700  3000 1900
Wire Notes Line
	3000 1900 5000 1900
Connection ~ 4150 1750
Wire Wire Line
	3300 1750 4150 1750
Wire Wire Line
	4600 1750 4150 1750
Connection ~ 4600 1750
Text Notes 3050 1850 0    50   ~ 10
input voltage divider
$Comp
L Device:C_Small C?
U 1 1 5DAEE4BB
P 3300 1500
AR Path="/5D7E2920/5DAEE4BB" Ref="C?"  Part="1" 
AR Path="/5DAD577F/5DAEE4BB" Ref="C?"  Part="1" 
AR Path="/5D7E29BE/5DAEE4BB" Ref="C203"  Part="1" 
AR Path="/5EC577BA/5EC9625C/5DAEE4BB" Ref="C?"  Part="1" 
F 0 "C203" H 3450 1500 50  0000 L CNN
F 1 "100nF" H 3350 1400 50  0000 L CNN
F 2 "Capacitor_SMD:C_1206_3216Metric_Pad1.42x1.75mm_HandSolder" H 3338 1350 50  0001 C CNN
F 3 "~" H 3300 1500 50  0001 C CNN
	1    3300 1500
	-1   0    0    -1  
$EndComp
Wire Notes Line
	5000 700  5000 1900
Text Notes 4800 1000 2    50   ~ 0
0.18V/V\n\n
Wire Wire Line
	4600 1750 4850 1750
Wire Wire Line
	4850 1600 4850 1750
Wire Wire Line
	4600 1500 4600 1750
Wire Wire Line
	4600 1150 4600 1200
$Comp
L Device:D_Zener D?
U 1 1 5DAEE4AC
P 4600 1350
AR Path="/5D7E2920/5DAEE4AC" Ref="D?"  Part="1" 
AR Path="/5DAD577F/5DAEE4AC" Ref="D?"  Part="1" 
AR Path="/5D7E29BE/5DAEE4AC" Ref="D202"  Part="1" 
AR Path="/5EC577BA/5EC9625C/5DAEE4AC" Ref="D?"  Part="1" 
F 0 "D202" V 4550 1150 50  0000 L CNN
F 1 "3.3V" V 4700 1150 50  0000 L CNN
F 2 "Diode_SMD:D_MicroMELF" H 4600 1350 50  0001 C CNN
F 3 "~" H 4600 1350 50  0001 C CNN
	1    4600 1350
	0    1    1    0   
$EndComp
Wire Wire Line
	3300 1250 3400 1250
$Comp
L Device:R R?
U 1 1 5DAEE4A4
P 3550 1250
AR Path="/5D7E2920/5DAEE4A4" Ref="R?"  Part="1" 
AR Path="/5DAD577F/5DAEE4A4" Ref="R?"  Part="1" 
AR Path="/5D7E29BE/5DAEE4A4" Ref="R217"  Part="1" 
AR Path="/5EC577BA/5EC9625C/5DAEE4A4" Ref="R?"  Part="1" 
F 0 "R217" V 3650 1250 50  0000 C CNN
F 1 "100" V 3550 1250 50  0000 C CNN
F 2 "Resistor_SMD:R_0805_2012Metric_Pad1.15x1.40mm_HandSolder" V 3480 1250 50  0001 C CNN
F 3 "~" H 3550 1250 50  0001 C CNN
	1    3550 1250
	0    -1   -1   0   
$EndComp
Wire Wire Line
	3700 1250 3750 1250
$Comp
L Device:R R?
U 1 1 5DAEE49D
P 4850 1450
AR Path="/5D7E2920/5DAEE49D" Ref="R?"  Part="1" 
AR Path="/5DAD577F/5DAEE49D" Ref="R?"  Part="1" 
AR Path="/5D7E29BE/5DAEE49D" Ref="R223"  Part="1" 
AR Path="/5EC577BA/5EC9625C/5DAEE49D" Ref="R?"  Part="1" 
F 0 "R223" V 4750 1450 50  0000 C CNN
F 1 "27k" V 4850 1450 50  0000 C CNN
F 2 "Resistor_SMD:R_1206_3216Metric_Pad1.42x1.75mm_HandSolder" V 4780 1450 50  0001 C CNN
F 3 "~" H 4850 1450 50  0001 C CNN
	1    4850 1450
	-1   0    0    1   
$EndComp
$Comp
L Device:R R?
U 1 1 5DAEE497
P 4850 900
AR Path="/5D7E2920/5DAEE497" Ref="R?"  Part="1" 
AR Path="/5DAD577F/5DAEE497" Ref="R?"  Part="1" 
AR Path="/5D7E29BE/5DAEE497" Ref="R222"  Part="1" 
AR Path="/5EC577BA/5EC9625C/5DAEE497" Ref="R?"  Part="1" 
F 0 "R222" V 4750 900 50  0000 C CNN
F 1 "120k" V 4850 900 50  0000 C CNN
F 2 "Resistor_SMD:R_1206_3216Metric_Pad1.42x1.75mm_HandSolder" V 4780 900 50  0001 C CNN
F 3 "~" H 4850 900 50  0001 C CNN
	1    4850 900 
	-1   0    0    1   
$EndComp
Wire Wire Line
	3750 1250 3750 1600
Wire Wire Line
	3300 1600 3300 1750
Wire Wire Line
	3300 1250 3300 1400
Connection ~ 3300 1250
Wire Wire Line
	7150 650  7150 2400
$Comp
L Device:R R213
U 1 1 5E133EF0
P 2800 6450
F 0 "R213" V 2700 6400 50  0000 C CNN
F 1 "8.2k" V 2800 6450 50  0000 C CNN
F 2 "Resistor_SMD:R_1206_3216Metric_Pad1.42x1.75mm_HandSolder" V 2730 6450 50  0001 C CNN
F 3 "~" H 2800 6450 50  0001 C CNN
	1    2800 6450
	0    1    1    0   
$EndComp
Wire Wire Line
	2950 6450 3100 6450
$Comp
L Device:R R216
U 1 1 5E1342D8
P 3400 6450
F 0 "R216" V 3300 6400 50  0000 C CNN
F 1 "8.2k" V 3400 6450 50  0000 C CNN
F 2 "Resistor_SMD:R_1206_3216Metric_Pad1.42x1.75mm_HandSolder" V 3330 6450 50  0001 C CNN
F 3 "~" H 3400 6450 50  0001 C CNN
	1    3400 6450
	0    1    1    0   
$EndComp
$Comp
L Device:C_Small C?
U 1 1 5E175B6A
P 3100 6900
AR Path="/5D7E2920/5E175B6A" Ref="C?"  Part="1" 
AR Path="/5DAD577F/5E175B6A" Ref="C?"  Part="1" 
AR Path="/5D7E29BE/5E175B6A" Ref="C202"  Part="1" 
AR Path="/5EC577BA/5EC9625C/5E175B6A" Ref="C?"  Part="1" 
F 0 "C202" V 3050 6650 50  0000 L CNN
F 1 "100nF" V 3050 6950 50  0000 L CNN
F 2 "Capacitor_SMD:C_1206_3216Metric_Pad1.42x1.75mm_HandSolder" H 3138 6750 50  0001 C CNN
F 3 "~" H 3100 6900 50  0001 C CNN
	1    3100 6900
	-1   0    0    -1  
$EndComp
$Comp
L Device:C_Small C?
U 1 1 5E1765D2
P 3700 6900
AR Path="/5D7E2920/5E1765D2" Ref="C?"  Part="1" 
AR Path="/5DAD577F/5E1765D2" Ref="C?"  Part="1" 
AR Path="/5D7E29BE/5E1765D2" Ref="C207"  Part="1" 
AR Path="/5EC577BA/5EC9625C/5E1765D2" Ref="C?"  Part="1" 
F 0 "C207" V 3650 6650 50  0000 L CNN
F 1 "100nF" V 3650 6950 50  0000 L CNN
F 2 "Capacitor_SMD:C_1206_3216Metric_Pad1.42x1.75mm_HandSolder" H 3738 6750 50  0001 C CNN
F 3 "~" H 3700 6900 50  0001 C CNN
	1    3700 6900
	-1   0    0    -1  
$EndComp
Wire Wire Line
	3100 6450 3100 6800
Connection ~ 3100 6450
Wire Wire Line
	3100 6450 3250 6450
Wire Wire Line
	3550 6450 3700 6450
Wire Wire Line
	3700 6450 3700 6800
Wire Wire Line
	3700 7000 3700 7500
Wire Wire Line
	3100 7000 3100 7500
Connection ~ 3100 7500
Connection ~ 3700 6450
$Comp
L Device:R_POT RV202
U 1 1 5E1E1540
P 2300 6450
F 0 "RV202" V 2200 6550 50  0000 R CNN
F 1 "100k" V 2300 6550 50  0000 R CNN
F 2 "Potentiometer_THT:Potentiometer_Bourns_3296W_Vertical" H 2300 6450 50  0001 C CNN
F 3 "~" H 2300 6450 50  0001 C CNN
	1    2300 6450
	1    0    0    1   
$EndComp
Connection ~ 6750 2400
$Comp
L Device:R R228
U 1 1 5E386BF8
P 6750 4350
F 0 "R228" V 6650 4350 50  0000 C CNN
F 1 "3k .1%" V 6600 4350 50  0000 C CNN
F 2 "Resistor_SMD:R_1206_3216Metric_Pad1.42x1.75mm_HandSolder" V 6680 4350 50  0001 C CNN
F 3 "~" H 6750 4350 50  0001 C CNN
	1    6750 4350
	-1   0    0    1   
$EndComp
Wire Wire Line
	6550 5050 6300 5050
Wire Wire Line
	6000 5050 5850 5050
Wire Wire Line
	5850 5050 5850 4750
Wire Wire Line
	5850 4750 5900 4750
Connection ~ 5850 4750
Wire Wire Line
	7150 2400 7150 4200
Wire Wire Line
	7100 2400 7150 2400
Wire Wire Line
	6750 2400 6800 2400
$Comp
L Device:R R229
U 1 1 5DB8D355
P 6950 2400
F 0 "R229" V 6850 2400 50  0000 C CNN
F 1 "0R01" V 6950 2400 50  0000 C CNN
F 2 "Resistor_SMD:R_2010_5025Metric" V 6880 2400 50  0001 C CNN
F 3 "~" H 6950 2400 50  0001 C CNN
	1    6950 2400
	0    -1   -1   0   
$EndComp
Wire Wire Line
	6750 4650 6750 4500
Wire Wire Line
	7150 4500 7150 4850
Text Notes 4150 6450 0    50   ~ 0
CC_voltage\n
Text Notes 6600 5050 0    50   ~ 0
40V/V\n0-2V => 0-5A\n
$Comp
L Diode:1N4148WT D201
U 1 1 5E455D75
P 4400 4550
F 0 "D201" H 4400 4333 50  0000 C CNN
F 1 "1N4148WT" H 4400 4424 50  0000 C CNN
F 2 "Diode_SMD:D_SOD-123" H 4400 4375 50  0001 C CNN
F 3 "https://www.diodes.com/assets/Datasheets/ds30396.pdf" H 4400 4550 50  0001 C CNN
	1    4400 4550
	0    1    1    0   
$EndComp
Wire Wire Line
	4400 4850 4400 4700
$Comp
L Device:R R221
U 1 1 5E496E98
P 4600 4850
F 0 "R221" V 4700 4850 50  0000 C CNN
F 1 "100" V 4600 4850 50  0000 C CNN
F 2 "Resistor_SMD:R_1206_3216Metric_Pad1.42x1.75mm_HandSolder" V 4530 4850 50  0001 C CNN
F 3 "~" H 4600 4850 50  0001 C CNN
	1    4600 4850
	0    -1   -1   0   
$EndComp
Wire Wire Line
	4450 4850 4400 4850
Text Notes 5950 3650 0    50   ~ 0
max V trim\n\n
$Comp
L Device:R R210
U 1 1 5E57EBBA
P 2250 3200
F 0 "R210" V 2150 3250 50  0000 C CNN
F 1 "10k" V 2250 3200 50  0000 C CNN
F 2 "Resistor_SMD:R_1206_3216Metric_Pad1.42x1.75mm_HandSolder" V 2180 3200 50  0001 C CNN
F 3 "~" H 2250 3200 50  0001 C CNN
	1    2250 3200
	1    0    0    1   
$EndComp
Wire Wire Line
	2250 2900 2250 3050
Wire Wire Line
	2600 2900 2250 2900
Wire Wire Line
	2600 3200 2600 3250
$Comp
L Device:R R211
U 1 1 5E551AB6
P 2600 3050
F 0 "R211" V 2700 3100 50  0000 C CNN
F 1 "2.2k" V 2600 3050 50  0000 C CNN
F 2 "Resistor_SMD:R_1206_3216Metric_Pad1.42x1.75mm_HandSolder" V 2530 3050 50  0001 C CNN
F 3 "~" H 2600 3050 50  0001 C CNN
	1    2600 3050
	-1   0    0    1   
$EndComp
$Comp
L power:+5V #PWR0203
U 1 1 5E531D01
P 2250 2800
F 0 "#PWR0203" H 2250 2650 50  0001 C CNN
F 1 "+5V" H 2265 2973 50  0000 C CNN
F 2 "" H 2250 2800 50  0001 C CNN
F 3 "" H 2250 2800 50  0001 C CNN
	1    2250 2800
	1    0    0    -1  
$EndComp
Connection ~ 5500 3600
Wire Wire Line
	5500 2600 5500 3600
Wire Wire Line
	5500 3600 6200 3600
$Comp
L Transistor_BJT:BC849 Q201
U 1 1 5E636C3C
P 2150 3700
F 0 "Q201" H 2341 3746 50  0000 L CNN
F 1 "BC849" H 2341 3655 50  0000 L CNN
F 2 "Package_TO_SOT_SMD:SOT-23" H 2350 3625 50  0001 L CIN
F 3 "http://www.infineon.com/dgdl/Infineon-BC847SERIES_BC848SERIES_BC849SERIES_BC850SERIES-DS-v01_01-en.pdf?fileId=db3a304314dca389011541d4630a1657" H 2150 3700 50  0001 L CNN
	1    2150 3700
	1    0    0    -1  
$EndComp
Wire Wire Line
	4400 3600 5500 3600
Wire Wire Line
	2250 2800 2250 2900
Connection ~ 2250 2900
Wire Wire Line
	2250 4000 2250 3900
$Comp
L Device:R R203
U 1 1 5E68CD50
P 1800 3700
F 0 "R203" V 1700 3750 50  0000 C CNN
F 1 "10k" V 1800 3700 50  0000 C CNN
F 2 "Resistor_SMD:R_1206_3216Metric_Pad1.42x1.75mm_HandSolder" V 1730 3700 50  0001 C CNN
F 3 "~" H 1800 3700 50  0001 C CNN
	1    1800 3700
	0    -1   1    0   
$EndComp
Wire Wire Line
	4400 3600 4400 4400
Wire Wire Line
	2600 3650 2600 3850
Wire Wire Line
	2600 3850 2800 3850
Wire Wire Line
	2800 3850 2800 3600
Connection ~ 4400 3600
$Comp
L Device:C_Small C?
U 1 1 5E76A7B2
P 3400 5450
AR Path="/5D7E2920/5E76A7B2" Ref="C?"  Part="1" 
AR Path="/5DAD577F/5E76A7B2" Ref="C?"  Part="1" 
AR Path="/5D7E29BE/5E76A7B2" Ref="C205"  Part="1" 
AR Path="/5EC577BA/5EC9625C/5E76A7B2" Ref="C?"  Part="1" 
F 0 "C205" V 3350 5200 50  0000 L CNN
F 1 "100nF" V 3350 5500 50  0000 L CNN
F 2 "Capacitor_SMD:C_1206_3216Metric_Pad1.42x1.75mm_HandSolder" H 3438 5300 50  0001 C CNN
F 3 "~" H 3400 5450 50  0001 C CNN
	1    3400 5450
	-1   0    0    -1  
$EndComp
Wire Wire Line
	3300 5000 3400 5000
Wire Wire Line
	3400 5000 3400 5350
Connection ~ 3400 5000
Wire Wire Line
	5700 4750 5700 5350
Text Notes 5050 1050 0    50   ~ 0
17 =>3V\n
$Comp
L Device:R R230
U 1 1 5E84F660
P 7150 4350
F 0 "R230" V 7050 4350 50  0000 C CNN
F 1 "3k .1%" V 7000 4350 50  0000 C CNN
F 2 "Resistor_SMD:R_1206_3216Metric_Pad1.42x1.75mm_HandSolder" V 7080 4350 50  0001 C CNN
F 3 "~" H 7150 4350 50  0001 C CNN
	1    7150 4350
	-1   0    0    1   
$EndComp
Connection ~ 6200 3600
Wire Wire Line
	6750 4000 6750 4200
Wire Wire Line
	6750 2400 6750 4000
Connection ~ 6750 4000
$Comp
L Device:R R227
U 1 1 5E424580
P 6500 4000
F 0 "R227" V 6400 4000 50  0000 C CNN
F 1 "120k .1%" V 6600 4000 50  0000 C CNN
F 2 "Resistor_SMD:R_1206_3216Metric_Pad1.42x1.75mm_HandSolder" V 6430 4000 50  0001 C CNN
F 3 "~" H 6500 4000 50  0001 C CNN
	1    6500 4000
	0    -1   -1   0   
$EndComp
Wire Wire Line
	6650 4000 6750 4000
Wire Wire Line
	6200 3900 6200 4000
Wire Wire Line
	6350 4000 6200 4000
Connection ~ 6200 4000
Wire Wire Line
	6200 4000 6200 4050
$Comp
L Device:R R225
U 1 1 5E8B6EDC
P 6150 5050
F 0 "R225" V 6250 5100 50  0000 C CNN
F 1 "120k .1%" V 6050 5050 50  0000 C CNN
F 2 "Resistor_SMD:R_1206_3216Metric_Pad1.42x1.75mm_HandSolder" V 6080 5050 50  0001 C CNN
F 3 "~" H 6150 5050 50  0001 C CNN
	1    6150 5050
	0    -1   -1   0   
$EndComp
Wire Wire Line
	3900 2750 3900 2850
$Comp
L Device:C_Small C208
U 1 1 5DF6DB19
P 3900 2650
F 0 "C208" V 3950 2800 50  0000 C CNN
F 1 "100n" V 3950 2500 50  0000 C CNN
F 2 "Capacitor_SMD:C_1206_3216Metric" H 3900 2650 50  0001 C CNN
F 3 "~" H 3900 2650 50  0001 C CNN
	1    3900 2650
	-1   0    0    1   
$EndComp
Text Notes 3750 4950 2    50   ~ 0
CV_voltage\n
Text Notes 3100 3600 2    50   ~ 0
on_off\n
$Comp
L Transistor_FET:BSS83P Q204
U 1 1 5E52FC93
P 2500 3450
F 0 "Q204" H 2706 3404 50  0000 L CNN
F 1 "BSS83P" H 2706 3495 50  0000 L CNN
F 2 "Package_TO_SOT_SMD:SOT-23" H 2700 3375 50  0001 L CIN
F 3 "http://www.farnell.com/datasheets/1835997.pdf" H 2500 3450 50  0001 L CNN
	1    2500 3450
	1    0    0    1   
$EndComp
Wire Wire Line
	2250 3350 2250 3450
Wire Wire Line
	2300 3450 2250 3450
Connection ~ 2250 3450
Wire Wire Line
	2250 3450 2250 3500
Wire Wire Line
	5450 4950 5500 4950
Wire Wire Line
	2800 3600 3250 3600
Wire Wire Line
	4050 5000 4050 4150
Wire Wire Line
	4050 4150 4000 4150
Wire Wire Line
	3350 4050 3400 4050
Wire Wire Line
	4050 3950 4000 3950
Wire Wire Line
	3350 4050 3250 4050
Wire Wire Line
	3250 4050 3250 3950
Connection ~ 3350 4050
Connection ~ 3250 3600
Wire Wire Line
	3250 3600 4400 3600
$Comp
L Device:R R215
U 1 1 5DCC2A51
P 3250 3800
F 0 "R215" V 3350 3800 50  0000 C CNN
F 1 "220" V 3250 3800 50  0000 C CNN
F 2 "Resistor_SMD:R_1206_3216Metric_Pad1.42x1.75mm_HandSolder" V 3180 3800 50  0001 C CNN
F 3 "~" H 3250 3800 50  0001 C CNN
	1    3250 3800
	-1   0    0    1   
$EndComp
Wire Wire Line
	3250 3650 3250 3600
$Comp
L Amplifier_Operational:LMV324 U203
U 2 1 5DC44089
P 6200 4750
F 0 "U203" H 6150 4500 50  0000 C CNN
F 1 "LMV324IDT" H 6150 4400 50  0000 C CNN
F 2 "Package_SO:SOIC-14_3.9x8.7mm_P1.27mm" H 6200 4750 50  0001 C CNN
F 3 "~" H 6200 4750 50  0001 C CNN
	2    6200 4750
	-1   0    0    1   
$EndComp
$Comp
L Diode:2BZX84Cxx D204
U 1 1 5DF6DB0E
P 8300 2600
F 0 "D204" H 8250 2950 50  0000 L CNN
F 1 "10V" H 8300 2850 50  0000 L CNN
F 2 "Package_TO_SOT_SMD:SOT-23" H 8300 2600 50  0001 C CNN
F 3 "~" H 8300 2600 50  0001 C CNN
	1    8300 2600
	-1   0    0    -1  
$EndComp
Wire Wire Line
	8400 2400 8500 2400
Connection ~ 8300 2800
Wire Wire Line
	8300 2800 8700 2800
Wire Wire Line
	8400 2400 8200 2400
Connection ~ 8400 2400
Connection ~ 8200 2400
Wire Wire Line
	7950 2400 8200 2400
Wire Wire Line
	7950 2800 8300 2800
$Comp
L Amplifier_Operational:MCP601-xP U?
U 1 1 5DC6214A
P 4050 1250
AR Path="/5D7E2920/5DC6214A" Ref="U?"  Part="1" 
AR Path="/5DAD577F/5DC6214A" Ref="U?"  Part="1" 
AR Path="/5D7E29BE/5DC6214A" Ref="U204"  Part="1" 
F 0 "U204" H 4250 1450 50  0000 C CNN
F 1 "MCP601-xP" H 4250 1550 50  0000 C CNN
F 2 "Package_SO:SO-8_3.9x4.9mm_P1.27mm" H 3950 1050 50  0001 L CNN
F 3 "http://ww1.microchip.com/downloads/en/DeviceDoc/21314g.pdf" H 4200 1400 50  0001 C CNN
	1    4050 1250
	-1   0    0    -1  
$EndComp
Connection ~ 3750 1250
Wire Wire Line
	4350 1150 4600 1150
Wire Wire Line
	4400 1600 4400 1350
Wire Wire Line
	4400 1350 4350 1350
Wire Wire Line
	4150 1550 4150 1750
$Comp
L Device:R R235
U 1 1 5EBD7203
P 9650 3150
F 0 "R235" V 9550 3150 50  0000 C CNN
F 1 "1k" V 9650 3150 50  0000 C CNN
F 2 "Resistor_SMD:R_1206_3216Metric_Pad1.42x1.75mm_HandSolder" V 9580 3150 50  0001 C CNN
F 3 "~" H 9650 3150 50  0001 C CNN
	1    9650 3150
	0    -1   -1   0   
$EndComp
Wire Wire Line
	9500 3150 9400 3150
Wire Wire Line
	9800 3150 9900 3150
$Comp
L Device:Q_PNP_BCE Q208
U 1 1 5EC18915
P 9200 3150
F 0 "Q208" H 9000 2850 50  0000 L CNN
F 1 "Q_PNP_BCE" H 8750 2950 50  0000 L CNN
F 2 "Package_TO_SOT_SMD:SOT-23" H 9400 3250 50  0001 C CNN
F 3 "~" H 9200 3150 50  0001 C CNN
	1    9200 3150
	-1   0    0    1   
$EndComp
$Comp
L power:+3.3V #PWR0215
U 1 1 5EC4996F
P 9100 2950
F 0 "#PWR0215" H 9100 2800 50  0001 C CNN
F 1 "+3.3V" H 8950 3100 50  0000 C CNN
F 2 "" H 9100 2950 50  0001 C CNN
F 3 "" H 9100 2950 50  0001 C CNN
	1    9100 2950
	1    0    0    -1  
$EndComp
$Comp
L power:+24V #PWR0205
U 1 1 5DCF703B
P 2700 2250
F 0 "#PWR0205" H 2700 2100 50  0001 C CNN
F 1 "+24V" H 2715 2423 50  0000 C CNN
F 2 "" H 2700 2250 50  0001 C CNN
F 3 "" H 2700 2250 50  0001 C CNN
	1    2700 2250
	1    0    0    -1  
$EndComp
Wire Wire Line
	2700 2250 2700 2400
Wire Wire Line
	2700 2400 3350 2400
Wire Wire Line
	4850 1050 4850 1150
Wire Wire Line
	1900 1250 3300 1250
Wire Wire Line
	4600 1150 4850 1150
Connection ~ 4600 1150
Connection ~ 4850 1150
Wire Wire Line
	4850 1150 4850 1300
$Comp
L Amplifier_Operational:LMV324 U203
U 3 1 5DBCDD8C
P 5150 4850
F 0 "U203" H 5200 5050 50  0000 C CNN
F 1 "LMV324IDT" H 5150 5150 50  0000 C CNN
F 2 "Package_SO:SOIC-14_3.9x8.7mm_P1.27mm" H 5150 4850 50  0001 C CNN
F 3 "~" H 5150 4850 50  0001 C CNN
	3    5150 4850
	-1   0    0    1   
$EndComp
Wire Wire Line
	4850 4850 4850 4450
Wire Wire Line
	5400 4450 5550 4450
Wire Wire Line
	5150 4450 5200 4450
$Comp
L Device:R R224
U 1 1 5DB37530
P 5000 4450
F 0 "R224" V 5100 4450 50  0000 C CNN
F 1 "100" V 5000 4450 50  0000 C CNN
F 2 "Resistor_SMD:R_1206_3216Metric_Pad1.42x1.75mm_HandSolder" V 4930 4450 50  0001 C CNN
F 3 "~" H 5000 4450 50  0001 C CNN
	1    5000 4450
	0    -1   -1   0   
$EndComp
$Comp
L Amplifier_Operational:LMV324 U203
U 4 1 5DC452C4
P 3700 4050
F 0 "U203" H 4000 4150 50  0000 C CNN
F 1 "LMV324IDT" H 3950 4250 50  0000 C CNN
F 2 "Package_SO:SOIC-14_3.9x8.7mm_P1.27mm" H 3700 4050 50  0001 C CNN
F 3 "~" H 3700 4050 50  0001 C CNN
	4    3700 4050
	-1   0    0    1   
$EndComp
Wire Wire Line
	4050 3650 4050 3950
Wire Wire Line
	3350 3650 3350 4050
Wire Wire Line
	3350 3650 4050 3650
$Comp
L Amplifier_Operational:LMV324 U203
U 5 1 5DC168D2
P 3850 4050
F 0 "U203" H 3850 4417 50  0001 C CNN
F 1 "LMV324IDT" H 3850 4326 50  0001 C CNN
F 2 "" H 3850 4050 50  0001 C CNN
F 3 "~" H 3850 4050 50  0001 C CNN
	5    3850 4050
	1    0    0    -1  
$EndComp
$Comp
L Device:C_Small C209
U 1 1 5E4626E0
P 5300 4450
F 0 "C209" V 5250 4300 50  0000 C CNN
F 1 "100n" V 5350 4300 50  0000 C CNN
F 2 "Capacitor_SMD:C_1206_3216Metric" H 5300 4450 50  0001 C CNN
F 3 "~" H 5300 4450 50  0001 C CNN
	1    5300 4450
	0    -1   -1   0   
$EndComp
Wire Wire Line
	6500 4850 7150 4850
Wire Wire Line
	6550 5050 6550 4650
Wire Wire Line
	6500 4650 6550 4650
Wire Wire Line
	6550 4650 6750 4650
Connection ~ 6550 4650
Text Label 5500 3600 0    50   ~ 0
xl4016_fb
$Comp
L power:GNDA #PWR0209
U 1 1 5EDAE31F
P 3750 4350
F 0 "#PWR0209" H 3750 4100 50  0001 C CNN
F 1 "GNDA" H 3900 4300 50  0000 C CNN
F 2 "" H 3750 4350 50  0001 C CNN
F 3 "" H 3750 4350 50  0001 C CNN
	1    3750 4350
	1    0    0    -1  
$EndComp
Text HLabel 1900 1250 0    50   Input ~ 0
charge_v_sens
Text HLabel 5700 5350 2    50   Input ~ 0
charge_c_sens
Wire Wire Line
	5450 4750 5550 4750
Connection ~ 5700 4750
Wire Wire Line
	5700 4750 5850 4750
$Comp
L power:+5VA #PWR0208
U 1 1 5EDF08C8
P 3750 3750
F 0 "#PWR0208" H 3750 3600 50  0001 C CNN
F 1 "+5VA" V 3765 3877 50  0000 L CNN
F 2 "" H 3750 3750 50  0001 C CNN
F 3 "" H 3750 3750 50  0001 C CNN
	1    3750 3750
	0    -1   -1   0   
$EndComp
Wire Wire Line
	4750 4850 4850 4850
Wire Wire Line
	5500 4950 5500 6450
Connection ~ 4850 4850
Wire Wire Line
	5550 4450 5550 4750
Connection ~ 5550 4750
Wire Wire Line
	5550 4750 5700 4750
Text HLabel 2100 4750 0    50   Input ~ 0
charge_cv_pwm
Text HLabel 2300 6250 0    50   Input ~ 0
charge_cc_pwm
$Comp
L power:GNDA #PWR0211
U 1 1 5EEAA3E2
P 4150 1750
F 0 "#PWR0211" H 4150 1500 50  0001 C CNN
F 1 "GNDA" H 4300 1700 50  0000 C CNN
F 2 "" H 4150 1750 50  0001 C CNN
F 3 "" H 4150 1750 50  0001 C CNN
	1    4150 1750
	1    0    0    -1  
$EndComp
$Comp
L power:+5VA #PWR0210
U 1 1 5EEAB405
P 4150 950
F 0 "#PWR0210" H 4150 800 50  0001 C CNN
F 1 "+5VA" H 4165 1123 50  0000 C CNN
F 2 "" H 4150 950 50  0001 C CNN
F 3 "" H 4150 950 50  0001 C CNN
	1    4150 950 
	1    0    0    -1  
$EndComp
Text HLabel 1650 3700 0    50   Input ~ 0
charge_switch
Text HLabel 9900 3150 2    50   Input ~ 0
charge_mosfet
Wire Wire Line
	3100 7500 3700 7500
$Comp
L power:GND #PWR0138
U 1 1 5E3C78A2
P 3100 7500
F 0 "#PWR0138" H 3100 7250 50  0001 C CNN
F 1 "GND" H 3105 7327 50  0000 C CNN
F 2 "" H 3100 7500 50  0001 C CNN
F 3 "" H 3100 7500 50  0001 C CNN
	1    3100 7500
	1    0    0    -1  
$EndComp
$Comp
L power:GND #PWR0140
U 1 1 5E3C84A4
P 2250 4000
F 0 "#PWR0140" H 2250 3750 50  0001 C CNN
F 1 "GND" H 2255 3827 50  0000 C CNN
F 2 "" H 2250 4000 50  0001 C CNN
F 3 "" H 2250 4000 50  0001 C CNN
	1    2250 4000
	1    0    0    -1  
$EndComp
$Comp
L power:GND #PWR0141
U 1 1 5E3C8B70
P 5050 3200
F 0 "#PWR0141" H 5050 2950 50  0001 C CNN
F 1 "GND" H 5055 3027 50  0000 C CNN
F 2 "" H 5050 3200 50  0001 C CNN
F 3 "" H 5050 3200 50  0001 C CNN
	1    5050 3200
	1    0    0    -1  
$EndComp
$Comp
L power:GND #PWR0142
U 1 1 5E3C948F
P 6200 4050
F 0 "#PWR0142" H 6200 3800 50  0001 C CNN
F 1 "GND" H 6205 3877 50  0000 C CNN
F 2 "" H 6200 4050 50  0001 C CNN
F 3 "" H 6200 4050 50  0001 C CNN
	1    6200 4050
	1    0    0    -1  
$EndComp
Wire Wire Line
	2450 6450 2650 6450
Wire Wire Line
	2100 4750 2100 4850
Wire Wire Line
	3400 5550 3400 6050
Wire Wire Line
	2100 5150 2100 6050
Wire Wire Line
	2100 6050 2900 6050
Wire Wire Line
	2250 5000 2500 5000
$Comp
L power:GND #PWR0139
U 1 1 5E3C7D70
P 2900 6050
F 0 "#PWR0139" H 2900 5800 50  0001 C CNN
F 1 "GND" H 2905 5877 50  0000 C CNN
F 2 "" H 2900 6050 50  0001 C CNN
F 3 "" H 2900 6050 50  0001 C CNN
	1    2900 6050
	1    0    0    -1  
$EndComp
$Comp
L Device:R_POT RV201
U 1 1 5E76A7D0
P 2100 5000
F 0 "RV201" V 2000 5100 50  0000 R CNN
F 1 "100k" V 2100 5100 50  0000 R CNN
F 2 "Potentiometer_THT:Potentiometer_Bourns_3296W_Vertical" H 2100 5000 50  0001 C CNN
F 3 "~" H 2100 5000 50  0001 C CNN
	1    2100 5000
	1    0    0    1   
$EndComp
Wire Wire Line
	2900 6050 3400 6050
Connection ~ 2900 6050
Wire Wire Line
	2900 5550 2900 6050
Wire Wire Line
	2900 5000 3000 5000
Connection ~ 2900 5000
Wire Wire Line
	2900 5000 2900 5350
$Comp
L Device:C_Small C?
U 1 1 5E76A7AC
P 2900 5450
AR Path="/5D7E2920/5E76A7AC" Ref="C?"  Part="1" 
AR Path="/5DAD577F/5E76A7AC" Ref="C?"  Part="1" 
AR Path="/5D7E29BE/5E76A7AC" Ref="C201"  Part="1" 
AR Path="/5EC577BA/5EC9625C/5E76A7AC" Ref="C?"  Part="1" 
F 0 "C201" V 2850 5200 50  0000 L CNN
F 1 "100nF" V 2850 5500 50  0000 L CNN
F 2 "Capacitor_SMD:C_1206_3216Metric_Pad1.42x1.75mm_HandSolder" H 2938 5300 50  0001 C CNN
F 3 "~" H 2900 5450 50  0001 C CNN
	1    2900 5450
	-1   0    0    -1  
$EndComp
$Comp
L Device:R R214
U 1 1 5E76A7A6
P 3150 5000
F 0 "R214" V 3050 4950 50  0000 C CNN
F 1 "8.2k" V 3150 5000 50  0000 C CNN
F 2 "Resistor_SMD:R_1206_3216Metric_Pad1.42x1.75mm_HandSolder" V 3080 5000 50  0001 C CNN
F 3 "~" H 3150 5000 50  0001 C CNN
	1    3150 5000
	0    1    1    0   
$EndComp
Wire Wire Line
	2800 5000 2900 5000
$Comp
L Device:R R212
U 1 1 5E76A79F
P 2650 5000
F 0 "R212" V 2550 4950 50  0000 C CNN
F 1 "8.2k" V 2650 5000 50  0000 C CNN
F 2 "Resistor_SMD:R_1206_3216Metric_Pad1.42x1.75mm_HandSolder" V 2580 5000 50  0001 C CNN
F 3 "~" H 2650 5000 50  0001 C CNN
	1    2650 5000
	0    1    1    0   
$EndComp
Wire Wire Line
	3400 5000 4050 5000
Wire Wire Line
	2300 6250 2300 6300
Wire Wire Line
	3700 6450 5500 6450
Wire Wire Line
	2300 6600 2300 7500
Wire Wire Line
	2300 7500 3100 7500
Connection ~ 9100 3350
$Comp
L power:GND #PWR0154
U 1 1 5E60C554
P 9100 4000
F 0 "#PWR0154" H 9100 3750 50  0001 C CNN
F 1 "GND" H 9105 3827 50  0000 C CNN
F 2 "" H 9100 4000 50  0001 C CNN
F 3 "" H 9100 4000 50  0001 C CNN
	1    9100 4000
	1    0    0    -1  
$EndComp
Wire Wire Line
	9100 4000 9100 3950
Wire Wire Line
	8300 3350 8250 3350
Wire Wire Line
	7950 3550 7950 3900
Wire Wire Line
	8750 3350 9100 3350
Wire Wire Line
	8750 3350 8600 3350
Connection ~ 8750 3350
Wire Wire Line
	8750 3450 8750 3350
$Comp
L Device:R R201
U 1 1 5E6AFAEA
P 7950 3000
F 0 "R201" V 8050 3000 50  0000 C CNN
F 1 "10k" V 7950 3000 50  0000 C CNN
F 2 "Resistor_SMD:R_1206_3216Metric_Pad1.42x1.75mm_HandSolder" V 7880 3000 50  0001 C CNN
F 3 "~" H 7950 3000 50  0001 C CNN
	1    7950 3000
	-1   0    0    1   
$EndComp
$EndSCHEMATC
