EESchema Schematic File Version 4
EELAYER 30 0
EELAYER END
$Descr A4 11693 8268
encoding utf-8
Sheet 3 3
Title ""
Date ""
Rev ""
Comp ""
Comment1 ""
Comment2 ""
Comment3 ""
Comment4 ""
$EndDescr
$Comp
L Transistor_FET:2N7002 Q308
U 1 1 5F3901AD
P 8950 1700
AR Path="/5D7E2920/5F3901AD" Ref="Q308"  Part="1" 
AR Path="/5DAD577F/5F3901AD" Ref="Q?"  Part="1" 
F 0 "Q308" H 8750 1550 50  0000 L CNN
F 1 "2N7002" H 8700 1450 50  0000 L CNN
F 2 "Package_TO_SOT_SMD:SOT-23" H 9150 1625 50  0001 L CIN
F 3 "https://www.fairchildsemi.com/datasheets/2N/2N7002.pdf" H 8950 1700 50  0001 L CNN
	1    8950 1700
	-1   0    0    -1  
$EndComp
Connection ~ 9450 1700
Wire Wire Line
	9450 1850 9450 1700
$Comp
L Device:R R344
U 1 1 6096B5E4
P 9750 2200
AR Path="/5D7E2920/6096B5E4" Ref="R344"  Part="1" 
AR Path="/5DAD577F/6096B5E4" Ref="R?"  Part="1" 
F 0 "R344" V 9650 2200 50  0000 C CNN
F 1 "150" V 9750 2200 50  0000 C CNN
F 2 "Resistor_SMD:R_1206_3216Metric_Pad1.42x1.75mm_HandSolder" V 9680 2200 50  0001 C CNN
F 3 "~" H 9750 2200 50  0001 C CNN
	1    9750 2200
	-1   0    0    -1  
$EndComp
$Comp
L power:-5V #PWR0319
U 1 1 5D85CC87
P 8850 2400
AR Path="/5D7E2920/5D85CC87" Ref="#PWR0319"  Part="1" 
AR Path="/5DAD577F/5D85CC87" Ref="#PWR?"  Part="1" 
F 0 "#PWR0319" H 8850 2500 50  0001 C CNN
F 1 "-5V" H 8865 2573 50  0000 C CNN
F 2 "" H 8850 2400 50  0001 C CNN
F 3 "" H 8850 2400 50  0001 C CNN
	1    8850 2400
	-1   0    0    1   
$EndComp
Wire Wire Line
	8850 1200 9000 1200
Connection ~ 8850 1200
Connection ~ 9000 800 
Wire Wire Line
	9000 850  9000 800 
Wire Wire Line
	9000 1200 9300 1200
Connection ~ 9000 1200
Wire Wire Line
	9000 1150 9000 1200
Text Notes 10650 1400 0    50   ~ 0
H=off, L=on
Wire Wire Line
	7050 4700 7450 4700
Wire Wire Line
	7450 4300 7750 4300
Wire Wire Line
	5800 4800 5850 4800
Wire Wire Line
	5800 5000 6600 5000
Wire Wire Line
	5800 5000 5800 4800
Wire Wire Line
	6450 4700 6600 4700
Connection ~ 6200 1000
Wire Wire Line
	6200 1000 6200 1200
Wire Wire Line
	6400 1000 6650 1000
Wire Wire Line
	6650 1000 6650 1200
Wire Wire Line
	6650 1000 6700 1000
$Comp
L Device:C_Small C306
U 1 1 5D85CC9C
P 6300 1200
AR Path="/5D7E2920/5D85CC9C" Ref="C306"  Part="1" 
AR Path="/5DAD577F/5D85CC9C" Ref="C?"  Part="1" 
F 0 "C306" V 6250 1350 50  0000 C CNN
F 1 "100n" V 6350 1350 50  0000 C CNN
F 2 "Capacitor_SMD:C_1206_3216Metric_Pad1.42x1.75mm_HandSolder" H 6300 1200 50  0001 C CNN
F 3 "~" H 6300 1200 50  0001 C CNN
	1    6300 1200
	0    1    1    0   
$EndComp
$Comp
L Device:CP_Small C305
U 1 1 6011F7A9
P 6300 1000
AR Path="/5D7E2920/6011F7A9" Ref="C305"  Part="1" 
AR Path="/5DAD577F/6011F7A9" Ref="C?"  Part="1" 
F 0 "C305" V 6450 850 50  0000 C CNN
F 1 "10uF" V 6350 850 50  0000 C CNN
F 2 "Capacitor_SMD:CP_Elec_4x3.9" H 6300 1000 50  0001 C CNN
F 3 "~" H 6300 1000 50  0001 C CNN
	1    6300 1000
	0    -1   -1   0   
$EndComp
$Comp
L Device:LED D304
U 1 1 5D85CCA6
P 9750 1900
AR Path="/5D7E2920/5D85CCA6" Ref="D304"  Part="1" 
AR Path="/5DAD577F/5D85CCA6" Ref="D?"  Part="1" 
F 0 "D304" V 9750 2150 50  0000 R CNN
F 1 "LED" V 9650 2100 50  0000 R CNN
F 2 "Diode_SMD:D_1206_3216Metric_Pad1.42x1.75mm_HandSolder" H 9750 1900 50  0001 C CNN
F 3 "~" H 9750 1900 50  0001 C CNN
	1    9750 1900
	0    1    -1   0   
$EndComp
$Comp
L Device:R R342
U 1 1 6096B5C6
P 9000 1000
AR Path="/5D7E2920/6096B5C6" Ref="R342"  Part="1" 
AR Path="/5DAD577F/6096B5C6" Ref="R?"  Part="1" 
F 0 "R342" H 9150 1000 50  0000 C CNN
F 1 "200k" V 9000 1000 50  0000 C CNN
F 2 "Resistor_SMD:R_1206_3216Metric_Pad1.42x1.75mm_HandSolder" V 8930 1000 50  0001 C CNN
F 3 "~" H 9000 1000 50  0001 C CNN
	1    9000 1000
	1    0    0    1   
$EndComp
Wire Wire Line
	7750 1750 7750 1800
Wire Wire Line
	6750 1500 6600 1500
Wire Wire Line
	7450 1850 7450 1550
Wire Wire Line
	7750 1800 7050 1800
$Comp
L Device:R R322
U 1 1 5D85CC3F
P 6900 1800
AR Path="/5D7E2920/5D85CC3F" Ref="R322"  Part="1" 
AR Path="/5DAD577F/5D85CC3F" Ref="R?"  Part="1" 
F 0 "R322" V 6800 1800 50  0000 C CNN
F 1 "10k" V 6900 1800 50  0000 C CNN
F 2 "Resistor_SMD:R_1206_3216Metric_Pad1.42x1.75mm_HandSolder" V 6830 1800 50  0001 C CNN
F 3 "~" H 6900 1800 50  0001 C CNN
	1    6900 1800
	0    1    1    0   
$EndComp
Wire Wire Line
	5850 1600 5850 2100
Wire Wire Line
	5850 2650 5850 2850
$Comp
L Device:R R321
U 1 1 5D85CC3C
P 6900 1500
AR Path="/5D7E2920/5D85CC3C" Ref="R321"  Part="1" 
AR Path="/5DAD577F/5D85CC3C" Ref="R?"  Part="1" 
F 0 "R321" V 6800 1500 50  0000 C CNN
F 1 "1k" V 6900 1500 50  0000 C CNN
F 2 "Resistor_SMD:R_1206_3216Metric_Pad1.42x1.75mm_HandSolder" V 6830 1500 50  0001 C CNN
F 3 "~" H 6900 1500 50  0001 C CNN
	1    6900 1500
	0    1    1    0   
$EndComp
Wire Wire Line
	7750 3950 7750 4000
$Comp
L Device:R R326
U 1 1 5D0FECDB
P 6900 3950
AR Path="/5D7E2920/5D0FECDB" Ref="R326"  Part="1" 
AR Path="/5DAD577F/5D0FECDB" Ref="R?"  Part="1" 
F 0 "R326" V 6800 3950 50  0000 C CNN
F 1 "10k" V 6900 3950 50  0000 C CNN
F 2 "Resistor_SMD:R_1206_3216Metric_Pad1.42x1.75mm_HandSolder" V 6830 3950 50  0001 C CNN
F 3 "~" H 6900 3950 50  0001 C CNN
	1    6900 3950
	0    1    1    0   
$EndComp
Wire Wire Line
	5850 3950 6600 3950
$Comp
L Device:R R333
U 1 1 5D104040
P 7450 5200
AR Path="/5D7E2920/5D104040" Ref="R333"  Part="1" 
AR Path="/5DAD577F/5D104040" Ref="R?"  Part="1" 
F 0 "R333" V 7550 5200 50  0000 C CNN
F 1 "1M" V 7450 5200 50  0000 C CNN
F 2 "Resistor_SMD:R_1206_3216Metric_Pad1.42x1.75mm_HandSolder" V 7380 5200 50  0001 C CNN
F 3 "~" H 7450 5200 50  0001 C CNN
	1    7450 5200
	-1   0    0    1   
$EndComp
Wire Wire Line
	7750 4900 7750 5000
Wire Wire Line
	7450 5050 7450 4700
Wire Wire Line
	7750 5000 7050 5000
Connection ~ 7750 5000
Wire Wire Line
	7750 5000 7750 5050
$Comp
L Device:R R328
U 1 1 5D104051
P 6900 5000
AR Path="/5D7E2920/5D104051" Ref="R328"  Part="1" 
AR Path="/5DAD577F/5D104051" Ref="R?"  Part="1" 
F 0 "R328" V 6800 5000 50  0000 C CNN
F 1 "10k" V 6900 5000 50  0000 C CNN
F 2 "Resistor_SMD:R_1206_3216Metric_Pad1.42x1.75mm_HandSolder" V 6830 5000 50  0001 C CNN
F 3 "~" H 6900 5000 50  0001 C CNN
	1    6900 5000
	0    1    1    0   
$EndComp
$Comp
L Device:R R327
U 1 1 5D10405B
P 6900 4700
AR Path="/5D7E2920/5D10405B" Ref="R327"  Part="1" 
AR Path="/5DAD577F/5D10405B" Ref="R?"  Part="1" 
F 0 "R327" V 6800 4700 50  0000 C CNN
F 1 "1k" V 6900 4700 50  0000 C CNN
F 2 "Resistor_SMD:R_1206_3216Metric_Pad1.42x1.75mm_HandSolder" V 6830 4700 50  0001 C CNN
F 3 "~" H 6900 4700 50  0001 C CNN
	1    6900 4700
	0    1    1    0   
$EndComp
Connection ~ 7450 4700
Wire Wire Line
	7750 1350 7750 1300
Wire Wire Line
	7750 4500 7750 4400
Wire Wire Line
	7750 4400 8250 4400
Text Notes 5850 1950 1    22   ~ 0
mosfet short circuit:\n17v/10k=1.7mA
$Comp
L Device:R R319
U 1 1 5DF6DAC4
P 5650 4600
AR Path="/5D7E2920/5DF6DAC4" Ref="R319"  Part="1" 
AR Path="/5DAD577F/5DF6DAC4" Ref="R?"  Part="1" 
F 0 "R319" V 5550 4600 50  0000 C CNN
F 1 "100" V 5650 4600 50  0000 C CNN
F 2 "Resistor_SMD:R_1206_3216Metric_Pad1.42x1.75mm_HandSolder" V 5580 4600 50  0001 C CNN
F 3 "~" H 5650 4600 50  0001 C CNN
	1    5650 4600
	0    1    1    0   
$EndComp
Wire Wire Line
	5850 4600 5800 4600
Wire Wire Line
	5500 4600 5450 4600
Wire Wire Line
	5500 2450 5450 2450
$Comp
L Device:R R316
U 1 1 5DF6DAC6
P 5650 1400
AR Path="/5D7E2920/5DF6DAC6" Ref="R316"  Part="1" 
AR Path="/5DAD577F/5DF6DAC6" Ref="R?"  Part="1" 
F 0 "R316" V 5550 1400 50  0000 C CNN
F 1 "100" V 5650 1400 50  0000 C CNN
F 2 "Resistor_SMD:R_1206_3216Metric_Pad1.42x1.75mm_HandSolder" V 5580 1400 50  0001 C CNN
F 3 "~" H 5650 1400 50  0001 C CNN
	1    5650 1400
	0    1    1    0   
$EndComp
Wire Wire Line
	5850 1400 5800 1400
Wire Wire Line
	5500 1400 5450 1400
Wire Wire Line
	5450 1400 5450 2450
Connection ~ 8450 5350
Wire Wire Line
	8450 4300 8450 5350
Connection ~ 8450 5550
Wire Wire Line
	8450 5550 8450 5700
Connection ~ 5450 2450
Wire Wire Line
	8250 4400 8250 3350
Connection ~ 7750 3950
Connection ~ 5450 3550
Wire Wire Line
	5500 3550 5450 3550
Wire Wire Line
	5850 3550 5800 3550
$Comp
L Device:R R318
U 1 1 5DF6DAC5
P 5650 3550
AR Path="/5D7E2920/5DF6DAC5" Ref="R318"  Part="1" 
AR Path="/5DAD577F/5DF6DAC5" Ref="R?"  Part="1" 
F 0 "R318" V 5550 3550 50  0000 C CNN
F 1 "100" V 5650 3550 50  0000 C CNN
F 2 "Resistor_SMD:R_1206_3216Metric_Pad1.42x1.75mm_HandSolder" V 5580 3550 50  0001 C CNN
F 3 "~" H 5650 3550 50  0001 C CNN
	1    5650 3550
	0    1    1    0   
$EndComp
Wire Wire Line
	7750 3350 8250 3350
Wire Wire Line
	7750 3450 7750 3350
Wire Wire Line
	5850 3950 5850 3750
Wire Wire Line
	7750 3850 7750 3950
$Comp
L Transistor_FET:IRF740 Q305
U 1 1 5D85CC43
P 7650 3650
AR Path="/5D7E2920/5D85CC43" Ref="Q305"  Part="1" 
AR Path="/5DAD577F/5D85CC43" Ref="Q?"  Part="1" 
F 0 "Q305" H 7856 3696 50  0000 L CNN
F 1 "PSMN015-100P" H 7856 3605 50  0000 L CNN
F 2 "Package_TO_SOT_THT:TO-220-3_Horizontal_TabUp" H 7900 3575 50  0001 L CIN
F 3 "http://www.vishay.com/docs/91054/91054.pdf" H 7650 3650 50  0001 L CNN
	1    7650 3650
	1    0    0    -1  
$EndComp
Connection ~ 7450 3650
Wire Wire Line
	6450 3650 6600 3650
$Comp
L Device:R R325
U 1 1 5D85CC46
P 6900 3650
AR Path="/5D7E2920/5D85CC46" Ref="R325"  Part="1" 
AR Path="/5DAD577F/5D85CC46" Ref="R?"  Part="1" 
F 0 "R325" V 6800 3650 50  0000 C CNN
F 1 "1k" V 6900 3650 50  0000 C CNN
F 2 "Resistor_SMD:R_1206_3216Metric_Pad1.42x1.75mm_HandSolder" V 6830 3650 50  0001 C CNN
F 3 "~" H 6900 3650 50  0001 C CNN
	1    6900 3650
	0    1    1    0   
$EndComp
Wire Wire Line
	7450 3650 7050 3650
Connection ~ 8450 4300
Wire Wire Line
	8450 3200 8450 4300
Wire Wire Line
	7750 1800 7750 1850
Connection ~ 7750 1800
Wire Wire Line
	7450 5350 7750 5350
Wire Wire Line
	7750 3950 7050 3950
Wire Wire Line
	7450 4000 7450 3650
$Comp
L Device:R R332
U 1 1 5D85CC44
P 7450 4150
AR Path="/5D7E2920/5D85CC44" Ref="R332"  Part="1" 
AR Path="/5DAD577F/5D85CC44" Ref="R?"  Part="1" 
F 0 "R332" V 7550 4150 50  0000 C CNN
F 1 "1M" V 7450 4150 50  0000 C CNN
F 2 "Resistor_SMD:R_1206_3216Metric_Pad1.42x1.75mm_HandSolder" V 7380 4150 50  0001 C CNN
F 3 "~" H 7450 4150 50  0001 C CNN
	1    7450 4150
	-1   0    0    1   
$EndComp
$Comp
L Device:R R339
U 1 1 5DF6DAD8
P 7750 5200
AR Path="/5D7E2920/5DF6DAD8" Ref="R339"  Part="1" 
AR Path="/5DAD577F/5DF6DAD8" Ref="R?"  Part="1" 
F 0 "R339" V 7850 5200 50  0000 C CNN
F 1 "0R1" V 7750 5200 50  0000 C CNN
F 2 "Resistor_THT:R_Axial_DIN0617_L17.0mm_D6.0mm_P20.32mm_Horizontal" V 7680 5200 50  0001 C CNN
F 3 "~" H 7750 5200 50  0001 C CNN
	1    7750 5200
	-1   0    0    1   
$EndComp
Connection ~ 7750 5350
Wire Wire Line
	7750 5350 8450 5350
Text Notes 7800 4200 0    50   ~ 0
3w
Text Notes 7800 5250 0    50   ~ 0
3w
Text Notes 7200 6350 0    50   ~ 10
output current measure
Wire Notes Line width 8
	8350 5400 8350 6500
$Comp
L Device:C C307
U 1 1 5D8CA645
P 6550 6100
AR Path="/5D7E2920/5D8CA645" Ref="C307"  Part="1" 
AR Path="/5DAD577F/5D8CA645" Ref="C?"  Part="1" 
F 0 "C307" H 6700 6100 50  0000 L CNN
F 1 "100nF" H 6650 6000 50  0000 L CNN
F 2 "Capacitor_SMD:C_1206_3216Metric_Pad1.42x1.75mm_HandSolder" H 6588 5950 50  0001 C CNN
F 3 "~" H 6550 6100 50  0001 C CNN
	1    6550 6100
	-1   0    0    -1  
$EndComp
Wire Wire Line
	7500 5750 7450 5750
Wire Wire Line
	7500 5550 7500 5750
Wire Wire Line
	6850 5550 7000 5550
Wire Wire Line
	7500 5950 7450 5950
Wire Wire Line
	8250 5550 8250 5950
Text Notes 7400 6250 0    50   ~ 0
15A*0.1Ω=1.5V\nAmplified x2 to 3V max
Wire Wire Line
	7800 5950 8250 5950
$Comp
L Device:R R334
U 1 1 5D1D67CB
P 7650 5950
AR Path="/5D7E2920/5D1D67CB" Ref="R334"  Part="1" 
AR Path="/5DAD577F/5D1D67CB" Ref="R?"  Part="1" 
F 0 "R334" V 7550 5950 50  0000 C CNN
F 1 "10k" V 7650 5950 50  0000 C CNN
F 2 "Resistor_SMD:R_1206_3216Metric_Pad1.42x1.75mm_HandSolder" V 7580 5950 50  0001 C CNN
F 3 "~" H 7650 5950 50  0001 C CNN
	1    7650 5950
	0    1    1    0   
$EndComp
$Comp
L Device:R R329
U 1 1 5DF6DAEF
P 7150 5550
AR Path="/5D7E2920/5DF6DAEF" Ref="R329"  Part="1" 
AR Path="/5DAD577F/5DF6DAEF" Ref="R?"  Part="1" 
F 0 "R329" V 7150 5550 50  0000 C CNN
F 1 "10k  0.5%" V 7050 5550 50  0000 C CNN
F 2 "Resistor_SMD:R_1206_3216Metric_Pad1.42x1.75mm_HandSolder" V 7080 5550 50  0001 C CNN
F 3 "~" H 7150 5550 50  0001 C CNN
	1    7150 5550
	0    1    1    0   
$EndComp
Wire Wire Line
	7300 5550 7500 5550
$Comp
L Device:C C311
U 1 1 5E7B67CA
P 6600 4850
AR Path="/5D7E2920/5E7B67CA" Ref="C311"  Part="1" 
AR Path="/5DAD577F/5E7B67CA" Ref="C?"  Part="1" 
F 0 "C311" H 6750 4850 50  0000 L CNN
F 1 "1.5nF" H 6650 4750 50  0000 L CNN
F 2 "Capacitor_SMD:C_1206_3216Metric_Pad1.42x1.75mm_HandSolder" H 6638 4700 50  0001 C CNN
F 3 "~" H 6600 4850 50  0001 C CNN
	1    6600 4850
	-1   0    0    -1  
$EndComp
Connection ~ 6600 4700
Wire Wire Line
	6600 4700 6750 4700
Connection ~ 6600 5000
Wire Wire Line
	6600 5000 6750 5000
Wire Wire Line
	5850 2450 5800 2450
$Comp
L Device:R R317
U 1 1 5D85CC4D
P 5650 2450
AR Path="/5D7E2920/5D85CC4D" Ref="R317"  Part="1" 
AR Path="/5DAD577F/5D85CC4D" Ref="R?"  Part="1" 
F 0 "R317" V 5550 2450 50  0000 C CNN
F 1 "100" V 5650 2450 50  0000 C CNN
F 2 "Resistor_SMD:R_1206_3216Metric_Pad1.42x1.75mm_HandSolder" V 5580 2450 50  0001 C CNN
F 3 "~" H 5650 2450 50  0001 C CNN
	1    5650 2450
	0    1    1    0   
$EndComp
$Comp
L Device:C C310
U 1 1 5E8367DA
P 6600 3800
AR Path="/5D7E2920/5E8367DA" Ref="C310"  Part="1" 
AR Path="/5DAD577F/5E8367DA" Ref="C?"  Part="1" 
F 0 "C310" H 6750 3800 50  0000 L CNN
F 1 "1.5nF" H 6650 3700 50  0000 L CNN
F 2 "Capacitor_SMD:C_1206_3216Metric_Pad1.42x1.75mm_HandSolder" H 6638 3650 50  0001 C CNN
F 3 "~" H 6600 3800 50  0001 C CNN
	1    6600 3800
	-1   0    0    -1  
$EndComp
Connection ~ 6600 3650
Wire Wire Line
	6600 3650 6750 3650
Connection ~ 6600 3950
Wire Wire Line
	6600 3950 6750 3950
Connection ~ 6600 1500
Wire Wire Line
	6600 1500 6450 1500
Wire Wire Line
	7750 1300 8250 1300
Wire Wire Line
	7450 1550 7450 1500
Connection ~ 7450 1550
Wire Wire Line
	8450 5550 8250 5550
Wire Wire Line
	6200 1000 6050 1000
Wire Wire Line
	8450 6000 8450 6300
$Comp
L Device:R R338
U 1 1 5DF6DB24
P 7750 4150
AR Path="/5D7E2920/5DF6DB24" Ref="R338"  Part="1" 
AR Path="/5DAD577F/5DF6DB24" Ref="R?"  Part="1" 
F 0 "R338" V 7850 4150 50  0000 C CNN
F 1 "0R1" V 7750 4150 50  0000 C CNN
F 2 "Resistor_THT:R_Axial_DIN0617_L17.0mm_D6.0mm_P20.32mm_Horizontal" V 7680 4150 50  0001 C CNN
F 3 "~" H 7750 4150 50  0001 C CNN
	1    7750 4150
	-1   0    0    1   
$EndComp
Connection ~ 7750 4300
Wire Wire Line
	7750 4300 8450 4300
$Comp
L Device:C C308
U 1 1 5E83C3E0
P 6600 1650
AR Path="/5D7E2920/5E83C3E0" Ref="C308"  Part="1" 
AR Path="/5DAD577F/5E83C3E0" Ref="C?"  Part="1" 
F 0 "C308" H 6750 1650 50  0000 L CNN
F 1 "1.5nF" H 6650 1550 50  0000 L CNN
F 2 "Capacitor_SMD:C_1206_3216Metric_Pad1.42x1.75mm_HandSolder" H 6638 1500 50  0001 C CNN
F 3 "~" H 6600 1650 50  0001 C CNN
	1    6600 1650
	-1   0    0    -1  
$EndComp
$Comp
L Device:R R340
U 1 1 5DF6DAD9
P 8450 5850
AR Path="/5D7E2920/5DF6DAD9" Ref="R340"  Part="1" 
AR Path="/5DAD577F/5DF6DAD9" Ref="R?"  Part="1" 
F 0 "R340" V 8550 5850 50  0000 C CNN
F 1 "0R1" V 8450 5850 50  0000 C CNN
F 2 "Package_TO_SOT_THT:TO-220-2_Horizontal_TabUp" V 8380 5850 50  0001 C CNN
F 3 "~" H 8450 5850 50  0001 C CNN
	1    8450 5850
	1    0    0    -1  
$EndComp
Text Notes 8650 6000 1    50   ~ 0
min 30W
$Comp
L Transistor_FET:IRF740 Q306
U 1 1 5D85CC47
P 7650 4700
AR Path="/5D7E2920/5D85CC47" Ref="Q306"  Part="1" 
AR Path="/5DAD577F/5D85CC47" Ref="Q?"  Part="1" 
F 0 "Q306" H 7856 4746 50  0000 L CNN
F 1 "PSMN015-100P" H 7856 4655 50  0000 L CNN
F 2 "Package_TO_SOT_THT:TO-220-3_Horizontal_TabUp" H 7900 4625 50  0001 L CIN
F 3 "http://www.vishay.com/docs/91054/91054.pdf" H 7650 4700 50  0001 L CNN
	1    7650 4700
	1    0    0    -1  
$EndComp
$Comp
L Transistor_FET:IRF740 Q303
U 1 1 5D85CC3A
P 7650 1550
AR Path="/5D7E2920/5D85CC3A" Ref="Q303"  Part="1" 
AR Path="/5DAD577F/5D85CC3A" Ref="Q?"  Part="1" 
F 0 "Q303" H 7856 1596 50  0000 L CNN
F 1 "PSMN015-100P" H 7856 1505 50  0000 L CNN
F 2 "Package_TO_SOT_THT:TO-220-3_Horizontal_TabUp" H 7900 1475 50  0001 L CIN
F 3 "http://www.vishay.com/docs/91054/91054.pdf" H 7650 1550 50  0001 L CNN
	1    7650 1550
	1    0    0    -1  
$EndComp
Text GLabel 9900 800  2    50   Input ~ 0
bat_plus
Wire Wire Line
	6050 1200 6050 1000
Wire Wire Line
	6400 1200 6650 1200
$Comp
L battery_tester-rescue:AD8630-michal_lib U?
U 1 1 5D85CC39
P 6150 4700
AR Path="/5D85CC39" Ref="U?"  Part="2" 
AR Path="/5D7E2920/5D85CC39" Ref="U304"  Part="1" 
AR Path="/5DAD577F/5D85CC39" Ref="U?"  Part="2" 
F 0 "U304" H 6150 5067 50  0000 C CNN
F 1 "MCP6V74-E" H 6150 4976 50  0000 C CNN
F 2 "Package_SO:TSSOP-14_4.4x5mm_P0.65mm" H 6100 4800 50  0001 C CNN
F 3 "http://www.ti.com/lit/ds/symlink/tl081.pdf" H 6200 4900 50  0001 C CNN
	1    6150 4700
	1    0    0    -1  
$EndComp
$Comp
L battery_tester-rescue:AD8630-michal_lib U?
U 3 1 5D0638CE
P 6150 1500
AR Path="/5D0638CE" Ref="U?"  Part="1" 
AR Path="/5D7E2920/5D0638CE" Ref="U304"  Part="3" 
AR Path="/5DAD577F/5D0638CE" Ref="U?"  Part="1" 
F 0 "U304" H 5700 1950 50  0000 C CNN
F 1 "MCP6V74-E" H 5700 1850 50  0000 C CNN
F 2 "Package_SO:TSSOP-14_4.4x5mm_P0.65mm" H 6100 1600 50  0001 C CNN
F 3 "http://www.ti.com/lit/ds/symlink/tl081.pdf" H 6200 1700 50  0001 C CNN
	3    6150 1500
	1    0    0    -1  
$EndComp
$Comp
L battery_tester-rescue:AD8630-michal_lib U?
U 2 1 5D85CC38
P 6150 3650
AR Path="/5D85CC38" Ref="U?"  Part="4" 
AR Path="/5D7E2920/5D85CC38" Ref="U304"  Part="2" 
AR Path="/5DAD577F/5D85CC38" Ref="U?"  Part="4" 
F 0 "U304" H 6150 4017 50  0000 C CNN
F 1 "MCP6V74-E" H 6150 3926 50  0000 C CNN
F 2 "Package_SO:TSSOP-14_4.4x5mm_P0.65mm" H 6100 3750 50  0001 C CNN
F 3 "http://www.ti.com/lit/ds/symlink/tl081.pdf" H 6200 3850 50  0001 C CNN
	2    6150 3650
	1    0    0    -1  
$EndComp
$Comp
L battery_tester-rescue:AD8630-michal_lib U?
U 5 1 5DF6DABE
P 6150 1500
AR Path="/5DF6DABE" Ref="U?"  Part="5" 
AR Path="/5D7E2920/5DF6DABE" Ref="U304"  Part="5" 
AR Path="/5DAD577F/5DF6DABE" Ref="U?"  Part="5" 
F 0 "U304" H 6108 1546 50  0001 L CNN
F 1 "MCP6V74-E" H 6108 1500 50  0001 L CNN
F 2 "Package_SO:TSSOP-14_4.4x5mm_P0.65mm" H 6100 1600 50  0001 C CNN
F 3 "http://www.ti.com/lit/ds/symlink/tl081.pdf" H 6200 1700 50  0001 C CNN
	5    6150 1500
	1    0    0    -1  
$EndComp
Wire Wire Line
	6050 1800 6050 1850
Wire Wire Line
	8850 800  9000 800 
Wire Wire Line
	8350 1200 8350 1100
Wire Wire Line
	8550 800  8650 800 
$Comp
L Transistor_FET:Si7141DP Q307
U 1 1 5D85CCA3
P 8350 900
AR Path="/5D7E2920/5D85CCA3" Ref="Q307"  Part="1" 
AR Path="/5DAD577F/5D85CCA3" Ref="Q?"  Part="1" 
F 0 "Q307" V 8750 900 50  0000 C CNN
F 1 "SI7155DP-T1" V 8650 900 50  0000 C CNN
F 2 "Package_SO:PowerPAK_SO-8_Single" H 8550 825 50  0001 L CIN
F 3 "http://www.jaolen.com/images/pdf/QM6015D.pdf" V 8350 900 50  0001 L CNN
	1    8350 900 
	0    -1   -1   0   
$EndComp
$Comp
L Diode:2BZX84Cxx D303
U 1 1 5D85CC86
P 8750 1000
AR Path="/5D7E2920/5D85CC86" Ref="D303"  Part="1" 
AR Path="/5DAD577F/5D85CC86" Ref="D?"  Part="1" 
F 0 "D303" H 8650 1350 50  0000 L CNN
F 1 "10V" H 8650 1250 50  0000 L CNN
F 2 "Package_TO_SOT_SMD:SOT-23" H 8750 1000 50  0001 C CNN
F 3 "~" H 8750 1000 50  0001 C CNN
	1    8750 1000
	1    0    0    -1  
$EndComp
Connection ~ 8750 1200
Wire Wire Line
	8750 1200 8850 1200
Wire Wire Line
	8350 1200 8750 1200
Wire Wire Line
	8850 800  8650 800 
Connection ~ 8850 800 
Connection ~ 8650 800 
$Comp
L Device:R R?
U 1 1 5ECECCB2
P 10400 1500
AR Path="/5D7E29BE/5ECECCB2" Ref="R?"  Part="1" 
AR Path="/5D7E2920/5ECECCB2" Ref="R345"  Part="1" 
F 0 "R345" V 10500 1500 50  0000 C CNN
F 1 "1k" V 10400 1500 50  0000 C CNN
F 2 "Resistor_SMD:R_1206_3216Metric_Pad1.42x1.75mm_HandSolder" V 10330 1500 50  0001 C CNN
F 3 "~" H 10400 1500 50  0001 C CNN
	1    10400 1500
	0    -1   -1   0   
$EndComp
Wire Wire Line
	10250 1500 10050 1500
$Comp
L Device:Q_PNP_BCE Q?
U 1 1 5ECECCB9
P 9850 1500
AR Path="/5D7E29BE/5ECECCB9" Ref="Q?"  Part="1" 
AR Path="/5D7E2920/5ECECCB9" Ref="Q310"  Part="1" 
F 0 "Q310" H 9500 1650 50  0000 L CNN
F 1 "Q_PNP_BCE" H 9400 1750 50  0000 L CNN
F 2 "Package_TO_SOT_SMD:SOT-23" H 10050 1600 50  0001 C CNN
F 3 "~" H 9850 1500 50  0001 C CNN
	1    9850 1500
	-1   0    0    1   
$EndComp
$Comp
L power:+3.3V #PWR?
U 1 1 5ECECCBF
P 9750 1300
AR Path="/5D7E29BE/5ECECCBF" Ref="#PWR?"  Part="1" 
AR Path="/5D7E2920/5ECECCBF" Ref="#PWR0320"  Part="1" 
F 0 "#PWR0320" H 9750 1150 50  0001 C CNN
F 1 "+3.3V" H 9765 1473 50  0000 C CNN
F 2 "" H 9750 1300 50  0001 C CNN
F 3 "" H 9750 1300 50  0001 C CNN
	1    9750 1300
	1    0    0    -1  
$EndComp
Wire Wire Line
	10650 1500 10550 1500
Wire Wire Line
	7550 5550 7500 5550
Connection ~ 7500 5550
Wire Wire Line
	8450 5350 8450 5550
Wire Wire Line
	7050 1500 7450 1500
Text HLabel 6500 5850 0    50   Input ~ 0
load_c_sens
$Comp
L michal_lib:+6.5V #PWR0313
U 1 1 6126A38C
P 6050 1000
F 0 "#PWR0313" H 6050 850 50  0001 C CNN
F 1 "+6.5V" H 6050 1150 50  0000 C CNN
F 2 "" H 6050 1000 50  0001 C CNN
F 3 "" H 6050 1000 50  0001 C CNN
	1    6050 1000
	1    0    0    -1  
$EndComp
Connection ~ 6050 1000
Connection ~ 6650 1000
Wire Notes Line
	5050 950  5050 2250
Wire Notes Line
	2400 950  2400 2250
Text HLabel 2950 1500 0    50   Input ~ 0
load_v_sens
Wire Wire Line
	2950 1500 3350 1500
$Comp
L battery_tester-rescue:AD8630-michal_lib U?
U 4 1 5D85CC68
P 4100 1500
AR Path="/5D85CC68" Ref="U?"  Part="4" 
AR Path="/5D7E2920/5D85CC68" Ref="U302"  Part="4" 
AR Path="/5DAD577F/5D85CC68" Ref="U?"  Part="4" 
F 0 "U302" H 4100 1867 50  0000 C CNN
F 1 "MCP6V74-E" H 4100 1776 50  0000 C CNN
F 2 "Package_SO:TSSOP-14_4.4x5mm_P0.65mm" H 4050 1600 50  0001 C CNN
F 3 "http://www.ti.com/lit/ds/symlink/tl081.pdf" H 4150 1700 50  0001 C CNN
	4    4100 1500
	-1   0    0    1   
$EndComp
Connection ~ 4650 1600
Wire Wire Line
	4650 1600 4900 1600
Wire Wire Line
	4250 1100 4450 1100
$Comp
L Device:R R310
U 1 1 5E77B0AE
P 4100 1100
AR Path="/5D7E2920/5E77B0AE" Ref="R310"  Part="1" 
AR Path="/5DAD577F/5E77B0AE" Ref="R?"  Part="1" 
F 0 "R310" V 4000 1100 50  0000 C CNN
F 1 "1k" V 4100 1100 50  0000 C CNN
F 2 "Resistor_SMD:R_1206_3216Metric_Pad1.42x1.75mm_HandSolder" V 4030 1100 50  0001 C CNN
F 3 "~" H 4100 1100 50  0001 C CNN
	1    4100 1100
	0    1    1    0   
$EndComp
Connection ~ 3800 1500
Connection ~ 4650 2000
Text Notes 3100 2100 0    50   ~ 10
input voltage divider
$Comp
L Device:C_Small C303
U 1 1 5D649197
P 3350 1750
AR Path="/5D7E2920/5D649197" Ref="C303"  Part="1" 
AR Path="/5DAD577F/5D649197" Ref="C?"  Part="1" 
F 0 "C303" H 3500 1750 50  0000 L CNN
F 1 "100nF" H 3400 1650 50  0000 L CNN
F 2 "Capacitor_SMD:C_1206_3216Metric_Pad1.42x1.75mm_HandSolder" H 3388 1600 50  0001 C CNN
F 3 "~" H 3350 1750 50  0001 C CNN
	1    3350 1750
	-1   0    0    -1  
$EndComp
Wire Notes Line
	2400 950  5050 950 
Text Notes 4800 1600 2    50   ~ 0
0.1V/V\n\n
Wire Wire Line
	4650 2000 4900 2000
Wire Wire Line
	4900 1900 4900 2000
Wire Wire Line
	4650 1950 4650 2000
Wire Wire Line
	4650 1600 4400 1600
Wire Wire Line
	4650 1600 4650 1650
$Comp
L Device:D_Zener D302
U 1 1 5DF6DAD0
P 4650 1800
AR Path="/5D7E2920/5DF6DAD0" Ref="D302"  Part="1" 
AR Path="/5DAD577F/5DF6DAD0" Ref="D?"  Part="1" 
F 0 "D302" V 4600 1600 50  0000 L CNN
F 1 "3.3V" V 4700 1550 50  0000 L CNN
F 2 "Diode_SMD:D_MicroMELF" H 4650 1800 50  0001 C CNN
F 3 "~" H 4650 1800 50  0001 C CNN
	1    4650 1800
	0    1    1    0   
$EndComp
Wire Wire Line
	3350 1500 3450 1500
Connection ~ 3350 1500
$Comp
L Device:R R307
U 1 1 5D85CC57
P 3600 1500
AR Path="/5D7E2920/5D85CC57" Ref="R307"  Part="1" 
AR Path="/5DAD577F/5D85CC57" Ref="R?"  Part="1" 
F 0 "R307" V 3700 1500 50  0000 C CNN
F 1 "100" V 3600 1500 50  0000 C CNN
F 2 "Resistor_SMD:R_1206_3216Metric_Pad1.42x1.75mm_HandSolder" V 3530 1500 50  0001 C CNN
F 3 "~" H 3600 1500 50  0001 C CNN
	1    3600 1500
	0    -1   -1   0   
$EndComp
Wire Wire Line
	3750 1500 3800 1500
$Comp
L Device:R R315
U 1 1 5DF6DACE
P 4900 1750
AR Path="/5D7E2920/5DF6DACE" Ref="R315"  Part="1" 
AR Path="/5DAD577F/5DF6DACE" Ref="R?"  Part="1" 
F 0 "R315" V 4800 1750 50  0000 C CNN
F 1 "10k" V 4900 1750 50  0000 C CNN
F 2 "Resistor_SMD:R_1206_3216Metric_Pad1.42x1.75mm_HandSolder" V 4830 1750 50  0001 C CNN
F 3 "~" H 4900 1750 50  0001 C CNN
	1    4900 1750
	-1   0    0    1   
$EndComp
$Comp
L Device:R R314
U 1 1 5DF6DACD
P 4900 1250
AR Path="/5D7E2920/5DF6DACD" Ref="R314"  Part="1" 
AR Path="/5DAD577F/5DF6DACD" Ref="R?"  Part="1" 
F 0 "R314" V 4800 1250 50  0000 C CNN
F 1 "100k" V 4900 1250 50  0000 C CNN
F 2 "Resistor_SMD:R_1206_3216Metric_Pad1.42x1.75mm_HandSolder" V 4830 1250 50  0001 C CNN
F 3 "~" H 4900 1250 50  0001 C CNN
	1    4900 1250
	-1   0    0    1   
$EndComp
Wire Wire Line
	3800 1100 3800 1500
Wire Wire Line
	3800 1100 3950 1100
Wire Wire Line
	4450 1400 4450 1100
Wire Wire Line
	4400 1400 4450 1400
Wire Wire Line
	3350 1850 3350 2000
Wire Wire Line
	3350 1500 3350 1650
Wire Notes Line
	2400 2250 5050 2250
Wire Wire Line
	5450 3550 5450 4600
$Comp
L battery_tester-rescue:AD8630-michal_lib U?
U 5 1 5D85CC63
P 2200 3050
AR Path="/5D85CC63" Ref="U?"  Part="5" 
AR Path="/5D7E2920/5D85CC63" Ref="U302"  Part="5" 
AR Path="/5DAD577F/5D85CC63" Ref="U?"  Part="5" 
F 0 "U302" H 2158 3096 50  0001 L CNN
F 1 "MCP6V74-E" H 2158 3050 50  0001 L CNN
F 2 "Package_SO:TSSOP-14_4.4x5mm_P0.65mm" H 2150 3150 50  0001 C CNN
F 3 "http://www.ti.com/lit/ds/symlink/tl081.pdf" H 2250 3250 50  0001 C CNN
	5    2200 3050
	1    0    0    -1  
$EndComp
Connection ~ 2100 2750
Wire Wire Line
	2250 2750 2100 2750
$Comp
L battery_tester-rescue:AD8630-michal_lib U?
U 1 1 5D85CC62
P 2100 3050
AR Path="/5D85CC62" Ref="U?"  Part="1" 
AR Path="/5D7E2920/5D85CC62" Ref="U302"  Part="1" 
AR Path="/5DAD577F/5D85CC62" Ref="U?"  Part="1" 
F 0 "U302" H 1800 3500 50  0000 C CNN
F 1 "MCP6V74-E" H 1800 3400 50  0000 C CNN
F 2 "Package_SO:TSSOP-14_4.4x5mm_P0.65mm" H 2050 3150 50  0001 C CNN
F 3 "http://www.ti.com/lit/ds/symlink/tl081.pdf" H 2150 3250 50  0001 C CNN
	1    2100 3050
	1    0    0    -1  
$EndComp
$Comp
L battery_tester-rescue:AD8630-michal_lib U?
U 2 1 5D85CC66
P 4450 3150
AR Path="/5D85CC66" Ref="U?"  Part="2" 
AR Path="/5D7E2920/5D85CC66" Ref="U302"  Part="2" 
AR Path="/5DAD577F/5D85CC66" Ref="U?"  Part="2" 
F 0 "U302" H 4450 3517 50  0000 C CNN
F 1 "MCP6V74-E" H 4450 3426 50  0000 C CNN
F 2 "Package_SO:TSSOP-14_4.4x5mm_P0.65mm" H 4400 3250 50  0001 C CNN
F 3 "http://www.ti.com/lit/ds/symlink/tl081.pdf" H 4500 3350 50  0001 C CNN
	2    4450 3150
	1    0    0    -1  
$EndComp
Wire Wire Line
	3600 3050 4000 3050
$Comp
L Device:R R306
U 1 1 5E781D5B
P 3450 3050
AR Path="/5D7E2920/5E781D5B" Ref="R306"  Part="1" 
AR Path="/5DAD577F/5E781D5B" Ref="R?"  Part="1" 
F 0 "R306" V 3350 3050 50  0000 C CNN
F 1 "1k" V 3450 3050 50  0000 C CNN
F 2 "Resistor_SMD:R_1206_3216Metric_Pad1.42x1.75mm_HandSolder" V 3380 3050 50  0001 C CNN
F 3 "~" H 3450 3050 50  0001 C CNN
	1    3450 3050
	0    1    1    0   
$EndComp
Wire Wire Line
	2100 2550 2100 2750
Connection ~ 2100 2550
Wire Wire Line
	2250 2550 2100 2550
Wire Wire Line
	2650 2550 2450 2550
Wire Wire Line
	2650 2750 2650 2550
$Comp
L Device:CP_Small C301
U 1 1 5D85CC6B
P 2350 2550
AR Path="/5D7E2920/5D85CC6B" Ref="C301"  Part="1" 
AR Path="/5DAD577F/5D85CC6B" Ref="C?"  Part="1" 
F 0 "C301" V 2500 2400 50  0000 C CNN
F 1 "10uF" V 2400 2400 50  0000 C CNN
F 2 "Capacitor_SMD:CP_Elec_4x3.9" H 2350 2550 50  0001 C CNN
F 3 "~" H 2350 2550 50  0001 C CNN
	1    2350 2550
	0    -1   -1   0   
$EndComp
Wire Wire Line
	4050 3450 4050 3250
Connection ~ 4050 3450
Wire Wire Line
	4250 3450 4050 3450
Wire Wire Line
	5000 3450 5000 3150
Wire Wire Line
	4950 3450 5000 3450
Wire Wire Line
	4550 3450 4650 3450
$Comp
L Device:R R312
U 1 1 5DF6DAE1
P 4400 3450
AR Path="/5D7E2920/5DF6DAE1" Ref="R312"  Part="1" 
AR Path="/5DAD577F/5DF6DAE1" Ref="R?"  Part="1" 
F 0 "R312" V 4300 3450 50  0000 C CNN
F 1 "1k" V 4400 3450 50  0000 C CNN
F 2 "Resistor_SMD:R_1206_3216Metric_Pad1.42x1.75mm_HandSolder" V 4330 3450 50  0001 C CNN
F 3 "~" H 4400 3450 50  0001 C CNN
	1    4400 3450
	0    1    1    0   
$EndComp
$Comp
L Device:C C304
U 1 1 5DF6DAE0
P 4800 3450
AR Path="/5D7E2920/5DF6DAE0" Ref="C304"  Part="1" 
AR Path="/5DAD577F/5DF6DAE0" Ref="C?"  Part="1" 
F 0 "C304" V 4950 3350 50  0000 L CNN
F 1 "1nF" V 4650 3400 50  0000 L CNN
F 2 "Capacitor_SMD:C_1206_3216Metric_Pad1.42x1.75mm_HandSolder" H 4838 3300 50  0001 C CNN
F 3 "~" H 4800 3450 50  0001 C CNN
	1    4800 3450
	0    1    -1   0   
$EndComp
Wire Wire Line
	4750 3150 5000 3150
$Comp
L Device:C_Small C302
U 1 1 5DF6DADE
P 2350 2750
AR Path="/5D7E2920/5DF6DADE" Ref="C302"  Part="1" 
AR Path="/5DAD577F/5DF6DADE" Ref="C?"  Part="1" 
F 0 "C302" V 2300 2900 50  0000 C CNN
F 1 "100nF" V 2400 2900 50  0000 C CNN
F 2 "Capacitor_SMD:C_1206_3216Metric_Pad1.42x1.75mm_HandSolder" H 2350 2750 50  0001 C CNN
F 3 "~" H 2350 2750 50  0001 C CNN
	1    2350 2750
	0    1    1    0   
$EndComp
Wire Wire Line
	2450 2750 2650 2750
Wire Wire Line
	2100 2450 2100 2550
Connection ~ 5000 3150
$Comp
L Connector:TestPoint_Alt TP302
U 1 1 5DF6DADC
P 4000 3050
AR Path="/5D7E2920/5DF6DADC" Ref="TP302"  Part="1" 
AR Path="/5DAD577F/5DF6DADC" Ref="TP?"  Part="1" 
F 0 "TP302" H 4150 3250 50  0000 L CNN
F 1 "drive" H 4100 3150 50  0000 L CNN
F 2 "TestPoint:TestPoint_Pad_2.5x2.5mm" H 4200 3050 50  0001 C CNN
F 3 "~" H 4200 3050 50  0001 C CNN
	1    4000 3050
	-1   0    0    -1  
$EndComp
Wire Wire Line
	1800 3150 1750 3150
Wire Wire Line
	4050 3250 4150 3250
Wire Wire Line
	2400 3050 2500 3050
Wire Wire Line
	1750 3150 1750 3600
Wire Wire Line
	2500 3600 2500 3050
Wire Wire Line
	5000 3150 5450 3150
Wire Wire Line
	5450 2450 5450 3150
Wire Wire Line
	5450 3150 5450 3550
Connection ~ 5450 3150
Wire Wire Line
	2650 2550 2750 2550
Connection ~ 2650 2550
Text HLabel 10650 1500 2    50   Input ~ 0
load_mosfet
Text HLabel 1350 2950 0    50   Input ~ 0
load_dac
Wire Wire Line
	1350 2950 1800 2950
$Comp
L battery_tester-rescue:AD8630-michal_lib U?
U 3 1 5D85CC67
P 7150 5850
AR Path="/5D85CC67" Ref="U?"  Part="3" 
AR Path="/5D7E2920/5D85CC67" Ref="U302"  Part="3" 
AR Path="/5DAD577F/5D85CC67" Ref="U?"  Part="3" 
F 0 "U302" H 7150 6217 50  0000 C CNN
F 1 "MCP6V74-E" H 7150 6126 50  0000 C CNN
F 2 "Package_SO:TSSOP-14_4.4x5mm_P0.65mm" H 7100 5950 50  0001 C CNN
F 3 "http://www.ti.com/lit/ds/symlink/tl081.pdf" H 7200 6050 50  0001 C CNN
	3    7150 5850
	-1   0    0    1   
$EndComp
Wire Wire Line
	6850 5550 6850 5850
$Comp
L Device:R R320
U 1 1 5D85CC5A
P 6700 5850
AR Path="/5D7E2920/5D85CC5A" Ref="R320"  Part="1" 
AR Path="/5DAD577F/5D85CC5A" Ref="R?"  Part="1" 
F 0 "R320" V 6600 5850 50  0000 C CNN
F 1 "100R" V 6700 5850 50  0000 C CNN
F 2 "Resistor_SMD:R_1206_3216Metric_Pad1.42x1.75mm_HandSolder" V 6630 5850 50  0001 C CNN
F 3 "~" H 6700 5850 50  0001 C CNN
	1    6700 5850
	0    1    1    0   
$EndComp
Connection ~ 6850 5850
Wire Wire Line
	6550 5950 6550 5850
$Comp
L Device:R R308
U 1 1 5D85CC5D
P 3650 3450
AR Path="/5D7E2920/5D85CC5D" Ref="R308"  Part="1" 
AR Path="/5DAD577F/5D85CC5D" Ref="R?"  Part="1" 
F 0 "R308" V 3550 3450 50  0000 C CNN
F 1 "10k" V 3650 3450 50  0000 C CNN
F 2 "Resistor_SMD:R_1206_3216Metric_Pad1.42x1.75mm_HandSolder" V 3580 3450 50  0001 C CNN
F 3 "~" H 3650 3450 50  0001 C CNN
	1    3650 3450
	0    1    1    0   
$EndComp
Wire Notes Line width 8
	5950 5400 8350 5400
Wire Wire Line
	3450 4600 3600 4600
Wire Wire Line
	4150 4600 4150 5000
Wire Wire Line
	3900 4600 4150 4600
Connection ~ 3900 5550
Wire Wire Line
	3900 5550 3900 5400
$Comp
L Device:R R309
U 1 1 5FEA82DA
P 3750 4600
AR Path="/5D7E2920/5FEA82DA" Ref="R309"  Part="1" 
AR Path="/5DAD577F/5FEA82DA" Ref="R?"  Part="1" 
F 0 "R309" V 3650 4600 50  0000 C CNN
F 1 "500k" V 3750 4600 50  0000 C CNN
F 2 "Resistor_SMD:R_1206_3216Metric_Pad1.42x1.75mm_HandSolder" V 3680 4600 50  0001 C CNN
F 3 "~" H 3750 4600 50  0001 C CNN
	1    3750 4600
	0    -1   -1   0   
$EndComp
Wire Wire Line
	4350 5550 3900 5550
$Comp
L power:GND #PWR0310
U 1 1 5D85CC9A
P 3900 5550
AR Path="/5D7E2920/5D85CC9A" Ref="#PWR0310"  Part="1" 
AR Path="/5DAD577F/5D85CC9A" Ref="#PWR?"  Part="1" 
F 0 "#PWR0310" H 3900 5300 50  0001 C CNN
F 1 "GND" H 3905 5377 50  0000 C CNN
F 2 "" H 3900 5550 50  0001 C CNN
F 3 "" H 3900 5550 50  0001 C CNN
	1    3900 5550
	-1   0    0    -1  
$EndComp
$Comp
L power:+5V #PWR0309
U 1 1 5D85CC99
P 3900 4800
AR Path="/5D7E2920/5D85CC99" Ref="#PWR0309"  Part="1" 
AR Path="/5DAD577F/5D85CC99" Ref="#PWR?"  Part="1" 
F 0 "#PWR0309" H 3900 4650 50  0001 C CNN
F 1 "+5V" H 4000 4800 50  0000 C CNN
F 2 "" H 3900 4800 50  0001 C CNN
F 3 "" H 3900 4800 50  0001 C CNN
	1    3900 4800
	-1   0    0    -1  
$EndComp
Connection ~ 4350 5250
Wire Wire Line
	4150 5000 4200 5000
Connection ~ 4150 5000
Wire Wire Line
	4150 5250 4350 5250
Wire Wire Line
	4150 5000 4150 5250
$Comp
L Device:R_POT RV301
U 1 1 5DF6DB1A
P 4350 5000
AR Path="/5D7E2920/5DF6DB1A" Ref="RV301"  Part="1" 
AR Path="/5DAD577F/5DF6DB1A" Ref="RV?"  Part="1" 
F 0 "RV301" H 4550 5150 50  0000 R CNN
F 1 "10k" V 4350 5050 50  0000 R CNN
F 2 "Potentiometer_THT:Potentiometer_Bourns_3296W_Vertical" H 4350 5000 50  0001 C CNN
F 3 "~" H 4350 5000 50  0001 C CNN
	1    4350 5000
	-1   0    0    -1  
$EndComp
Wire Wire Line
	4100 5000 4150 5000
Wire Wire Line
	4350 5150 4350 5250
$Comp
L Device:R R311
U 1 1 5D85CC98
P 4350 5400
AR Path="/5D7E2920/5D85CC98" Ref="R311"  Part="1" 
AR Path="/5DAD577F/5D85CC98" Ref="R?"  Part="1" 
F 0 "R311" V 4250 5400 50  0000 C CNN
F 1 "20k" V 4350 5400 50  0000 C CNN
F 2 "Resistor_SMD:R_1206_3216Metric_Pad1.42x1.75mm_HandSolder" V 4280 5400 50  0001 C CNN
F 3 "~" H 4350 5400 50  0001 C CNN
	1    4350 5400
	-1   0    0    1   
$EndComp
Wire Wire Line
	3500 5100 3450 5100
$Comp
L Switch:SW_Push SW301
U 1 1 5DF6DB0D
P 1600 4900
AR Path="/5D7E2920/5DF6DB0D" Ref="SW301"  Part="1" 
AR Path="/5DAD577F/5DF6DB0D" Ref="SW?"  Part="1" 
F 0 "SW301" H 1650 5250 50  0000 C CNN
F 1 "SW_Push" H 1650 5150 50  0000 C CNN
F 2 "Button_Switch_THT:SW_PUSH_6mm_H4.3mm" H 1600 5100 50  0001 C CNN
F 3 "~" H 1600 5100 50  0001 C CNN
	1    1600 4900
	1    0    0    -1  
$EndComp
$Comp
L Device:R R301
U 1 1 5DF6DB12
P 1250 4900
AR Path="/5D7E2920/5DF6DB12" Ref="R301"  Part="1" 
AR Path="/5DAD577F/5DF6DB12" Ref="R?"  Part="1" 
F 0 "R301" V 1150 4900 50  0000 C CNN
F 1 "1k" V 1250 4900 50  0000 C CNN
F 2 "Resistor_SMD:R_1206_3216Metric_Pad1.42x1.75mm_HandSolder" V 1180 4900 50  0001 C CNN
F 3 "~" H 1250 4900 50  0001 C CNN
	1    1250 4900
	0    1    1    0   
$EndComp
$Comp
L Device:R R304
U 1 1 5D85CC85
P 2550 5100
AR Path="/5D7E2920/5D85CC85" Ref="R304"  Part="1" 
AR Path="/5DAD577F/5D85CC85" Ref="R?"  Part="1" 
F 0 "R304" V 2450 5100 50  0000 C CNN
F 1 "1k" V 2550 5100 50  0000 C CNN
F 2 "Resistor_SMD:R_1206_3216Metric_Pad1.42x1.75mm_HandSolder" V 2480 5100 50  0001 C CNN
F 3 "~" H 2550 5100 50  0001 C CNN
	1    2550 5100
	0    -1   -1   0   
$EndComp
$Comp
L power:+5V #PWR0303
U 1 1 5F2A1F1A
P 1950 5600
AR Path="/5D7E2920/5F2A1F1A" Ref="#PWR0303"  Part="1" 
AR Path="/5DAD577F/5F2A1F1A" Ref="#PWR?"  Part="1" 
F 0 "#PWR0303" H 1950 5450 50  0001 C CNN
F 1 "+5V" H 1965 5773 50  0000 C CNN
F 2 "" H 1950 5600 50  0001 C CNN
F 3 "" H 1950 5600 50  0001 C CNN
	1    1950 5600
	-1   0    0    -1  
$EndComp
Text Notes 950  6550 0    50   ~ 10
hardware overcurrent protection\n
Wire Wire Line
	6550 5850 6500 5850
Connection ~ 6550 5850
Connection ~ 7750 3200
Wire Wire Line
	7750 3200 8450 3200
Wire Wire Line
	7450 3200 7750 3200
Connection ~ 6700 1800
Connection ~ 8450 3200
Connection ~ 8250 3350
Wire Wire Line
	6700 1800 6600 1800
Wire Wire Line
	6750 1800 6700 1800
$Comp
L battery_tester-rescue:AD8630-michal_lib U?
U 4 1 5DF6DABC
P 6150 2550
AR Path="/5DF6DABC" Ref="U?"  Part="3" 
AR Path="/5D7E2920/5DF6DABC" Ref="U304"  Part="4" 
AR Path="/5DAD577F/5DF6DABC" Ref="U?"  Part="3" 
F 0 "U304" H 6150 2917 50  0000 C CNN
F 1 "MCP6V74-E" H 6150 2826 50  0000 C CNN
F 2 "Package_SO:TSSOP-14_4.4x5mm_P0.65mm" H 6100 2650 50  0001 C CNN
F 3 "http://www.ti.com/lit/ds/symlink/tl081.pdf" H 6200 2750 50  0001 C CNN
	4    6150 2550
	1    0    0    -1  
$EndComp
Wire Wire Line
	6600 2550 6750 2550
$Comp
L Device:R R336
U 1 1 5D85CCA1
P 7750 2000
AR Path="/5D7E2920/5D85CCA1" Ref="R336"  Part="1" 
AR Path="/5DAD577F/5D85CCA1" Ref="R?"  Part="1" 
F 0 "R336" V 7850 2000 50  0000 C CNN
F 1 "0R1" V 7750 2000 50  0000 C CNN
F 2 "Resistor_THT:R_Axial_DIN0617_L17.0mm_D6.0mm_P20.32mm_Horizontal" V 7680 2000 50  0001 C CNN
F 3 "~" H 7750 2000 50  0001 C CNN
	1    7750 2000
	-1   0    0    1   
$EndComp
Wire Wire Line
	7750 2150 8450 2150
Connection ~ 7750 2150
$Comp
L Device:R R337
U 1 1 603BFC4C
P 7750 3050
AR Path="/5D7E2920/603BFC4C" Ref="R337"  Part="1" 
AR Path="/5DAD577F/603BFC4C" Ref="R?"  Part="1" 
F 0 "R337" V 7850 3050 50  0000 C CNN
F 1 "0R1" V 7750 3050 50  0000 C CNN
F 2 "Resistor_THT:R_Axial_DIN0617_L17.0mm_D6.0mm_P20.32mm_Horizontal" V 7680 3050 50  0001 C CNN
F 3 "~" H 7750 3050 50  0001 C CNN
	1    7750 3050
	-1   0    0    1   
$EndComp
Wire Wire Line
	7450 2150 7750 2150
Wire Wire Line
	8250 1300 8250 2250
Wire Wire Line
	6600 2850 6750 2850
Connection ~ 6600 2850
Connection ~ 6600 2550
$Comp
L Device:C C309
U 1 1 5E839B4D
P 6600 2700
AR Path="/5D7E2920/5E839B4D" Ref="C309"  Part="1" 
AR Path="/5DAD577F/5E839B4D" Ref="C?"  Part="1" 
F 0 "C309" H 6750 2700 50  0000 L CNN
F 1 "1.5nF" H 6650 2600 50  0000 L CNN
F 2 "Capacitor_SMD:C_1206_3216Metric_Pad1.42x1.75mm_HandSolder" H 6638 2550 50  0001 C CNN
F 3 "~" H 6600 2700 50  0001 C CNN
	1    6600 2700
	-1   0    0    -1  
$EndComp
Text Notes 7800 3100 0    50   ~ 0
3w
Text Notes 7800 2050 0    50   ~ 0
3w
Wire Wire Line
	8450 2150 8450 3200
$Comp
L Device:R R331
U 1 1 5D0D9572
P 7450 3050
AR Path="/5D7E2920/5D0D9572" Ref="R331"  Part="1" 
AR Path="/5DAD577F/5D0D9572" Ref="R?"  Part="1" 
F 0 "R331" V 7550 3050 50  0000 C CNN
F 1 "1M" V 7450 3050 50  0000 C CNN
F 2 "Resistor_SMD:R_1206_3216Metric_Pad1.42x1.75mm_HandSolder" V 7380 3050 50  0001 C CNN
F 3 "~" H 7450 3050 50  0001 C CNN
	1    7450 3050
	-1   0    0    1   
$EndComp
Wire Wire Line
	8250 2250 8250 3350
Connection ~ 8250 2250
Wire Wire Line
	7750 2250 8250 2250
Wire Wire Line
	7750 2350 7750 2250
Wire Wire Line
	5850 2850 6600 2850
Connection ~ 7450 2550
Wire Wire Line
	6450 2550 6600 2550
$Comp
L Device:R R323
U 1 1 5D85CC42
P 6900 2550
AR Path="/5D7E2920/5D85CC42" Ref="R323"  Part="1" 
AR Path="/5DAD577F/5D85CC42" Ref="R?"  Part="1" 
F 0 "R323" V 6800 2550 50  0000 C CNN
F 1 "1k" V 6900 2550 50  0000 C CNN
F 2 "Resistor_SMD:R_1206_3216Metric_Pad1.42x1.75mm_HandSolder" V 6830 2550 50  0001 C CNN
F 3 "~" H 6900 2550 50  0001 C CNN
	1    6900 2550
	0    1    1    0   
$EndComp
Wire Wire Line
	7450 2550 7050 2550
$Comp
L Device:R R324
U 1 1 5D85CC41
P 6900 2850
AR Path="/5D7E2920/5D85CC41" Ref="R324"  Part="1" 
AR Path="/5DAD577F/5D85CC41" Ref="R?"  Part="1" 
F 0 "R324" V 6800 2850 50  0000 C CNN
F 1 "10k" V 6900 2850 50  0000 C CNN
F 2 "Resistor_SMD:R_1206_3216Metric_Pad1.42x1.75mm_HandSolder" V 6830 2850 50  0001 C CNN
F 3 "~" H 6900 2850 50  0001 C CNN
	1    6900 2850
	0    1    1    0   
$EndComp
Wire Wire Line
	7750 2850 7750 2900
Connection ~ 7750 2850
Wire Wire Line
	7750 2850 7050 2850
Wire Wire Line
	7450 2900 7450 2550
Wire Wire Line
	7750 2750 7750 2850
Wire Wire Line
	6700 1800 6700 2100
Wire Wire Line
	6700 2100 5850 2100
$Comp
L Device:R R330
U 1 1 5D85CC3D
P 7450 2000
AR Path="/5D7E2920/5D85CC3D" Ref="R330"  Part="1" 
AR Path="/5DAD577F/5D85CC3D" Ref="R?"  Part="1" 
F 0 "R330" V 7550 2000 50  0000 C CNN
F 1 "1M" V 7450 2000 50  0000 C CNN
F 2 "Resistor_SMD:R_1206_3216Metric_Pad1.42x1.75mm_HandSolder" V 7380 2000 50  0001 C CNN
F 3 "~" H 7450 2000 50  0001 C CNN
	1    7450 2000
	-1   0    0    1   
$EndComp
$Comp
L Transistor_FET:IRF740 Q304
U 1 1 5DF6DABD
P 7650 2550
AR Path="/5D7E2920/5DF6DABD" Ref="Q304"  Part="1" 
AR Path="/5DAD577F/5DF6DABD" Ref="Q?"  Part="1" 
F 0 "Q304" H 7856 2596 50  0000 L CNN
F 1 "PSMN015-100P" H 7856 2505 50  0000 L CNN
F 2 "Package_TO_SOT_THT:TO-220-3_Horizontal_TabUp" H 7900 2475 50  0001 L CIN
F 3 "http://www.vishay.com/docs/91054/91054.pdf" H 7650 2550 50  0001 L CNN
	1    7650 2550
	1    0    0    1   
$EndComp
Text Label 8450 5350 1    50   ~ 0
c_sens
Text Label 3300 3450 2    50   ~ 0
c_sens
Wire Wire Line
	4050 3450 3800 3450
Wire Wire Line
	3500 3450 3300 3450
$Comp
L power:+3.3V #PWR0312
U 1 1 61996614
P 4350 4750
F 0 "#PWR0312" H 4350 4600 50  0001 C CNN
F 1 "+3.3V" H 4365 4923 50  0000 C CNN
F 2 "" H 4350 4750 50  0001 C CNN
F 3 "" H 4350 4750 50  0001 C CNN
	1    4350 4750
	1    0    0    -1  
$EndComp
Wire Wire Line
	4350 4750 4350 4850
$Comp
L Device:R R313
U 1 1 5D85CC96
P 4600 5200
AR Path="/5D7E2920/5D85CC96" Ref="R313"  Part="1" 
AR Path="/5DAD577F/5D85CC96" Ref="R?"  Part="1" 
F 0 "R313" V 4500 5200 50  0000 C CNN
F 1 "1k" V 4600 5200 50  0000 C CNN
F 2 "Resistor_SMD:R_1206_3216Metric_Pad1.42x1.75mm_HandSolder" V 4530 5200 50  0001 C CNN
F 3 "~" H 4600 5200 50  0001 C CNN
	1    4600 5200
	0    -1   -1   0   
$EndComp
Wire Wire Line
	4100 5200 4450 5200
Text Label 4800 5200 0    50   ~ 0
c_sens
Wire Wire Line
	4800 5200 4750 5200
Wire Wire Line
	1750 3600 2500 3600
Connection ~ 2500 3050
Wire Wire Line
	2500 3050 3300 3050
Connection ~ 4000 3050
Wire Wire Line
	4000 3050 4150 3050
$Comp
L Connector:TestPoint_Alt TP301
U 1 1 61AD3BBB
P 3350 1500
AR Path="/5D7E2920/61AD3BBB" Ref="TP301"  Part="1" 
AR Path="/5DAD577F/61AD3BBB" Ref="TP?"  Part="1" 
F 0 "TP301" H 3500 1700 50  0000 L CNN
F 1 "load_v" H 3450 1600 50  0000 L CNN
F 2 "TestPoint:TestPoint_Pad_2.5x2.5mm" H 3550 1500 50  0001 C CNN
F 3 "~" H 3550 1500 50  0001 C CNN
	1    3350 1500
	-1   0    0    -1  
$EndComp
Wire Notes Line width 8
	5950 6500 8350 6500
Wire Notes Line width 8
	5950 5400 5950 6500
$Comp
L Device:R R335
U 1 1 5DEFBC8E
P 7700 5550
AR Path="/5D7E2920/5DEFBC8E" Ref="R335"  Part="1" 
AR Path="/5DAD577F/5DEFBC8E" Ref="R?"  Part="1" 
F 0 "R335" V 7700 5550 50  0000 C CNN
F 1 "10k  0.5%" V 7600 5600 50  0000 C CNN
F 2 "Resistor_SMD:R_1206_3216Metric_Pad1.42x1.75mm_HandSolder" V 7630 5550 50  0001 C CNN
F 3 "~" H 7700 5550 50  0001 C CNN
	1    7700 5550
	0    1    1    0   
$EndComp
Wire Wire Line
	7900 5550 7850 5550
Wire Notes Line width 8
	950  4500 950  6600
$Comp
L power:+5V #PWR0301
U 1 1 5E40CB35
P 1050 4800
AR Path="/5D7E2920/5E40CB35" Ref="#PWR0301"  Part="1" 
AR Path="/5DAD577F/5E40CB35" Ref="#PWR?"  Part="1" 
F 0 "#PWR0301" H 1050 4650 50  0001 C CNN
F 1 "+5V" H 1065 4973 50  0000 C CNN
F 2 "" H 1050 4800 50  0001 C CNN
F 3 "" H 1050 4800 50  0001 C CNN
	1    1050 4800
	-1   0    0    -1  
$EndComp
Wire Wire Line
	1050 5250 1050 4900
$Comp
L Amplifier_Operational:MCP601-xP U303
U 1 1 5D85CC95
P 3800 5100
AR Path="/5D7E2920/5D85CC95" Ref="U303"  Part="1" 
AR Path="/5DAD577F/5D85CC95" Ref="U?"  Part="1" 
F 0 "U303" H 4000 4850 50  0000 C CNN
F 1 "MCP601-xP" H 4000 4950 50  0000 C CNN
F 2 "Package_SO:SO-8_3.9x4.9mm_P1.27mm" H 3700 4900 50  0001 L CNN
F 3 "http://ww1.microchip.com/downloads/en/DeviceDoc/21314g.pdf" H 3950 5250 50  0001 C CNN
	1    3800 5100
	-1   0    0    -1  
$EndComp
Connection ~ 1800 5950
$Comp
L Transistor_FET:2N7002 Q301
U 1 1 5D85CCAA
P 2450 5700
AR Path="/5D7E2920/5D85CCAA" Ref="Q301"  Part="1" 
AR Path="/5DAD577F/5D85CCAA" Ref="Q?"  Part="1" 
F 0 "Q301" H 2400 5400 50  0000 L CNN
F 1 "2N7002" H 2350 5300 50  0000 L CNN
F 2 "Package_TO_SOT_SMD:SOT-23" H 2650 5625 50  0001 L CIN
F 3 "https://www.fairchildsemi.com/datasheets/2N/2N7002.pdf" H 2450 5700 50  0001 L CNN
	1    2450 5700
	1    0    0    -1  
$EndComp
$Comp
L Device:R R302
U 1 1 5D85CC8B
P 2150 5550
AR Path="/5D7E2920/5D85CC8B" Ref="R302"  Part="1" 
AR Path="/5DAD577F/5D85CC8B" Ref="R?"  Part="1" 
F 0 "R302" V 2050 5550 50  0000 C CNN
F 1 "1k" V 2150 5550 50  0000 C CNN
F 2 "Resistor_SMD:R_0805_2012Metric" V 2080 5550 50  0001 C CNN
F 3 "~" H 2150 5550 50  0001 C CNN
	1    2150 5550
	-1   0    0    1   
$EndComp
Wire Wire Line
	2550 5900 2550 5950
Wire Wire Line
	2550 5950 1800 5950
$Comp
L Device:LED D301
U 1 1 5DF6DB0A
P 3150 5850
AR Path="/5D7E2920/5DF6DB0A" Ref="D301"  Part="1" 
AR Path="/5DAD577F/5DF6DB0A" Ref="D?"  Part="1" 
F 0 "D301" V 3189 5733 50  0000 R CNN
F 1 "LED" V 3098 5733 50  0000 R CNN
F 2 "Diode_SMD:D_1206_3216Metric_Pad1.42x1.75mm_HandSolder" H 3150 5850 50  0001 C CNN
F 3 "~" H 3150 5850 50  0001 C CNN
	1    3150 5850
	0    -1   -1   0   
$EndComp
Wire Wire Line
	2550 5450 2550 5500
Connection ~ 3450 5100
Wire Wire Line
	3450 4600 3450 5100
Wire Wire Line
	1800 5950 1800 6200
Wire Wire Line
	2150 5350 2150 5400
NoConn ~ 1150 5950
Wire Wire Line
	1800 5950 1750 5950
NoConn ~ 1750 5850
NoConn ~ 1750 5750
Wire Wire Line
	1750 5350 2050 5350
Wire Wire Line
	1050 5250 1150 5250
NoConn ~ 1150 5350
NoConn ~ 1150 5450
NoConn ~ 1150 5650
NoConn ~ 1150 5750
NoConn ~ 1150 5850
NoConn ~ 1750 5250
$Comp
L battery_tester-rescue:MC14043B-michal_lib U?
U 1 1 5D85CC84
P 1450 5550
AR Path="/5D85CC84" Ref="U?"  Part="1" 
AR Path="/5D7E2920/5D85CC84" Ref="U301"  Part="1" 
AR Path="/5DAD577F/5D85CC84" Ref="U?"  Part="1" 
F 0 "U301" H 1450 6075 50  0000 C CNN
F 1 "MC14043B" H 1450 5984 50  0000 C CNN
F 2 "Package_SO:SOIC-16_3.9x9.9mm_P1.27mm" H 1450 6000 50  0001 C CNN
F 3 "" H 1450 6000 50  0001 C CNN
	1    1450 5550
	-1   0    0    -1  
$EndComp
Wire Wire Line
	1750 5550 1850 5550
Wire Wire Line
	1850 5550 1850 5100
Wire Wire Line
	1950 5600 1950 5650
Wire Wire Line
	1950 5650 1750 5650
Wire Wire Line
	1850 5100 2400 5100
Wire Wire Line
	2700 5100 3450 5100
Wire Wire Line
	1100 4900 1050 4900
Connection ~ 1050 4900
Wire Wire Line
	1050 4900 1050 4800
Wire Wire Line
	1800 4900 1800 5450
Wire Wire Line
	1800 5450 1750 5450
Text Label 2500 3050 0    50   ~ 0
buffered_dac
Wire Wire Line
	2150 5700 2250 5700
Wire Notes Line width 8
	5150 6600 950  6600
Wire Notes Line width 8
	5150 4500 5150 6600
Wire Notes Line width 8
	950  4500 5150 4500
Text Label 2550 5450 0    50   ~ 0
buffered_dac
$Comp
L Device:R R305
U 1 1 5DF6DB07
P 3150 5550
AR Path="/5D7E2920/5DF6DB07" Ref="R305"  Part="1" 
AR Path="/5DAD577F/5DF6DB07" Ref="R?"  Part="1" 
F 0 "R305" V 3050 5550 50  0000 C CNN
F 1 "220" V 3150 5550 50  0000 C CNN
F 2 "Resistor_SMD:R_0805_2012Metric" V 3080 5550 50  0001 C CNN
F 3 "~" H 3150 5550 50  0001 C CNN
	1    3150 5550
	-1   0    0    1   
$EndComp
$Comp
L power:+5V #PWR0307
U 1 1 5E7ADEAD
P 3150 5400
AR Path="/5D7E2920/5E7ADEAD" Ref="#PWR0307"  Part="1" 
AR Path="/5DAD577F/5E7ADEAD" Ref="#PWR?"  Part="1" 
F 0 "#PWR0307" H 3150 5250 50  0001 C CNN
F 1 "+5V" H 3165 5573 50  0000 C CNN
F 2 "" H 3150 5400 50  0001 C CNN
F 3 "" H 3150 5400 50  0001 C CNN
	1    3150 5400
	-1   0    0    -1  
$EndComp
Wire Wire Line
	2850 6200 2400 6200
$Comp
L Transistor_BJT:BC817 Q302
U 1 1 5E7E2C00
P 3050 6200
F 0 "Q302" H 3241 6246 50  0000 L CNN
F 1 "BC817" H 3241 6155 50  0000 L CNN
F 2 "Package_TO_SOT_SMD:SOT-23" H 3250 6125 50  0001 L CIN
F 3 "http://www.fairchildsemi.com/ds/BC/BC817.pdf" H 3050 6200 50  0001 L CNN
	1    3050 6200
	1    0    0    -1  
$EndComp
Connection ~ 2050 5350
Wire Wire Line
	2050 5350 2150 5350
Wire Wire Line
	2050 5350 2050 6200
$Comp
L Device:R R303
U 1 1 5E834C54
P 2250 6200
AR Path="/5D7E2920/5E834C54" Ref="R303"  Part="1" 
AR Path="/5DAD577F/5E834C54" Ref="R?"  Part="1" 
F 0 "R303" V 2150 6200 50  0000 C CNN
F 1 "2.2k" V 2250 6200 50  0000 C CNN
F 2 "Resistor_SMD:R_1206_3216Metric_Pad1.42x1.75mm_HandSolder" V 2180 6200 50  0001 C CNN
F 3 "~" H 2250 6200 50  0001 C CNN
	1    2250 6200
	0    -1   -1   0   
$EndComp
Wire Wire Line
	2100 6200 2050 6200
Wire Wire Line
	4900 1400 4900 1600
Connection ~ 4900 1600
$Comp
L power:GNDA #PWR0143
U 1 1 5F18AC58
P 4150 2000
F 0 "#PWR0143" H 4150 1750 50  0001 C CNN
F 1 "GNDA" H 4155 1827 50  0000 C CNN
F 2 "" H 4150 2000 50  0001 C CNN
F 3 "" H 4150 2000 50  0001 C CNN
	1    4150 2000
	1    0    0    -1  
$EndComp
Wire Wire Line
	3350 2000 4150 2000
Connection ~ 4150 2000
Wire Wire Line
	4150 2000 4650 2000
$Comp
L power:GNDA #PWR0144
U 1 1 5F18B404
P 2100 3350
F 0 "#PWR0144" H 2100 3100 50  0001 C CNN
F 1 "GNDA" H 2105 3177 50  0000 C CNN
F 2 "" H 2100 3350 50  0001 C CNN
F 3 "" H 2100 3350 50  0001 C CNN
	1    2100 3350
	1    0    0    -1  
$EndComp
$Comp
L power:GNDA #PWR0145
U 1 1 5F1DAB9D
P 2750 2550
F 0 "#PWR0145" H 2750 2300 50  0001 C CNN
F 1 "GNDA" V 2755 2422 50  0000 R CNN
F 2 "" H 2750 2550 50  0001 C CNN
F 3 "" H 2750 2550 50  0001 C CNN
	1    2750 2550
	0    -1   -1   0   
$EndComp
$Comp
L power:+5VA #PWR0146
U 1 1 5F1DBB42
P 2100 2450
F 0 "#PWR0146" H 2100 2300 50  0001 C CNN
F 1 "+5VA" H 2115 2623 50  0000 C CNN
F 2 "" H 2100 2450 50  0001 C CNN
F 3 "" H 2100 2450 50  0001 C CNN
	1    2100 2450
	1    0    0    -1  
$EndComp
$Comp
L power:GNDA #PWR0147
U 1 1 5F1DBE53
P 6050 1850
F 0 "#PWR0147" H 6050 1600 50  0001 C CNN
F 1 "GNDA" H 6055 1677 50  0000 C CNN
F 2 "" H 6050 1850 50  0001 C CNN
F 3 "" H 6050 1850 50  0001 C CNN
	1    6050 1850
	1    0    0    -1  
$EndComp
$Comp
L power:GNDA #PWR0148
U 1 1 5F1DC20F
P 6700 1000
F 0 "#PWR0148" H 6700 750 50  0001 C CNN
F 1 "GNDA" V 6705 872 50  0000 R CNN
F 2 "" H 6700 1000 50  0001 C CNN
F 3 "" H 6700 1000 50  0001 C CNN
	1    6700 1000
	0    -1   -1   0   
$EndComp
$Comp
L power:GNDA #PWR0149
U 1 1 5F1DD414
P 6550 6250
F 0 "#PWR0149" H 6550 6000 50  0001 C CNN
F 1 "GNDA" H 6555 6077 50  0000 C CNN
F 2 "" H 6550 6250 50  0001 C CNN
F 3 "" H 6550 6250 50  0001 C CNN
	1    6550 6250
	1    0    0    -1  
$EndComp
$Comp
L power:GNDA #PWR0150
U 1 1 5F1DDBF4
P 7900 5550
F 0 "#PWR0150" H 7900 5300 50  0001 C CNN
F 1 "GNDA" V 7905 5422 50  0000 R CNN
F 2 "" H 7900 5550 50  0001 C CNN
F 3 "" H 7900 5550 50  0001 C CNN
	1    7900 5550
	0    -1   -1   0   
$EndComp
$Comp
L power:GND #PWR0151
U 1 1 5E3AF149
P 8450 6300
F 0 "#PWR0151" H 8450 6050 50  0001 C CNN
F 1 "GND" H 8455 6127 50  0000 C CNN
F 2 "" H 8450 6300 50  0001 C CNN
F 3 "" H 8450 6300 50  0001 C CNN
	1    8450 6300
	1    0    0    -1  
$EndComp
$Comp
L power:GND #PWR0152
U 1 1 5E3AF774
P 3150 6400
F 0 "#PWR0152" H 3150 6150 50  0001 C CNN
F 1 "GND" H 3155 6227 50  0000 C CNN
F 2 "" H 3150 6400 50  0001 C CNN
F 3 "" H 3150 6400 50  0001 C CNN
	1    3150 6400
	1    0    0    -1  
$EndComp
$Comp
L power:GND #PWR0153
U 1 1 5E3B05C1
P 1800 6200
F 0 "#PWR0153" H 1800 5950 50  0001 C CNN
F 1 "GND" H 1805 6027 50  0000 C CNN
F 2 "" H 1800 6200 50  0001 C CNN
F 3 "" H 1800 6200 50  0001 C CNN
	1    1800 6200
	1    0    0    -1  
$EndComp
$Comp
L Device:R R343
U 1 1 5D85CC88
P 9450 2000
AR Path="/5D7E2920/5D85CC88" Ref="R343"  Part="1" 
AR Path="/5DAD577F/5D85CC88" Ref="R?"  Part="1" 
F 0 "R343" V 9350 2000 50  0000 C CNN
F 1 "10k" V 9450 2000 50  0000 C CNN
F 2 "Resistor_SMD:R_1206_3216Metric_Pad1.42x1.75mm_HandSolder" V 9380 2000 50  0001 C CNN
F 3 "~" H 9450 2000 50  0001 C CNN
	1    9450 2000
	1    0    0    1   
$EndComp
$Comp
L Device:R R341
U 1 1 5D85CC89
P 8850 1350
AR Path="/5D7E2920/5D85CC89" Ref="R341"  Part="1" 
AR Path="/5DAD577F/5D85CC89" Ref="R?"  Part="1" 
F 0 "R341" H 9000 1350 50  0000 C CNN
F 1 "10k" V 8850 1350 50  0000 C CNN
F 2 "Resistor_SMD:R_0805_2012Metric" V 8780 1350 50  0001 C CNN
F 3 "~" H 8850 1350 50  0001 C CNN
	1    8850 1350
	1    0    0    1   
$EndComp
Connection ~ 7750 1300
Wire Wire Line
	7750 1300 7750 800 
Wire Wire Line
	7750 800  8150 800 
Wire Wire Line
	9500 700  9500 800 
Wire Wire Line
	9800 800  9900 800 
Connection ~ 9500 800 
$Comp
L Device:Fuse F301
U 1 1 60B50021
P 9650 800
AR Path="/5D7E2920/60B50021" Ref="F301"  Part="1" 
AR Path="/5DAD577F/60B50021" Ref="F?"  Part="1" 
F 0 "F301" V 9450 850 50  0000 C CNN
F 1 "20A F" V 9550 850 50  0000 C CNN
F 2 "michal_custom_edge:Fuseholder6x32_horiz_open_universal_Type-III" V 9580 800 50  0001 C CNN
F 3 "~" H 9650 800 50  0001 C CNN
	1    9650 800 
	0    1    1    0   
$EndComp
Wire Wire Line
	9300 1200 9300 1100
Wire Wire Line
	9000 800  9100 800 
$Comp
L Transistor_FET:Si7141DP Q309
U 1 1 5D85CCA7
P 9300 900
AR Path="/5D7E2920/5D85CCA7" Ref="Q309"  Part="1" 
AR Path="/5DAD577F/5D85CCA7" Ref="Q?"  Part="1" 
F 0 "Q309" V 9700 900 50  0000 C CNN
F 1 "SI7155DP-T1" V 9600 900 50  0000 C CNN
F 2 "Package_SO:PowerPAK_SO-8_Single" H 9500 825 50  0001 L CIN
F 3 "http://www.jaolen.com/images/pdf/QM6015D.pdf" V 9300 900 50  0001 L CNN
	1    9300 900 
	0    1    -1   0   
$EndComp
Wire Wire Line
	4900 700  9500 700 
Wire Wire Line
	4900 700  4900 1100
Wire Wire Line
	9450 1700 9750 1700
Wire Wire Line
	9750 1750 9750 1700
Connection ~ 9750 1700
$Comp
L power:GND #PWR0155
U 1 1 5E517688
P 9750 2400
F 0 "#PWR0155" H 9750 2150 50  0001 C CNN
F 1 "GND" H 9755 2227 50  0000 C CNN
F 2 "" H 9750 2400 50  0001 C CNN
F 3 "" H 9750 2400 50  0001 C CNN
	1    9750 2400
	1    0    0    -1  
$EndComp
Wire Wire Line
	9750 2350 9750 2400
Wire Wire Line
	8850 2300 8850 2400
Connection ~ 8850 2300
Wire Wire Line
	9450 2150 9450 2300
Wire Wire Line
	8850 2300 9450 2300
$Comp
L Device:R R346
U 1 1 5E562ED4
P 9300 1700
AR Path="/5D7E2920/5E562ED4" Ref="R346"  Part="1" 
AR Path="/5DAD577F/5E562ED4" Ref="R?"  Part="1" 
F 0 "R346" V 9200 1700 50  0000 C CNN
F 1 "100" V 9300 1700 50  0000 C CNN
F 2 "Resistor_SMD:R_0805_2012Metric" V 9230 1700 50  0001 C CNN
F 3 "~" H 9300 1700 50  0001 C CNN
	1    9300 1700
	0    -1   1    0   
$EndComp
Wire Wire Line
	8850 1900 8850 2300
$EndSCHEMATC
