EESchema Schematic File Version 4
LIBS:battery_tester-cache
LIBS:tester_zrodel-cache
EELAYER 30 0
EELAYER END
$Descr A4 11693 8268
encoding utf-8
Sheet 4 5
Title ""
Date ""
Rev ""
Comp ""
Comment1 ""
Comment2 ""
Comment3 ""
Comment4 ""
$EndDescr
Wire Wire Line
	7050 8400 6900 8400
Wire Wire Line
	6900 8400 6900 8300
Wire Wire Line
	7050 8400 7050 8350
$Comp
L Transistor_FET:IRF740 Q?
U 1 1 5D06A770
P 10600 2500
F 0 "Q?" H 10806 2546 50  0000 L CNN
F 1 "PSMN015-100P" H 10806 2455 50  0000 L CNN
F 2 "Package_TO_SOT_THT:TO-220-3_Horizontal_TabUp" H 10850 2425 50  0001 L CIN
F 3 "http://www.vishay.com/docs/91054/91054.pdf" H 10600 2500 50  0001 L CNN
	1    10600 2500
	1    0    0    -1  
$EndComp
$Comp
L Transistor_FET:IRF740 Q?
U 1 1 5D10403A
P 10600 5850
F 0 "Q?" H 10806 5896 50  0000 L CNN
F 1 "PSMN015-100P" H 10806 5805 50  0000 L CNN
F 2 "Package_TO_SOT_THT:TO-220-3_Horizontal_TabUp" H 10850 5775 50  0001 L CIN
F 3 "http://www.vishay.com/docs/91054/91054.pdf" H 10600 5850 50  0001 L CNN
	1    10600 5850
	1    0    0    -1  
$EndComp
Text Notes 11600 7150 1    50   ~ 0
min 30W
$Comp
L Device:R R?
U 1 1 5DC3B077
P 11400 7000
F 0 "R?" V 11500 7000 50  0000 C CNN
F 1 "0R1" V 11400 7000 50  0000 C CNN
F 2 "Package_TO_SOT_THT:TO-220-2_Horizontal_TabUp" V 11330 7000 50  0001 C CNN
F 3 "~" H 11400 7000 50  0001 C CNN
	1    11400 7000
	1    0    0    -1  
$EndComp
$Comp
L Device:R R?
U 1 1 603C06BB
P 10700 2950
F 0 "R?" V 10800 2950 50  0000 C CNN
F 1 "0R1" V 10700 2950 50  0000 C CNN
F 2 "Resistor_THT:R_Axial_DIN0617_L17.0mm_D6.0mm_P20.32mm_Horizontal" V 10630 2950 50  0001 C CNN
F 3 "~" H 10700 2950 50  0001 C CNN
	1    10700 2950
	-1   0    0    1   
$EndComp
$Comp
L michal_lib:AD8630 U?
U 5 1 5D079F29
P 9100 2450
F 0 "U?" H 9058 2496 50  0001 L CNN
F 1 "MCP6V74-E" H 9058 2450 50  0001 L CNN
F 2 "Package_SO:TSSOP-14_4.4x5mm_P0.65mm" H 9050 2550 50  0001 C CNN
F 3 "http://www.ti.com/lit/ds/symlink/tl081.pdf" H 9150 2650 50  0001 C CNN
	5    9100 2450
	1    0    0    -1  
$EndComp
$Comp
L michal_lib:AD8630 U?
U 5 1 5DE47A4C
P 5100 5400
F 0 "U?" H 5058 5446 50  0001 L CNN
F 1 "MCP6V74-E" H 5058 5400 50  0001 L CNN
F 2 "Package_SO:TSSOP-14_4.4x5mm_P0.65mm" H 5050 5500 50  0001 C CNN
F 3 "http://www.ti.com/lit/ds/symlink/tl081.pdf" H 5150 5600 50  0001 C CNN
	5    5100 5400
	1    0    0    -1  
$EndComp
Connection ~ 5000 5100
Wire Wire Line
	5050 5100 5000 5100
Wire Wire Line
	5000 5100 4950 5100
$Comp
L michal_lib:AD8630 U?
U 1 1 5DE47A46
P 5050 5400
F 0 "U?" H 4750 5850 50  0000 C CNN
F 1 "MCP6V74-E" H 4750 5750 50  0000 C CNN
F 2 "Package_SO:TSSOP-14_4.4x5mm_P0.65mm" H 5000 5500 50  0001 C CNN
F 3 "http://www.ti.com/lit/ds/symlink/tl081.pdf" H 5100 5600 50  0001 C CNN
	1    5050 5400
	1    0    0    -1  
$EndComp
$Comp
L michal_lib:AD8630 U?
U 2 1 5DEA007E
P 7350 5500
F 0 "U?" H 7350 5867 50  0000 C CNN
F 1 "MCP6V74-E" H 7350 5776 50  0000 C CNN
F 2 "Package_SO:TSSOP-14_4.4x5mm_P0.65mm" H 7300 5600 50  0001 C CNN
F 3 "http://www.ti.com/lit/ds/symlink/tl081.pdf" H 7400 5700 50  0001 C CNN
	2    7350 5500
	1    0    0    -1  
$EndComp
$Comp
L michal_lib:AD8630 U?
U 3 1 5DEB95F6
P 10100 7000
F 0 "U?" H 10100 7367 50  0000 C CNN
F 1 "MCP6V74-E" H 10100 7276 50  0000 C CNN
F 2 "Package_SO:TSSOP-14_4.4x5mm_P0.65mm" H 10050 7100 50  0001 C CNN
F 3 "http://www.ti.com/lit/ds/symlink/tl081.pdf" H 10150 7200 50  0001 C CNN
	3    10100 7000
	-1   0    0    1   
$EndComp
$Comp
L michal_lib:AD8630 U?
U 4 1 5DEBD9EA
P 7250 3550
F 0 "U?" H 7250 3917 50  0000 C CNN
F 1 "MCP6V74-E" H 7250 3826 50  0000 C CNN
F 2 "Package_SO:TSSOP-14_4.4x5mm_P0.65mm" H 7200 3650 50  0001 C CNN
F 3 "http://www.ti.com/lit/ds/symlink/tl081.pdf" H 7300 3750 50  0001 C CNN
	4    7250 3550
	-1   0    0    1   
$EndComp
Wire Wire Line
	9000 2750 9000 2800
$Comp
L Device:C C?
U 1 1 5DF6DAF8
P 9550 2600
F 0 "C?" H 9700 2600 50  0000 L CNN
F 1 "100p" H 9600 2500 50  0000 L CNN
F 2 "Capacitor_SMD:C_1206_3216Metric_Pad1.42x1.75mm_HandSolder" H 9588 2450 50  0001 C CNN
F 3 "~" H 9550 2600 50  0001 C CNN
	1    9550 2600
	-1   0    0    -1  
$EndComp
$Comp
L Reference_Voltage:TL431DBZ U?
U 1 1 5DF6DAE6
P 6350 6200
F 0 "U?" V 6250 6050 50  0000 R CNN
F 1 "TL431DBZ" V 6350 6150 50  0000 R CNN
F 2 "Package_TO_SOT_SMD:SOT-23" H 6350 6050 50  0001 C CIN
F 3 "http://www.ti.com/lit/ds/symlink/tl431.pdf" H 6350 6200 50  0001 C CIN
	1    6350 6200
	0    1    1    0   
$EndComp
Wire Wire Line
	10700 3100 11400 3100
Connection ~ 10700 3100
Wire Wire Line
	10700 4250 11400 4250
Connection ~ 10700 4250
$Comp
L Device:R R?
U 1 1 5DF6DB25
P 10700 4100
F 0 "R?" V 10800 4100 50  0000 C CNN
F 1 "0R1" V 10700 4100 50  0000 C CNN
F 2 "Resistor_THT:R_Axial_DIN0617_L17.0mm_D6.0mm_P20.32mm_Horizontal" V 10630 4100 50  0001 C CNN
F 3 "~" H 10700 4100 50  0001 C CNN
	1    10700 4100
	-1   0    0    1   
$EndComp
Wire Wire Line
	10700 5450 11400 5450
Connection ~ 10700 5450
Wire Wire Line
	10400 4250 10700 4250
Wire Wire Line
	10400 3100 10700 3100
$Comp
L Device:R R?
U 1 1 603B1134
P 10700 5300
F 0 "R?" V 10800 5300 50  0000 C CNN
F 1 "0R1" V 10700 5300 50  0000 C CNN
F 2 "Resistor_THT:R_Axial_DIN0617_L17.0mm_D6.0mm_P20.32mm_Horizontal" V 10630 5300 50  0001 C CNN
F 3 "~" H 10700 5300 50  0001 C CNN
	1    10700 5300
	-1   0    0    1   
$EndComp
Wire Wire Line
	7100 2550 7100 2650
Wire Wire Line
	11400 7150 11400 7450
$Comp
L power:+5V #PWR?
U 1 1 601436BF
P 9000 1950
F 0 "#PWR?" H 9000 1800 50  0001 C CNN
F 1 "+5V" H 8950 2100 50  0000 C CNN
F 2 "" H 9000 1950 50  0001 C CNN
F 3 "" H 9000 1950 50  0001 C CNN
	1    9000 1950
	1    0    0    -1  
$EndComp
Wire Wire Line
	9100 1950 9000 1950
Wire Wire Line
	8000 6450 8150 6450
Connection ~ 8000 6750
Wire Wire Line
	8000 6750 8000 6450
Wire Wire Line
	8700 6450 8700 6850
Wire Wire Line
	8450 6450 8700 6450
Connection ~ 8450 7400
Wire Wire Line
	8450 7400 8450 7250
$Comp
L Device:R R?
U 1 1 5DF6DB1E
P 8300 6450
F 0 "R?" V 8200 6450 50  0000 C CNN
F 1 "500k" V 8300 6450 50  0000 C CNN
F 2 "Resistor_SMD:R_1206_3216Metric_Pad1.42x1.75mm_HandSolder" V 8230 6450 50  0001 C CNN
F 3 "~" H 8300 6450 50  0001 C CNN
	1    8300 6450
	0    -1   -1   0   
$EndComp
Wire Wire Line
	8900 7400 8450 7400
$Comp
L power:GND #PWR?
U 1 1 5FE6868A
P 8450 7400
F 0 "#PWR?" H 8450 7150 50  0001 C CNN
F 1 "GND" H 8455 7227 50  0000 C CNN
F 2 "" H 8450 7400 50  0001 C CNN
F 3 "" H 8450 7400 50  0001 C CNN
	1    8450 7400
	-1   0    0    -1  
$EndComp
$Comp
L power:+5V #PWR?
U 1 1 5FE67FB8
P 8450 6650
F 0 "#PWR?" H 8450 6500 50  0001 C CNN
F 1 "+5V" H 8550 6650 50  0000 C CNN
F 2 "" H 8450 6650 50  0001 C CNN
F 3 "" H 8450 6650 50  0001 C CNN
	1    8450 6650
	-1   0    0    -1  
$EndComp
Connection ~ 8900 7100
Wire Wire Line
	8700 6850 8750 6850
Connection ~ 8700 6850
Wire Wire Line
	8700 7100 8900 7100
Wire Wire Line
	8700 6850 8700 7100
$Comp
L Device:R_POT RV?
U 1 1 5FB87AB6
P 8900 6850
F 0 "RV?" H 9100 7000 50  0000 R CNN
F 1 "10k" V 8900 6900 50  0000 R CNN
F 2 "Potentiometer_SMD:Potentiometer_Bourns_3214J_Horizontal" H 8900 6850 50  0001 C CNN
F 3 "~" H 8900 6850 50  0001 C CNN
	1    8900 6850
	-1   0    0    -1  
$EndComp
Wire Wire Line
	8650 6850 8700 6850
Wire Wire Line
	8900 7000 8900 7100
$Comp
L Device:R R?
U 1 1 5FD35AE6
P 8900 7250
F 0 "R?" V 8800 7250 50  0000 C CNN
F 1 "20k" V 8900 7250 50  0000 C CNN
F 2 "Resistor_SMD:R_1206_3216Metric_Pad1.42x1.75mm_HandSolder" V 8830 7250 50  0001 C CNN
F 3 "~" H 8900 7250 50  0001 C CNN
	1    8900 7250
	-1   0    0    1   
$EndComp
$Comp
L Device:R R?
U 1 1 5FB22D92
P 9100 6850
F 0 "R?" H 9050 6700 50  0000 C CNN
F 1 "1k" V 9100 6850 50  0000 C CNN
F 2 "Resistor_SMD:R_1206_3216Metric_Pad1.42x1.75mm_HandSolder" V 9030 6850 50  0001 C CNN
F 3 "~" H 9100 6850 50  0001 C CNN
	1    9100 6850
	-1   0    0    1   
$EndComp
Wire Wire Line
	9100 7000 9100 7050
Wire Wire Line
	9100 7050 8650 7050
Wire Wire Line
	8000 6950 8000 6750
Wire Wire Line
	8050 6950 8000 6950
Wire Wire Line
	11400 6600 11400 6700
Connection ~ 11400 6600
Wire Wire Line
	8700 6300 9100 6300
Wire Wire Line
	11400 6600 10200 6600
Wire Wire Line
	11400 6700 11150 6700
Wire Wire Line
	11400 6500 11400 6600
$Comp
L Amplifier_Operational:MCP601-xP U?
U 1 1 5F7826BD
P 8350 6950
F 0 "U?" H 8550 6700 50  0000 C CNN
F 1 "MCP601-xP" H 8550 6800 50  0000 C CNN
F 2 "Package_SO:SO-8_3.9x4.9mm_P1.27mm" H 8250 6750 50  0001 L CNN
F 3 "http://ww1.microchip.com/downloads/en/DeviceDoc/21314g.pdf" H 8500 7100 50  0001 C CNN
	1    8350 6950
	-1   0    0    -1  
$EndComp
Wire Wire Line
	9600 7000 9650 7000
Wire Wire Line
	7750 7100 7750 7350
Wire Wire Line
	7600 6750 8000 6750
Wire Wire Line
	7750 7350 7350 7350
Wire Wire Line
	7750 6800 7750 6300
$Comp
L Device:R R?
U 1 1 5F6EFD3C
P 7750 6950
F 0 "R?" V 7650 6950 50  0000 C CNN
F 1 "10k" V 7750 6950 50  0000 C CNN
F 2 "Resistor_SMD:R_1206_3216Metric_Pad1.42x1.75mm_HandSolder" V 7680 6950 50  0001 C CNN
F 3 "~" H 7750 6950 50  0001 C CNN
	1    7750 6950
	-1   0    0    1   
$EndComp
Wire Wire Line
	7750 6300 8400 6300
Connection ~ 7750 6300
Wire Wire Line
	6850 7800 6800 7800
Connection ~ 6850 7800
Wire Wire Line
	6850 7900 6650 7900
Wire Wire Line
	6850 7800 6850 7900
Wire Wire Line
	6650 7900 6650 7950
Wire Wire Line
	7050 7900 6950 7900
Wire Wire Line
	7050 7950 7050 7900
Wire Wire Line
	6950 7300 6950 7900
$Comp
L Switch:SW_Push SW?
U 1 1 5F41C781
P 7050 8150
F 0 "SW?" V 7000 8400 50  0000 C CNN
F 1 "SW_Push" V 7100 8400 50  0000 C CNN
F 2 "Button_Switch_SMD:SW_Push_1P1T_NO_6x6mm_H9.5mm" H 7050 8350 50  0001 C CNN
F 3 "~" H 7050 8350 50  0001 C CNN
	1    7050 8150
	0    1    1    0   
$EndComp
$Comp
L Device:R R?
U 1 1 5F60491A
P 6900 8150
F 0 "R?" H 6800 8100 50  0000 C CNN
F 1 "1k" V 6900 8150 50  0000 C CNN
F 2 "Resistor_SMD:R_1206_3216Metric_Pad1.42x1.75mm_HandSolder" V 6830 8150 50  0001 C CNN
F 3 "~" H 6900 8150 50  0001 C CNN
	1    6900 8150
	1    0    0    -1  
$EndComp
Connection ~ 6900 7500
Wire Wire Line
	6900 7500 6900 8000
Wire Wire Line
	6800 7300 6950 7300
Wire Wire Line
	6850 6750 7300 6750
Wire Wire Line
	6850 7400 6850 6750
Wire Wire Line
	6800 7400 6850 7400
Wire Wire Line
	7350 7300 7350 7350
Wire Wire Line
	6900 7000 6900 7500
Connection ~ 6900 7000
Wire Wire Line
	6950 7000 6900 7000
Wire Wire Line
	7350 7000 7250 7000
$Comp
L Device:LED D?
U 1 1 5F337F92
P 7350 7150
F 0 "D?" V 7389 7033 50  0000 R CNN
F 1 "LED" V 7298 7033 50  0000 R CNN
F 2 "Diode_SMD:D_1206_3216Metric_Pad1.42x1.75mm_HandSolder" H 7350 7150 50  0001 C CNN
F 3 "~" H 7350 7150 50  0001 C CNN
	1    7350 7150
	0    -1   -1   0   
$EndComp
Wire Wire Line
	6900 6600 6900 7000
Wire Wire Line
	7350 7800 6850 7800
Wire Wire Line
	7350 7750 7350 7800
Wire Wire Line
	7050 7550 7050 7500
$Comp
L Device:R R?
U 1 1 5F221C95
P 7100 7000
F 0 "R?" V 7000 7000 50  0000 C CNN
F 1 "300" V 7100 7000 50  0000 C CNN
F 2 "Resistor_SMD:R_1206_3216Metric_Pad1.42x1.75mm_HandSolder" V 7030 7000 50  0001 C CNN
F 3 "~" H 7100 7000 50  0001 C CNN
	1    7100 7000
	0    1    1    0   
$EndComp
$Comp
L Device:R R?
U 1 1 5EFC67CA
P 7450 6750
F 0 "R?" V 7350 6750 50  0000 C CNN
F 1 "1k" V 7450 6750 50  0000 C CNN
F 2 "Resistor_SMD:R_1206_3216Metric_Pad1.42x1.75mm_HandSolder" V 7380 6750 50  0001 C CNN
F 3 "~" H 7450 6750 50  0001 C CNN
	1    7450 6750
	0    1    1    0   
$EndComp
$Comp
L power:+5V #PWR?
U 1 1 5DF6DB08
P 6900 6600
F 0 "#PWR?" H 6900 6450 50  0001 C CNN
F 1 "+5V" H 6915 6773 50  0000 C CNN
F 2 "" H 6900 6600 50  0001 C CNN
F 3 "" H 6900 6600 50  0001 C CNN
	1    6900 6600
	-1   0    0    -1  
$EndComp
Wire Wire Line
	7050 7200 6800 7200
$Comp
L Device:R R?
U 1 1 5F25327D
P 7050 7350
F 0 "R?" V 6950 7350 50  0000 C CNN
F 1 "1k" V 7050 7350 50  0000 C CNN
F 2 "Resistor_SMD:R_1206_3216Metric_Pad1.42x1.75mm_HandSolder" V 6980 7350 50  0001 C CNN
F 3 "~" H 7050 7350 50  0001 C CNN
	1    7050 7350
	-1   0    0    1   
$EndComp
Wire Wire Line
	6100 7050 6100 7100
Wire Wire Line
	6800 7500 6900 7500
Wire Wire Line
	6100 7100 6200 7100
$Comp
L michal_lib:MC14043B U?
U 1 1 5EF03258
P 6500 7400
F 0 "U?" H 6500 7925 50  0000 C CNN
F 1 "MC14043B" H 6500 7834 50  0000 C CNN
F 2 "Package_SO:SOIC-16_3.9x9.9mm_P1.27mm" H 6500 7850 50  0001 C CNN
F 3 "" H 6500 7850 50  0001 C CNN
	1    6500 7400
	-1   0    0    -1  
$EndComp
$Comp
L power:GND #PWR?
U 1 1 5EECDFC0
P 6650 7950
F 0 "#PWR?" H 6650 7700 50  0001 C CNN
F 1 "GND" H 6655 7777 50  0000 C CNN
F 2 "" H 6650 7950 50  0001 C CNN
F 3 "" H 6650 7950 50  0001 C CNN
	1    6650 7950
	-1   0    0    -1  
$EndComp
$Comp
L power:+5V #PWR?
U 1 1 5DF6DB01
P 6100 7050
F 0 "#PWR?" H 6100 6900 50  0001 C CNN
F 1 "+5V" H 6115 7223 50  0000 C CNN
F 2 "" H 6100 7050 50  0001 C CNN
F 3 "" H 6100 7050 50  0001 C CNN
	1    6100 7050
	-1   0    0    -1  
$EndComp
Wire Wire Line
	6350 6500 6350 6550
Connection ~ 6350 6500
Wire Wire Line
	6500 6500 6350 6500
Wire Wire Line
	6350 6300 6350 6500
Wire Wire Line
	6950 5900 6950 5800
Connection ~ 6950 5900
Wire Wire Line
	6850 5900 6950 5900
Wire Wire Line
	6950 6300 7750 6300
Text Notes 7450 5700 0    50   ~ 0
optional\n
Wire Notes Line
	7050 5700 7050 5900
Wire Notes Line
	7950 5700 7050 5700
Wire Notes Line
	7950 5900 7950 5700
Wire Notes Line
	7050 5900 7950 5900
Wire Wire Line
	10050 2450 10050 2500
Wire Wire Line
	10000 2450 10050 2450
Connection ~ 10400 2500
Wire Wire Line
	10400 2500 10050 2500
Wire Wire Line
	10100 1750 8050 1750
Connection ~ 10100 1750
Connection ~ 10700 2250
Wire Wire Line
	10100 2250 10100 1750
Wire Wire Line
	10700 2250 10100 2250
$Comp
L Device:D_TVS D?
U 1 1 5DF6DAF9
P 13100 1900
F 0 "D?" H 13050 1800 50  0000 L CNN
F 1 "MLV0152" H 12950 2000 50  0000 L CNN
F 2 "Resistor_SMD:R_0603_1608Metric_Pad1.05x0.95mm_HandSolder" H 13100 1900 50  0001 C CNN
F 3 "~" H 13100 1900 50  0001 C CNN
	1    13100 1900
	0    1    1    0   
$EndComp
$Comp
L Diode:1.5KExxA D?
U 1 1 5E9227D7
P 12800 1900
F 0 "D?" H 12750 1800 50  0000 L CNN
F 1 "SMCJ22A" H 12650 2000 50  0000 L CNN
F 2 "Diode_SMD:D_SMC_Handsoldering" H 12800 1700 50  0001 C CNN
F 3 "https://www.vishay.com/docs/88301/15ke.pdf" H 12750 1900 50  0001 C CNN
	1    12800 1900
	0    1    1    0   
$EndComp
Wire Wire Line
	11200 2250 11200 3300
Wire Wire Line
	10700 2250 11200 2250
Connection ~ 9650 2750
Wire Wire Line
	9650 2750 9550 2750
Wire Wire Line
	9550 2450 9400 2450
Connection ~ 9550 2450
Wire Wire Line
	9550 3900 9700 3900
Connection ~ 9550 3900
Wire Wire Line
	9550 3600 9700 3600
Connection ~ 9550 3600
$Comp
L Device:C C?
U 1 1 5DF6DAF7
P 9550 3750
F 0 "C?" H 9700 3750 50  0000 L CNN
F 1 "100p" H 9600 3650 50  0000 L CNN
F 2 "Capacitor_SMD:C_1206_3216Metric_Pad1.42x1.75mm_HandSolder" H 9588 3600 50  0001 C CNN
F 3 "~" H 9550 3750 50  0001 C CNN
	1    9550 3750
	-1   0    0    -1  
$EndComp
Wire Wire Line
	9550 5100 9700 5100
Connection ~ 9550 5100
Wire Wire Line
	9550 4800 9700 4800
Connection ~ 9550 4800
$Comp
L Device:C C?
U 1 1 5DF6DAF6
P 9550 4950
F 0 "C?" H 9700 4950 50  0000 L CNN
F 1 "100p" H 9600 4850 50  0000 L CNN
F 2 "Capacitor_SMD:C_1206_3216Metric_Pad1.42x1.75mm_HandSolder" H 9588 4800 50  0001 C CNN
F 3 "~" H 9550 4950 50  0001 C CNN
	1    9550 4950
	-1   0    0    -1  
$EndComp
Wire Wire Line
	7800 3500 7800 3650
Connection ~ 8050 3650
Connection ~ 7800 3650
Wire Wire Line
	7800 3650 8050 3650
$Comp
L Device:R R?
U 1 1 5D16333D
P 8600 3500
F 0 "R?" V 8500 3500 50  0000 C CNN
F 1 "100" V 8600 3500 50  0000 C CNN
F 2 "Resistor_SMD:R_1206_3216Metric_Pad1.42x1.75mm_HandSolder" V 8530 3500 50  0001 C CNN
F 3 "~" H 8600 3500 50  0001 C CNN
	1    8600 3500
	0    1    1    0   
$EndComp
Wire Wire Line
	8800 3500 8750 3500
Wire Wire Line
	9550 6150 9700 6150
Connection ~ 9550 6150
Wire Wire Line
	9550 5850 9700 5850
Connection ~ 9550 5850
$Comp
L Device:C C?
U 1 1 5DF6DAF4
P 9550 6000
F 0 "C?" H 9700 6000 50  0000 L CNN
F 1 "100p" H 9600 5900 50  0000 L CNN
F 2 "Capacitor_SMD:C_1206_3216Metric_Pad1.42x1.75mm_HandSolder" H 9588 5850 50  0001 C CNN
F 3 "~" H 9550 6000 50  0001 C CNN
	1    9550 6000
	-1   0    0    -1  
$EndComp
Wire Wire Line
	4650 5300 4750 5300
$Comp
L Device:R R?
U 1 1 5E7AEF0F
P 4500 5300
F 0 "R?" V 4400 5300 50  0000 C CNN
F 1 "1k" V 4500 5300 50  0000 C CNN
F 2 "Resistor_SMD:R_1206_3216Metric_Pad1.42x1.75mm_HandSolder" V 4430 5300 50  0001 C CNN
F 3 "~" H 4500 5300 50  0001 C CNN
	1    4500 5300
	0    1    1    0   
$EndComp
Wire Wire Line
	6800 5400 7050 5400
$Comp
L Device:R R?
U 1 1 5DF6DAF2
P 6650 5400
F 0 "R?" V 6550 5400 50  0000 C CNN
F 1 "1k" V 6650 5400 50  0000 C CNN
F 2 "Resistor_SMD:R_1206_3216Metric_Pad1.42x1.75mm_HandSolder" V 6580 5400 50  0001 C CNN
F 3 "~" H 6650 5400 50  0001 C CNN
	1    6650 5400
	0    1    1    0   
$EndComp
Wire Wire Line
	7400 3150 7600 3150
$Comp
L Device:R R?
U 1 1 5DF6DAF1
P 7250 3150
F 0 "R?" V 7150 3150 50  0000 C CNN
F 1 "1k" V 7250 3150 50  0000 C CNN
F 2 "Resistor_SMD:R_1206_3216Metric_Pad1.42x1.75mm_HandSolder" V 7180 3150 50  0001 C CNN
F 3 "~" H 7250 3150 50  0001 C CNN
	1    7250 3150
	0    1    1    0   
$EndComp
Wire Wire Line
	10250 6700 10450 6700
$Comp
L Device:R R?
U 1 1 5E779CD6
P 10100 6700
F 0 "R?" V 10000 6700 50  0000 C CNN
F 1 "1k" V 10100 6700 50  0000 C CNN
F 2 "Resistor_SMD:R_1206_3216Metric_Pad1.42x1.75mm_HandSolder" V 10030 6700 50  0001 C CNN
F 3 "~" H 10100 6700 50  0001 C CNN
	1    10100 6700
	0    1    1    0   
$EndComp
Connection ~ 7900 5800
Wire Wire Line
	7900 6000 7900 5800
Wire Wire Line
	7450 6000 7900 6000
Wire Wire Line
	6950 6000 6950 5900
Connection ~ 6950 6000
Wire Wire Line
	7150 6000 6950 6000
$Comp
L Device:R R?
U 1 1 5E75680B
P 7300 6000
F 0 "R?" V 7200 6000 50  0000 C CNN
F 1 "1k" V 7300 6000 50  0000 C CNN
F 2 "Resistor_SMD:R_1206_3216Metric_Pad1.42x1.75mm_HandSolder" V 7230 6000 50  0001 C CNN
F 3 "~" H 7300 6000 50  0001 C CNN
	1    7300 6000
	0    1    1    0   
$EndComp
Wire Wire Line
	6350 5800 6350 5750
$Comp
L Device:R_POT RV?
U 1 1 5E46F254
P 6700 5900
F 0 "RV?" V 6600 5950 50  0000 R CNN
F 1 "10k" V 6700 5950 50  0000 R CNN
F 2 "Potentiometer_SMD:Potentiometer_Bourns_3214J_Horizontal" H 6700 5900 50  0001 C CNN
F 3 "~" H 6700 5900 50  0001 C CNN
	1    6700 5900
	1    0    0    1   
$EndComp
$Comp
L Connector:TestPoint_Alt TP?
U 1 1 5E3F7BAE
P 6650 6100
F 0 "TP?" H 6700 6100 50  0000 L CNN
F 1 "-2.5V" H 6650 6200 50  0000 L CNN
F 2 "TestPoint:TestPoint_Pad_2.5x2.5mm" H 6850 6100 50  0001 C CNN
F 3 "~" H 6850 6100 50  0001 C CNN
	1    6650 6100
	1    0    0    1   
$EndComp
$Comp
L Device:R R?
U 1 1 5E39F3E4
P 6350 5950
F 0 "R?" V 6250 5950 50  0000 C CNN
F 1 "2k" V 6350 5950 50  0000 C CNN
F 2 "Resistor_SMD:R_1206_3216Metric_Pad1.42x1.75mm_HandSolder" V 6280 5950 50  0001 C CNN
F 3 "~" H 6350 5950 50  0001 C CNN
	1    6350 5950
	-1   0    0    1   
$EndComp
$Comp
L power:-5V #PWR?
U 1 1 5E376B5C
P 6350 5750
F 0 "#PWR?" H 6350 5850 50  0001 C CNN
F 1 "-5V" H 6365 5923 50  0000 C CNN
F 2 "" H 6350 5750 50  0001 C CNN
F 3 "" H 6350 5750 50  0001 C CNN
	1    6350 5750
	1    0    0    -1  
$EndComp
$Comp
L power:GND #PWR?
U 1 1 5E363727
P 6350 6550
F 0 "#PWR?" H 6350 6300 50  0001 C CNN
F 1 "GND" H 6355 6377 50  0000 C CNN
F 2 "" H 6350 6550 50  0001 C CNN
F 3 "" H 6350 6550 50  0001 C CNN
	1    6350 6550
	-1   0    0    -1  
$EndComp
Wire Wire Line
	4950 4900 4950 5100
Connection ~ 4950 4900
Wire Wire Line
	5050 4900 4950 4900
Connection ~ 5450 5100
Wire Wire Line
	5450 4900 5250 4900
Wire Wire Line
	5450 5100 5450 4900
$Comp
L Device:CP_Small C?
U 1 1 5E22CC54
P 5150 4900
F 0 "C?" V 5300 4750 50  0000 C CNN
F 1 "10uF" V 5200 4750 50  0000 C CNN
F 2 "Capacitor_SMD:C_1206_3216Metric_Pad1.42x1.75mm_HandSolder" H 5150 4900 50  0001 C CNN
F 3 "~" H 5150 4900 50  0001 C CNN
	1    5150 4900
	0    -1   -1   0   
$EndComp
Wire Wire Line
	6950 5800 6950 5600
Connection ~ 6950 5800
Wire Wire Line
	7150 5800 6950 5800
Wire Wire Line
	7900 5800 7900 5500
Wire Wire Line
	7850 5800 7900 5800
Wire Wire Line
	7450 5800 7550 5800
$Comp
L Device:R R?
U 1 1 5DF145A8
P 7300 5800
F 0 "R?" V 7200 5800 50  0000 C CNN
F 1 "1k" V 7300 5800 50  0000 C CNN
F 2 "Resistor_SMD:R_1206_3216Metric_Pad1.42x1.75mm_HandSolder" V 7230 5800 50  0001 C CNN
F 3 "~" H 7300 5800 50  0001 C CNN
	1    7300 5800
	0    1    1    0   
$EndComp
$Comp
L Device:C C?
U 1 1 5DF13B2F
P 7700 5800
F 0 "C?" V 7650 5650 50  0000 L CNN
F 1 "1nF" V 7650 5850 50  0000 L CNN
F 2 "Capacitor_SMD:C_1206_3216Metric_Pad1.42x1.75mm_HandSolder" H 7738 5650 50  0001 C CNN
F 3 "~" H 7700 5800 50  0001 C CNN
	1    7700 5800
	0    1    -1   0   
$EndComp
Wire Wire Line
	7650 5500 7900 5500
Connection ~ 6950 3550
Wire Notes Line
	6200 3000 6200 4200
Wire Notes Line
	6200 4200 8200 4200
$Comp
L power:GND #PWR?
U 1 1 5DE47A38
P 5450 5150
F 0 "#PWR?" H 5450 4900 50  0001 C CNN
F 1 "GND" H 5455 4977 50  0001 C CNN
F 2 "" H 5450 5150 50  0001 C CNN
F 3 "" H 5450 5150 50  0001 C CNN
	1    5450 5150
	1    0    0    -1  
$EndComp
$Comp
L Device:C_Small C?
U 1 1 5DE47A3E
P 5150 5100
F 0 "C?" V 5100 5250 50  0000 C CNN
F 1 "100nF" V 5200 5250 50  0000 C CNN
F 2 "Capacitor_SMD:C_1206_3216Metric_Pad1.42x1.75mm_HandSolder" H 5150 5100 50  0001 C CNN
F 3 "~" H 5150 5100 50  0001 C CNN
	1    5150 5100
	0    1    1    0   
$EndComp
Wire Wire Line
	5250 5100 5450 5100
Wire Wire Line
	5450 5100 5450 5150
$Comp
L power:+5V #PWR?
U 1 1 5DE47A53
P 4950 4800
F 0 "#PWR?" H 4950 4650 50  0001 C CNN
F 1 "+5V" H 4965 4973 50  0000 C CNN
F 2 "" H 4950 4800 50  0001 C CNN
F 3 "" H 4950 4800 50  0001 C CNN
	1    4950 4800
	1    0    0    -1  
$EndComp
Wire Wire Line
	4950 4800 4950 4900
Wire Wire Line
	7900 5500 8400 5500
Connection ~ 7900 5500
$Comp
L Connector:TestPoint_Alt TP?
U 1 1 5DDFE22D
P 7900 5500
F 0 "TP?" H 7850 5800 50  0000 L CNN
F 1 "manual_drive" H 7650 5700 50  0000 L CNN
F 2 "TestPoint:TestPoint_Pad_2.5x2.5mm" H 8100 5500 50  0001 C CNN
F 3 "~" H 8100 5500 50  0001 C CNN
	1    7900 5500
	-1   0    0    -1  
$EndComp
Wire Wire Line
	4250 5300 4350 5300
Wire Wire Line
	6400 5400 6500 5400
$Comp
L Connector:TestPoint_Alt TP?
U 1 1 5DDDA9CA
P 6400 5400
F 0 "TP?" H 6550 5600 50  0000 L CNN
F 1 "drive" H 6500 5500 50  0000 L CNN
F 2 "TestPoint:TestPoint_Pad_2.5x2.5mm" H 6600 5400 50  0001 C CNN
F 3 "~" H 6600 5400 50  0001 C CNN
	1    6400 5400
	-1   0    0    -1  
$EndComp
Wire Wire Line
	4750 5500 4650 5500
Wire Wire Line
	8400 5500 8400 5750
Connection ~ 8400 5500
Connection ~ 7350 4050
$Comp
L power:GND #PWR?
U 1 1 5DF6DACF
P 7350 4050
F 0 "#PWR?" H 7350 3800 50  0001 C CNN
F 1 "GND" H 7355 3877 50  0000 C CNN
F 2 "" H 7350 4050 50  0001 C CNN
F 3 "" H 7350 4050 50  0001 C CNN
	1    7350 4050
	1    0    0    -1  
$EndComp
Wire Wire Line
	6500 4050 7350 4050
Wire Wire Line
	7800 4050 7350 4050
Connection ~ 7800 4050
Wire Wire Line
	6950 5600 7050 5600
Wire Wire Line
	6950 6300 6950 6000
Wire Wire Line
	9300 7100 9300 7000
$Comp
L Device:R R?
U 1 1 5DF6DAC8
P 10600 7100
F 0 "R?" V 10500 7100 50  0000 C CNN
F 1 "10k" V 10600 7100 50  0000 C CNN
F 2 "Resistor_SMD:R_1206_3216Metric_Pad1.42x1.75mm_HandSolder" V 10530 7100 50  0001 C CNN
F 3 "~" H 10600 7100 50  0001 C CNN
	1    10600 7100
	0    1    1    0   
$EndComp
Wire Wire Line
	10750 7100 11150 7100
Text Notes 10600 7250 0    50   ~ 0
15A*0.1Ω=1.5V
Wire Wire Line
	11150 6700 11150 7100
Wire Wire Line
	10450 7100 10400 7100
Wire Wire Line
	9750 6700 9950 6700
Wire Wire Line
	10450 6700 10450 6900
Wire Wire Line
	10450 6900 10400 6900
Text GLabel 9300 7100 3    50   Input ~ 0
out_sens
$Comp
L Device:C C?
U 1 1 5DF6DAD3
P 9750 7250
F 0 "C?" H 9865 7296 50  0000 L CNN
F 1 "100nF" H 9850 7200 50  0000 L CNN
F 2 "Capacitor_SMD:C_1206_3216Metric_Pad1.42x1.75mm_HandSolder" H 9788 7100 50  0001 C CNN
F 3 "~" H 9750 7250 50  0001 C CNN
	1    9750 7250
	-1   0    0    -1  
$EndComp
Wire Wire Line
	9750 6700 9750 7000
Connection ~ 9750 7000
Wire Wire Line
	9750 7000 9800 7000
$Comp
L power:GND #PWR?
U 1 1 5D9078BE
P 9750 7450
F 0 "#PWR?" H 9750 7200 50  0001 C CNN
F 1 "GND" H 9755 7277 50  0000 C CNN
F 2 "" H 9750 7450 50  0001 C CNN
F 3 "" H 9750 7450 50  0001 C CNN
	1    9750 7450
	1    0    0    -1  
$EndComp
Wire Wire Line
	9750 7400 9750 7450
$Comp
L Device:R R?
U 1 1 5D91DF96
P 9450 7000
F 0 "R?" V 9350 7000 50  0000 C CNN
F 1 "100R" V 9450 7000 50  0000 C CNN
F 2 "Resistor_SMD:R_1206_3216Metric_Pad1.42x1.75mm_HandSolder" V 9380 7000 50  0001 C CNN
F 3 "~" H 9450 7000 50  0001 C CNN
	1    9450 7000
	0    1    1    0   
$EndComp
Wire Wire Line
	9750 7000 9750 7100
Wire Notes Line width 8
	11250 6550 11250 7550
Text Notes 10150 7500 0    50   ~ 10
output current measure
Wire Notes Line width 8
	9200 6550 11250 6550
$Comp
L Device:R R?
U 1 1 5DC69069
P 8550 6300
F 0 "R?" V 8450 6300 50  0000 C CNN
F 1 "10k" V 8550 6300 50  0000 C CNN
F 2 "Resistor_SMD:R_1206_3216Metric_Pad1.42x1.75mm_HandSolder" V 8480 6300 50  0001 C CNN
F 3 "~" H 8550 6300 50  0001 C CNN
	1    8550 6300
	0    1    1    0   
$EndComp
Text Notes 10750 6400 0    50   ~ 0
3w
Text Notes 10750 5350 0    50   ~ 0
3w
Text Notes 10750 4150 0    50   ~ 0
3w
Text Notes 10750 3000 0    50   ~ 0
3w
Wire Wire Line
	10700 6500 11400 6500
Connection ~ 10700 6500
$Comp
L Device:R R?
U 1 1 5DC270E2
P 10700 6350
F 0 "R?" V 10800 6350 50  0000 C CNN
F 1 "0R1" V 10700 6350 50  0000 C CNN
F 2 "Resistor_THT:R_Axial_DIN0617_L17.0mm_D6.0mm_P20.32mm_Horizontal" V 10630 6350 50  0001 C CNN
F 3 "~" H 10700 6350 50  0001 C CNN
	1    10700 6350
	-1   0    0    1   
$EndComp
$Comp
L Device:R R?
U 1 1 5D0FECCA
P 10400 5300
F 0 "R?" V 10500 5300 50  0000 C CNN
F 1 "1M" V 10400 5300 50  0000 C CNN
F 2 "Resistor_SMD:R_1206_3216Metric_Pad1.42x1.75mm_HandSolder" V 10330 5300 50  0001 C CNN
F 3 "~" H 10400 5300 50  0001 C CNN
	1    10400 5300
	-1   0    0    1   
$EndComp
Wire Wire Line
	10400 5150 10400 4800
Wire Wire Line
	10700 5100 10000 5100
$Comp
L Device:C C?
U 1 1 5D633891
P 6100 2300
F 0 "C?" H 6200 2300 50  0000 L CNN
F 1 "100nF" H 6150 2200 50  0000 L CNN
F 2 "Capacitor_SMD:C_1206_3216Metric_Pad1.42x1.75mm_HandSolder" H 6138 2150 50  0001 C CNN
F 3 "~" H 6100 2300 50  0001 C CNN
	1    6100 2300
	-1   0    0    -1  
$EndComp
$Comp
L Connector:TestPoint_Alt TP?
U 1 1 5D6B3480
P 4550 2100
F 0 "TP?" H 4300 2200 50  0000 L CNN
F 1 "3.3V" H 4300 2100 50  0000 L CNN
F 2 "TestPoint:TestPoint_Pad_2.5x2.5mm" H 4750 2100 50  0001 C CNN
F 3 "~" H 4750 2100 50  0001 C CNN
	1    4550 2100
	-1   0    0    -1  
$EndComp
Wire Wire Line
	6100 2450 6100 2900
Connection ~ 4550 2250
$Comp
L power:GND #PWR?
U 1 1 5D7FA2CF
P 5200 2900
F 0 "#PWR?" H 5200 2650 50  0001 C CNN
F 1 "GND" H 5350 2850 50  0000 C CNN
F 2 "" H 5200 2900 50  0001 C CNN
F 3 "" H 5200 2900 50  0001 C CNN
	1    5200 2900
	-1   0    0    -1  
$EndComp
Wire Wire Line
	4550 2250 4300 2250
Wire Notes Line width 8
	6200 1600 4000 1600
Wire Notes Line width 8
	4000 1600 4000 3100
Text Notes 4000 1750 0    50   ~ 10
+3.3 ref
Text Notes 6250 4150 0    50   ~ 10
input voltage divider
$Comp
L Device:C_Small C?
U 1 1 5DF6DACB
P 6500 3800
F 0 "C?" H 6650 3800 50  0000 L CNN
F 1 "100nF" H 6550 3700 50  0000 L CNN
F 2 "Capacitor_SMD:C_1206_3216Metric_Pad1.42x1.75mm_HandSolder" H 6538 3650 50  0001 C CNN
F 3 "~" H 6500 3800 50  0001 C CNN
	1    6500 3800
	-1   0    0    -1  
$EndComp
Wire Notes Line
	6200 3000 8200 3000
Wire Notes Line
	8200 3000 8200 4200
Wire Wire Line
	10400 6500 10700 6500
Connection ~ 10700 2750
Wire Wire Line
	10700 2750 10700 2800
Text Notes 8000 3300 2    50   ~ 0
0.1V/V\n\n
Wire Wire Line
	7800 4050 8050 4050
Wire Wire Line
	8050 3950 8050 4050
Wire Wire Line
	7900 3500 7800 3500
Wire Wire Line
	7800 4000 7800 4050
Wire Wire Line
	7800 3650 7550 3650
Wire Wire Line
	7800 3650 7800 3700
$Comp
L Device:D_Zener D?
U 1 1 5D6C0114
P 7800 3850
F 0 "D?" V 7750 3650 50  0000 L CNN
F 1 "3.3V" V 7850 3600 50  0000 L CNN
F 2 "Diode_SMD:D_MicroMELF_Hadsoldering" H 7800 3850 50  0001 C CNN
F 3 "~" H 7800 3850 50  0001 C CNN
	1    7800 3850
	0    1    1    0   
$EndComp
Wire Wire Line
	6500 3550 6600 3550
Connection ~ 6500 3550
$Comp
L Device:R R?
U 1 1 5D6D6007
P 6750 3550
F 0 "R?" V 6850 3550 50  0000 C CNN
F 1 "100" V 6750 3550 50  0000 C CNN
F 2 "Resistor_SMD:R_0805_2012Metric_Pad1.15x1.40mm_HandSolder" V 6680 3550 50  0001 C CNN
F 3 "~" H 6750 3550 50  0001 C CNN
	1    6750 3550
	0    -1   -1   0   
$EndComp
Wire Wire Line
	6900 3550 6950 3550
Text GLabel 4250 3750 2    50   Input ~ 0
out_sens
Text Notes 7450 2100 0    50   ~ 0
0mV+ 10.0mV/C\n1V - 100C\n
Wire Wire Line
	11400 3100 11400 4250
Connection ~ 11400 4250
Wire Wire Line
	11400 4250 11400 5450
Connection ~ 11400 5450
Wire Wire Line
	10400 4800 10000 4800
$Comp
L Device:R R?
U 1 1 5D0FECE5
P 9850 4800
F 0 "R?" V 9750 4800 50  0000 C CNN
F 1 "1k" V 9850 4800 50  0000 C CNN
F 2 "Resistor_SMD:R_1206_3216Metric_Pad1.42x1.75mm_HandSolder" V 9780 4800 50  0001 C CNN
F 3 "~" H 9850 4800 50  0001 C CNN
	1    9850 4800
	0    1    1    0   
$EndComp
Wire Wire Line
	9400 4800 9550 4800
Connection ~ 10400 4800
$Comp
L Device:R R?
U 1 1 5DF6DABF
P 10400 4100
F 0 "R?" V 10500 4100 50  0000 C CNN
F 1 "1M" V 10400 4100 50  0000 C CNN
F 2 "Resistor_SMD:R_1206_3216Metric_Pad1.42x1.75mm_HandSolder" V 10330 4100 50  0001 C CNN
F 3 "~" H 10400 4100 50  0001 C CNN
	1    10400 4100
	-1   0    0    1   
$EndComp
$Comp
L michal_lib:AD8630 U?
U 4 1 5D0669D5
P 9100 4800
F 0 "U?" H 9100 5167 50  0000 C CNN
F 1 "MCP6V74-E" H 9100 5076 50  0000 C CNN
F 2 "Package_SO:TSSOP-14_4.4x5mm_P0.65mm" H 9050 4900 50  0001 C CNN
F 3 "http://www.ti.com/lit/ds/symlink/tl081.pdf" H 9150 5000 50  0001 C CNN
	4    9100 4800
	1    0    0    -1  
$EndComp
$Comp
L Transistor_FET:IRF740 Q?
U 1 1 5D0FECC4
P 10600 4800
F 0 "Q?" H 10806 4846 50  0000 L CNN
F 1 "PSMN015-100P" H 10806 4755 50  0000 L CNN
F 2 "Package_TO_SOT_THT:TO-220-3_Horizontal_TabUp" H 10850 4725 50  0001 L CIN
F 3 "http://www.vishay.com/docs/91054/91054.pdf" H 10600 4800 50  0001 L CNN
	1    10600 4800
	1    0    0    -1  
$EndComp
Wire Wire Line
	10700 5000 10700 5100
Wire Wire Line
	8800 5100 8800 4900
Wire Wire Line
	10700 4600 10700 4500
Wire Wire Line
	10700 4500 11200 4500
$Comp
L Device:R R?
U 1 1 5D161819
P 8600 4700
F 0 "R?" V 8500 4700 50  0000 C CNN
F 1 "100" V 8600 4700 50  0000 C CNN
F 2 "Resistor_SMD:R_1206_3216Metric_Pad1.42x1.75mm_HandSolder" V 8530 4700 50  0001 C CNN
F 3 "~" H 8600 4700 50  0001 C CNN
	1    8600 4700
	0    1    1    0   
$EndComp
Wire Wire Line
	8800 4700 8750 4700
Wire Wire Line
	8450 4700 8400 4700
Wire Wire Line
	8400 3500 8400 4700
Wire Wire Line
	8400 4700 8400 5500
Connection ~ 8400 4700
$Comp
L Device:R R?
U 1 1 5D6970BD
P 8050 3800
F 0 "R?" V 7950 3800 50  0000 C CNN
F 1 "10k" V 8050 3800 50  0000 C CNN
F 2 "Resistor_SMD:R_1206_3216Metric_Pad1.42x1.75mm_HandSolder" V 7980 3800 50  0001 C CNN
F 3 "~" H 8050 3800 50  0001 C CNN
	1    8050 3800
	-1   0    0    1   
$EndComp
Connection ~ 10700 5100
Connection ~ 11200 4500
Wire Wire Line
	11200 3300 11200 4500
Wire Wire Line
	11200 5550 11200 4500
Connection ~ 8400 3500
$Comp
L power:+5V #PWR?
U 1 1 5D6D91B7
P 7100 1850
F 0 "#PWR?" H 7100 1700 50  0001 C CNN
F 1 "+5V" H 7115 2023 50  0000 C CNN
F 2 "" H 7100 1850 50  0001 C CNN
F 3 "" H 7100 1850 50  0001 C CNN
	1    7100 1850
	1    0    0    -1  
$EndComp
$Comp
L Device:R R?
U 1 1 5D6968D6
P 8050 3200
F 0 "R?" V 7950 3200 50  0000 C CNN
F 1 "100k" V 8050 3200 50  0000 C CNN
F 2 "Resistor_SMD:R_1206_3216Metric_Pad1.42x1.75mm_HandSolder" V 7980 3200 50  0001 C CNN
F 3 "~" H 8050 3200 50  0001 C CNN
	1    8050 3200
	-1   0    0    1   
$EndComp
$Comp
L Device:R_POT RV?
U 1 1 5D6953E7
P 8050 3500
F 0 "RV?" V 7950 3550 50  0000 R CNN
F 1 "2k" V 8050 3550 50  0000 R CNN
F 2 "Potentiometer_SMD:Potentiometer_Bourns_3214J_Horizontal" H 8050 3500 50  0001 C CNN
F 3 "~" H 8050 3500 50  0001 C CNN
	1    8050 3500
	-1   0    0    -1  
$EndComp
Wire Wire Line
	6950 3150 6950 3550
Wire Wire Line
	6950 3150 7100 3150
Wire Wire Line
	7600 3450 7600 3150
Wire Wire Line
	7550 3450 7600 3450
Wire Wire Line
	8050 1750 8050 3050
$Comp
L Sensor_Temperature:LM35-NEB U?
U 1 1 5D4AE732
P 7100 2250
F 0 "U?" H 6770 2296 50  0000 R CNN
F 1 "LM35-NEB" H 6770 2205 50  0000 R CNN
F 2 "Package_TO_SOT_THT:TO-220-3_Horizontal_TabUp" H 7150 2000 50  0001 L CNN
F 3 "http://www.ti.com/lit/ds/symlink/lm35.pdf" H 7100 2250 50  0001 C CNN
	1    7100 2250
	1    0    0    -1  
$EndComp
$Comp
L power:GND #PWR?
U 1 1 5D4B3DE0
P 7100 2650
F 0 "#PWR?" H 7100 2400 50  0001 C CNN
F 1 "GND" H 7105 2477 50  0000 C CNN
F 2 "" H 7100 2650 50  0001 C CNN
F 3 "" H 7100 2650 50  0001 C CNN
	1    7100 2650
	1    0    0    -1  
$EndComp
Wire Wire Line
	7500 2250 7650 2250
Wire Wire Line
	7100 1950 7100 1850
Wire Wire Line
	11400 6700 11400 6850
Connection ~ 11400 6700
Wire Wire Line
	11400 5450 11400 6500
Connection ~ 11400 6500
$Comp
L michal_lib:AD8630 U?
U 1 1 5DF6DABB
P 9100 2450
F 0 "U?" H 8650 2900 50  0000 C CNN
F 1 "MCP6V74-E" H 8650 2800 50  0000 C CNN
F 2 "Package_SO:TSSOP-14_4.4x5mm_P0.65mm" H 9050 2550 50  0001 C CNN
F 3 "http://www.ti.com/lit/ds/symlink/tl081.pdf" H 9150 2650 50  0001 C CNN
	1    9100 2450
	1    0    0    -1  
$EndComp
Wire Wire Line
	8400 2350 8400 3500
Wire Wire Line
	8450 2350 8400 2350
Wire Wire Line
	8800 2350 8750 2350
$Comp
L Device:R R?
U 1 1 5D165C6A
P 8600 2350
F 0 "R?" V 8500 2350 50  0000 C CNN
F 1 "100" V 8600 2350 50  0000 C CNN
F 2 "Resistor_SMD:R_1206_3216Metric_Pad1.42x1.75mm_HandSolder" V 8530 2350 50  0001 C CNN
F 3 "~" H 8600 2350 50  0001 C CNN
	1    8600 2350
	0    1    1    0   
$EndComp
Wire Wire Line
	8450 3500 8400 3500
Wire Wire Line
	8450 5750 8400 5750
Wire Wire Line
	8800 5750 8750 5750
$Comp
L Device:R R?
U 1 1 5D15366A
P 8600 5750
F 0 "R?" V 8500 5750 50  0000 C CNN
F 1 "100" V 8600 5750 50  0000 C CNN
F 2 "Resistor_SMD:R_1206_3216Metric_Pad1.42x1.75mm_HandSolder" V 8530 5750 50  0001 C CNN
F 3 "~" H 8600 5750 50  0001 C CNN
	1    8600 5750
	0    1    1    0   
$EndComp
Text Notes 8800 2900 1    22   ~ 0
mosfet short circuit:\n17v/10k=1.7mA
Wire Wire Line
	10700 5550 11200 5550
Wire Wire Line
	10700 5650 10700 5550
Connection ~ 11200 3300
Wire Wire Line
	10700 2300 10700 2250
Wire Wire Line
	10700 3300 11200 3300
Wire Wire Line
	10700 3400 10700 3300
Connection ~ 10400 5850
$Comp
L Device:R R?
U 1 1 5DF6DAC3
P 9850 5850
F 0 "R?" V 9750 5850 50  0000 C CNN
F 1 "1k" V 9850 5850 50  0000 C CNN
F 2 "Resistor_SMD:R_1206_3216Metric_Pad1.42x1.75mm_HandSolder" V 9780 5850 50  0001 C CNN
F 3 "~" H 9850 5850 50  0001 C CNN
	1    9850 5850
	0    1    1    0   
$EndComp
$Comp
L Device:R R?
U 1 1 5DF6DAC2
P 9850 6150
F 0 "R?" V 9750 6150 50  0000 C CNN
F 1 "10k" V 9850 6150 50  0000 C CNN
F 2 "Resistor_SMD:R_1206_3216Metric_Pad1.42x1.75mm_HandSolder" V 9780 6150 50  0001 C CNN
F 3 "~" H 9850 6150 50  0001 C CNN
	1    9850 6150
	0    1    1    0   
$EndComp
Wire Wire Line
	10700 6150 10700 6200
Connection ~ 10700 6150
Wire Wire Line
	10700 6150 10000 6150
Wire Wire Line
	10400 6200 10400 5850
Wire Wire Line
	10700 6050 10700 6150
$Comp
L Device:R R?
U 1 1 5DF6DAC1
P 10400 6350
F 0 "R?" V 10500 6350 50  0000 C CNN
F 1 "1M" V 10400 6350 50  0000 C CNN
F 2 "Resistor_SMD:R_1206_3216Metric_Pad1.42x1.75mm_HandSolder" V 10330 6350 50  0001 C CNN
F 3 "~" H 10400 6350 50  0001 C CNN
	1    10400 6350
	-1   0    0    1   
$EndComp
Wire Wire Line
	8800 5100 9550 5100
$Comp
L Device:R R?
U 1 1 5DF6DAC0
P 9850 5100
F 0 "R?" V 9750 5100 50  0000 C CNN
F 1 "10k" V 9850 5100 50  0000 C CNN
F 2 "Resistor_SMD:R_1206_3216Metric_Pad1.42x1.75mm_HandSolder" V 9780 5100 50  0001 C CNN
F 3 "~" H 9850 5100 50  0001 C CNN
	1    9850 5100
	0    1    1    0   
$EndComp
Wire Wire Line
	10700 5100 10700 5150
Wire Wire Line
	8800 3900 9550 3900
Connection ~ 10400 3600
Wire Wire Line
	9400 3600 9550 3600
$Comp
L Device:R R?
U 1 1 5D0E4097
P 9850 3600
F 0 "R?" V 9750 3600 50  0000 C CNN
F 1 "1k" V 9850 3600 50  0000 C CNN
F 2 "Resistor_SMD:R_1206_3216Metric_Pad1.42x1.75mm_HandSolder" V 9780 3600 50  0001 C CNN
F 3 "~" H 9850 3600 50  0001 C CNN
	1    9850 3600
	0    1    1    0   
$EndComp
Wire Wire Line
	10400 3600 10000 3600
$Comp
L Device:R R?
U 1 1 5D06EC8C
P 9850 2450
F 0 "R?" V 9750 2450 50  0000 C CNN
F 1 "1k" V 9850 2450 50  0000 C CNN
F 2 "Resistor_SMD:R_1206_3216Metric_Pad1.42x1.75mm_HandSolder" V 9780 2450 50  0001 C CNN
F 3 "~" H 9850 2450 50  0001 C CNN
	1    9850 2450
	0    1    1    0   
$EndComp
Wire Wire Line
	8800 3700 8800 3900
$Comp
L Device:R R?
U 1 1 5D0D9589
P 9850 3900
F 0 "R?" V 9750 3900 50  0000 C CNN
F 1 "10k" V 9850 3900 50  0000 C CNN
F 2 "Resistor_SMD:R_1206_3216Metric_Pad1.42x1.75mm_HandSolder" V 9780 3900 50  0001 C CNN
F 3 "~" H 9850 3900 50  0001 C CNN
	1    9850 3900
	0    1    1    0   
$EndComp
Wire Wire Line
	10700 3900 10700 3950
Connection ~ 10700 3900
Wire Wire Line
	10700 3900 10000 3900
Wire Wire Line
	10400 3950 10400 3600
Wire Wire Line
	10700 3800 10700 3900
Wire Wire Line
	9650 2750 9650 3050
Wire Wire Line
	8800 2550 8800 3050
Wire Wire Line
	9650 3050 8800 3050
Wire Wire Line
	9700 2750 9650 2750
$Comp
L Device:R R?
U 1 1 5D0ACD46
P 9850 2750
F 0 "R?" V 9750 2750 50  0000 C CNN
F 1 "10k" V 9850 2750 50  0000 C CNN
F 2 "Resistor_SMD:R_1206_3216Metric_Pad1.42x1.75mm_HandSolder" V 9780 2750 50  0001 C CNN
F 3 "~" H 9850 2750 50  0001 C CNN
	1    9850 2750
	0    1    1    0   
$EndComp
Wire Wire Line
	10700 2750 10000 2750
Wire Wire Line
	10400 2800 10400 2500
Wire Wire Line
	9700 2450 9550 2450
Wire Wire Line
	10700 2700 10700 2750
$Comp
L Device:R R?
U 1 1 5D0756FF
P 10400 2950
F 0 "R?" V 10500 2950 50  0000 C CNN
F 1 "1M" V 10400 2950 50  0000 C CNN
F 2 "Resistor_SMD:R_1206_3216Metric_Pad1.42x1.75mm_HandSolder" V 10330 2950 50  0001 C CNN
F 3 "~" H 10400 2950 50  0001 C CNN
	1    10400 2950
	-1   0    0    1   
$EndComp
$Comp
L michal_lib:AD8630 U?
U 3 1 5D064F07
P 9100 3600
F 0 "U?" H 9100 3967 50  0000 C CNN
F 1 "MCP6V74-E" H 9100 3876 50  0000 C CNN
F 2 "Package_SO:TSSOP-14_4.4x5mm_P0.65mm" H 9050 3700 50  0001 C CNN
F 3 "http://www.ti.com/lit/ds/symlink/tl081.pdf" H 9150 3800 50  0001 C CNN
	3    9100 3600
	1    0    0    -1  
$EndComp
Text Notes 4150 3350 0    50   ~ 0
temp\n
Text Notes 4150 3550 0    50   ~ 0
vin\n
$Comp
L Transistor_FET:IRF740 Q?
U 1 1 5D06CD2E
P 10600 3600
F 0 "Q?" H 10806 3646 50  0000 L CNN
F 1 "PSMN015-100P" H 10806 3555 50  0000 L CNN
F 2 "Package_TO_SOT_THT:TO-220-3_Horizontal_TabUp" H 10850 3525 50  0001 L CIN
F 3 "http://www.vishay.com/docs/91054/91054.pdf" H 10600 3600 50  0001 L CNN
	1    10600 3600
	1    0    0    -1  
$EndComp
Wire Wire Line
	5350 5400 5400 5400
$Comp
L power:GND #PWR?
U 1 1 5DE47A5A
P 5000 5700
F 0 "#PWR?" H 5000 5450 50  0001 C CNN
F 1 "GND" H 5100 5700 50  0000 C CNN
F 2 "" H 5000 5700 50  0001 C CNN
F 3 "" H 5000 5700 50  0001 C CNN
	1    5000 5700
	1    0    0    -1  
$EndComp
Wire Wire Line
	4650 5500 4650 5850
Wire Wire Line
	5400 5850 5400 5400
Wire Wire Line
	4650 5850 4850 5850
Wire Wire Line
	5150 5850 5400 5850
$Comp
L Device:R R?
U 1 1 5DF6DAF0
P 5000 5850
F 0 "R?" V 5100 5850 50  0000 C CNN
F 1 "1k" V 5000 5850 50  0000 C CNN
F 2 "Resistor_SMD:R_1206_3216Metric_Pad1.42x1.75mm_HandSolder" V 4930 5850 50  0001 C CNN
F 3 "~" H 5000 5850 50  0001 C CNN
	1    5000 5850
	0    1    1    0   
$EndComp
Text Notes 3600 3250 0    50   ~ 0
ADC_IN0
Text Notes 3600 3350 0    50   ~ 0
ADC_IN1\n
Text Notes 3600 3450 0    50   ~ 0
ADC_IN2
Text Notes 3900 4650 0    50   ~ 0
DAC_OUT\n
Wire Wire Line
	4100 3350 4100 3250
Wire Wire Line
	4100 3350 5250 3350
Wire Wire Line
	4050 3550 4050 3350
Wire Wire Line
	4050 3550 4950 3550
Wire Wire Line
	4000 3750 4000 3450
Wire Wire Line
	4000 3750 4250 3750
Wire Notes Line width 8
	6000 6800 6750 6800
Wire Notes Line
	6750 6800 6750 6400
Wire Notes Line width 8
	6750 6400 9200 6400
Wire Notes Line width 8
	7700 7550 7700 8450
Wire Notes Line width 8
	7700 8450 6000 8450
Wire Notes Line width 8
	7700 7550 11250 7550
Wire Notes Line width 8
	9200 6400 9200 7550
Wire Wire Line
	4250 4650 4250 5300
Wire Wire Line
	3100 1950 3100 1900
Wire Wire Line
	3100 1900 3000 1900
Wire Wire Line
	2900 1900 2900 1950
Connection ~ 2900 1900
$Comp
L power:+3.3V #PWR?
U 1 1 5D97386B
P 2900 1550
F 0 "#PWR?" H 2900 1400 50  0001 C CNN
F 1 "+3.3V" H 2900 1700 50  0000 C CNN
F 2 "" H 2900 1550 50  0001 C CNN
F 3 "" H 2900 1550 50  0001 C CNN
	1    2900 1550
	1    0    0    -1  
$EndComp
Wire Wire Line
	2900 1550 2900 1900
$Comp
L power:+3.3V #PWR?
U 1 1 5D9BBE5C
P 2350 5100
F 0 "#PWR?" H 2350 4950 50  0001 C CNN
F 1 "+3.3V" H 2350 5250 50  0000 C CNN
F 2 "" H 2350 5100 50  0001 C CNN
F 3 "" H 2350 5100 50  0001 C CNN
	1    2350 5100
	1    0    0    -1  
$EndComp
$Comp
L Device:C_Small C?
U 1 1 5D86C6D8
P 3400 1900
F 0 "C?" V 3300 1900 50  0000 C CNN
F 1 "100nF" V 3500 1900 50  0000 C CNN
F 2 "Resistor_SMD:R_0805_2012Metric_Pad1.15x1.40mm_HandSolder" H 3400 1900 50  0001 C CNN
F 3 "~" H 3400 1900 50  0001 C CNN
	1    3400 1900
	0    1    1    0   
$EndComp
$Comp
L power:GND #PWR?
U 1 1 5D838664
P 3000 5950
F 0 "#PWR?" H 3000 5700 50  0001 C CNN
F 1 "GND" H 3100 5950 50  0000 C CNN
F 2 "" H 3000 5950 50  0001 C CNN
F 3 "" H 3000 5950 50  0001 C CNN
	1    3000 5950
	1    0    0    -1  
$EndComp
$Comp
L Device:C_Small C?
U 1 1 5DB86247
P 2550 5500
F 0 "C?" V 2500 5600 50  0000 C CNN
F 1 "100nF" V 2600 5650 50  0000 C CNN
F 2 "Resistor_SMD:R_0805_2012Metric_Pad1.15x1.40mm_HandSolder" H 2550 5500 50  0001 C CNN
F 3 "~" H 2550 5500 50  0001 C CNN
	1    2550 5500
	0    1    1    0   
$EndComp
$Comp
L Device:C_Small C?
U 1 1 5DB867AC
P 2550 5750
F 0 "C?" V 2500 5850 50  0000 C CNN
F 1 "100nF" V 2600 5900 50  0000 C CNN
F 2 "Resistor_SMD:R_0805_2012Metric_Pad1.15x1.40mm_HandSolder" H 2550 5750 50  0001 C CNN
F 3 "~" H 2550 5750 50  0001 C CNN
	1    2550 5750
	0    1    1    0   
$EndComp
Wire Wire Line
	3100 4950 3100 5150
Text Notes 6000 8400 0    50   ~ 10
hardware overcurrent protection\n
Wire Notes Line width 8
	6000 8450 6000 6800
Wire Notes Line width 8
	4000 3100 6200 3100
Wire Wire Line
	6500 3350 6500 2900
Wire Wire Line
	6500 2900 7650 2900
Wire Wire Line
	7650 2900 7650 2250
$Comp
L Connector:Conn_01x04_Male J?
U 1 1 5E51BA1C
P 1250 3300
F 0 "J?" H 1358 3581 50  0000 C CNN
F 1 "prog" H 1358 3490 50  0000 C CNN
F 2 "Connector_JST:JST_EH_S4B-EH_1x04_P2.50mm_Horizontal" H 1250 3300 50  0001 C CNN
F 3 "~" H 1250 3300 50  0001 C CNN
	1    1250 3300
	1    0    0    -1  
$EndComp
$Comp
L Device:C_Small C?
U 1 1 5DF6DAE9
P 12700 4300
F 0 "C?" V 12650 4400 50  0000 C CNN
F 1 "470u" V 12750 4450 50  0000 C CNN
F 2 "Capacitor_THT:CP_Radial_D10.0mm_P5.00mm" H 12700 4300 50  0001 C CNN
F 3 "~" H 12700 4300 50  0001 C CNN
	1    12700 4300
	-1   0    0    1   
$EndComp
$Comp
L Jumper:Jumper_2_Open JP?
U 1 1 5E64E97F
P 1200 2400
F 0 "JP?" H 1200 2635 50  0000 C CNN
F 1 "reset" H 1200 2544 50  0000 C CNN
F 2 "Jumper:SolderJumper-2_P1.3mm_Open_RoundedPad1.0x1.5mm" H 1200 2400 50  0001 C CNN
F 3 "~" H 1200 2400 50  0001 C CNN
	1    1200 2400
	0    -1   -1   0   
$EndComp
$Comp
L Device:C_Small C?
U 1 1 5E7452BD
P 1400 2400
F 0 "C?" V 1350 2300 50  0000 C CNN
F 1 "100nF" V 1500 2400 50  0000 C CNN
F 2 "Resistor_SMD:R_0805_2012Metric_Pad1.15x1.40mm_HandSolder" H 1400 2400 50  0001 C CNN
F 3 "~" H 1400 2400 50  0001 C CNN
	1    1400 2400
	1    0    0    -1  
$EndComp
$Comp
L Device:R R?
U 1 1 5E87BF9F
P 1400 1900
F 0 "R?" V 1300 1900 50  0000 C CNN
F 1 "10k" V 1400 1900 50  0000 C CNN
F 2 "Resistor_SMD:R_0805_2012Metric_Pad1.15x1.40mm_HandSolder" V 1330 1900 50  0001 C CNN
F 3 "~" H 1400 1900 50  0001 C CNN
	1    1400 1900
	-1   0    0    1   
$EndComp
$Comp
L power:+3.3V #PWR?
U 1 1 5E8A0F2F
P 1700 1650
F 0 "#PWR?" H 1700 1500 50  0001 C CNN
F 1 "+3.3V" H 1700 1800 50  0000 C CNN
F 2 "" H 1700 1650 50  0001 C CNN
F 3 "" H 1700 1650 50  0001 C CNN
	1    1700 1650
	1    0    0    -1  
$EndComp
Wire Wire Line
	1200 2150 1200 2200
Wire Wire Line
	1200 2150 1400 2150
Wire Wire Line
	1400 2050 1400 2150
Connection ~ 1400 2150
Wire Wire Line
	1400 2150 1400 2300
Wire Wire Line
	1200 2600 1200 2700
Wire Wire Line
	1400 2700 1400 2500
$Comp
L power:GND #PWR?
U 1 1 5EA09319
P 1700 2750
F 0 "#PWR?" H 1700 2500 50  0001 C CNN
F 1 "GND" H 1600 2750 50  0000 C CNN
F 2 "" H 1700 2750 50  0001 C CNN
F 3 "" H 1700 2750 50  0001 C CNN
	1    1700 2750
	1    0    0    -1  
$EndComp
$Comp
L Jumper:SolderJumper_3_Open JP?
U 1 1 5EACB12E
P 1700 2400
F 0 "JP?" H 1500 2450 50  0000 L CNN
F 1 "boot" H 1450 2300 50  0000 L CNN
F 2 "Jumper:SolderJumper-3_P1.3mm_Open_RoundedPad1.0x1.5mm_NumberLabels" H 1700 2400 50  0001 C CNN
F 3 "~" H 1700 2400 50  0001 C CNN
	1    1700 2400
	0    -1   -1   0   
$EndComp
Wire Wire Line
	1700 1750 1400 1750
Wire Wire Line
	1700 1750 1700 2200
Wire Wire Line
	1700 2600 1700 2700
Wire Wire Line
	1700 2700 1400 2700
Connection ~ 1400 2700
Wire Wire Line
	1700 1650 1700 1750
Connection ~ 1700 1750
Wire Wire Line
	1700 2750 1700 2700
Connection ~ 1700 2700
Wire Wire Line
	1200 2700 1400 2700
$Comp
L Device:R R?
U 1 1 5EBDCF5B
P 2100 2400
F 0 "R?" V 2000 2400 50  0000 C CNN
F 1 "10k" V 2100 2400 50  0000 C CNN
F 2 "Resistor_SMD:R_0805_2012Metric_Pad1.15x1.40mm_HandSolder" V 2030 2400 50  0001 C CNN
F 3 "~" H 2100 2400 50  0001 C CNN
	1    2100 2400
	0    -1   1    0   
$EndComp
Wire Wire Line
	2250 2400 2250 2350
Wire Wire Line
	2250 2350 2300 2350
$Comp
L Device:C_Small C?
U 1 1 5D9C3BC1
P 2550 5250
F 0 "C?" V 2500 5350 50  0000 C CNN
F 1 "100nF" V 2600 5400 50  0000 C CNN
F 2 "Resistor_SMD:R_0805_2012Metric_Pad1.15x1.40mm_HandSolder" H 2550 5250 50  0001 C CNN
F 3 "~" H 2550 5250 50  0001 C CNN
	1    2550 5250
	0    1    1    0   
$EndComp
Text GLabel 3650 4700 2    50   Input ~ 0
SWCLK
Wire Wire Line
	2350 5250 2450 5250
Text GLabel 1450 3200 2    50   Input ~ 0
SWCLK
$Comp
L power:GND #PWR?
U 1 1 5EDC3DC8
P 1900 3350
F 0 "#PWR?" H 1900 3100 50  0001 C CNN
F 1 "GND" H 2000 3350 50  0000 C CNN
F 2 "" H 1900 3350 50  0001 C CNN
F 3 "" H 1900 3350 50  0001 C CNN
	1    1900 3350
	1    0    0    -1  
$EndComp
Wire Wire Line
	1900 3350 1900 3300
Wire Wire Line
	1900 3300 1450 3300
Text GLabel 3650 4550 2    50   Input ~ 0
SWDIO
Text GLabel 1450 3400 2    50   Input ~ 0
SWDIO
Text GLabel 1450 3500 2    50   Input ~ 0
NRST
Text GLabel 2200 2050 0    50   Input ~ 0
NRST
Wire Wire Line
	2800 4950 2800 5250
Wire Wire Line
	2800 5250 2650 5250
Wire Wire Line
	2900 4950 2900 5500
Wire Wire Line
	2900 5500 2650 5500
Wire Wire Line
	3000 5750 2650 5750
Wire Wire Line
	2350 5100 2350 5250
Wire Wire Line
	2350 5750 2450 5750
Wire Wire Line
	2350 5250 2350 5500
Connection ~ 2350 5250
Wire Wire Line
	2450 5500 2350 5500
Connection ~ 2350 5500
Wire Wire Line
	2350 5500 2350 5750
Wire Wire Line
	3000 5950 3000 5750
Connection ~ 3000 5750
Wire Wire Line
	3000 4950 3000 5150
Wire Wire Line
	3100 5150 3000 5150
Connection ~ 3000 5150
Wire Wire Line
	3000 5150 3000 5750
Wire Wire Line
	3200 1550 3200 1900
Wire Wire Line
	3000 1950 3000 1900
Connection ~ 3000 1900
Wire Wire Line
	3000 1900 2900 1900
$Comp
L power:GND #PWR?
U 1 1 5F0BE9AA
P 3600 2050
F 0 "#PWR?" H 3600 1800 50  0001 C CNN
F 1 "GND" H 3700 2050 50  0000 C CNN
F 2 "" H 3600 2050 50  0001 C CNN
F 3 "" H 3600 2050 50  0001 C CNN
	1    3600 2050
	1    0    0    -1  
$EndComp
Wire Wire Line
	3600 2050 3600 1900
Wire Wire Line
	3600 1900 3500 1900
Wire Wire Line
	3300 1900 3200 1900
Connection ~ 3200 1900
Wire Wire Line
	3200 1900 3200 1950
Wire Wire Line
	2200 2050 2200 2150
Wire Wire Line
	2200 2150 2300 2150
Text GLabel 2300 2550 0    50   Input ~ 0
I2C2_SDA
Wire Wire Line
	1850 2400 1950 2400
Wire Wire Line
	1400 2150 2200 2150
Connection ~ 2200 2150
Text GLabel 2300 2650 0    50   Input ~ 0
I2C2_SCL
$Comp
L power:GND #PWR?
U 1 1 5DF6DB11
P 4950 4100
F 0 "#PWR?" H 4950 3850 50  0001 C CNN
F 1 "GND" H 4955 3927 50  0000 C CNN
F 2 "" H 4950 4100 50  0001 C CNN
F 3 "" H 4950 4100 50  0001 C CNN
	1    4950 4100
	1    0    0    -1  
$EndComp
$Comp
L Device:D_Zener D?
U 1 1 5F59033F
P 5500 3850
F 0 "D?" H 5550 3800 50  0000 L CNN
F 1 "3.3V" H 5400 3950 50  0000 L CNN
F 2 "Diode_SMD:D_MiniMELF" H 5500 3850 50  0001 C CNN
F 3 "~" H 5500 3850 50  0001 C CNN
	1    5500 3850
	0    1    1    0   
$EndComp
$Comp
L power:GND #PWR?
U 1 1 5F590BF6
P 5500 4100
F 0 "#PWR?" H 5500 3850 50  0001 C CNN
F 1 "GND" H 5505 3927 50  0000 C CNN
F 2 "" H 5500 4100 50  0001 C CNN
F 3 "" H 5500 4100 50  0001 C CNN
	1    5500 4100
	1    0    0    -1  
$EndComp
Wire Wire Line
	5500 3700 5500 3350
Connection ~ 5500 3350
$Comp
L Device:C_Small C?
U 1 1 5F6A8D81
P 4950 3850
F 0 "C?" V 4900 3950 50  0000 C CNN
F 1 "100nF" V 5000 3700 50  0000 C CNN
F 2 "Resistor_SMD:R_0805_2012Metric_Pad1.15x1.40mm_HandSolder" H 4950 3850 50  0001 C CNN
F 3 "~" H 4950 3850 50  0001 C CNN
	1    4950 3850
	1    0    0    1   
$EndComp
$Comp
L Device:C_Small C?
U 1 1 5F6B3B68
P 5250 3850
F 0 "C?" V 5200 3950 50  0000 C CNN
F 1 "100nF" V 5200 3700 50  0000 C CNN
F 2 "Resistor_SMD:R_0805_2012Metric_Pad1.15x1.40mm_HandSolder" H 5250 3850 50  0001 C CNN
F 3 "~" H 5250 3850 50  0001 C CNN
	1    5250 3850
	-1   0    0    1   
$EndComp
Wire Wire Line
	6500 3900 6500 4050
Wire Wire Line
	6500 3550 6500 3700
Wire Wire Line
	5250 3950 5250 4050
Wire Wire Line
	5250 4050 5500 4050
Wire Wire Line
	5500 4050 5500 4000
Wire Wire Line
	5500 4050 5500 4100
Connection ~ 5500 4050
Wire Wire Line
	5250 3750 5250 3350
Connection ~ 5250 3350
Wire Wire Line
	5250 3350 5500 3350
Wire Wire Line
	4950 3750 4950 3550
Wire Wire Line
	3650 4550 3600 4550
Wire Wire Line
	3600 4650 3600 4700
Wire Wire Line
	3600 4700 3650 4700
$Comp
L Device:C_Small C?
U 1 1 5FB33FEC
P 13250 4200
F 0 "C?" V 13200 4300 50  0000 C CNN
F 1 "100n" V 13300 4350 50  0000 C CNN
F 2 "Capacitor_SMD:C_1206_3216Metric" H 13250 4200 50  0001 C CNN
F 3 "~" H 13250 4200 50  0001 C CNN
	1    13250 4200
	-1   0    0    1   
$EndComp
$Comp
L power:+24V #PWR?
U 1 1 5FB894CF
P 12900 3850
F 0 "#PWR?" H 12900 3700 50  0001 C CNN
F 1 "+24V" H 12915 4023 50  0000 C CNN
F 2 "" H 12900 3850 50  0001 C CNN
F 3 "" H 12900 3850 50  0001 C CNN
	1    12900 3850
	1    0    0    -1  
$EndComp
Wire Wire Line
	12900 3850 12900 4000
Connection ~ 12900 4000
$Comp
L Device:L L?
U 1 1 5DF6DB1C
P 15200 4000
F 0 "L?" V 15390 4000 50  0000 C CNN
F 1 "47uH 12A" V 15299 4000 50  0000 C CNN
F 2 "michal_custom_edge:custom_inductor" H 15200 4000 50  0001 C CNN
F 3 "~" H 15200 4000 50  0001 C CNN
	1    15200 4000
	0    -1   -1   0   
$EndComp
Wire Wire Line
	13250 4000 13250 4100
Connection ~ 13250 4000
$Comp
L Transistor_FET:QM6015D Q?
U 1 1 5DF6DB1F
P 14550 1850
F 0 "Q?" V 14950 1850 50  0000 C CNN
F 1 "AOD4185" V 14850 1850 50  0000 C CNN
F 2 "Package_TO_SOT_SMD:TO-252-2" H 14750 1775 50  0001 L CIN
F 3 "http://www.jaolen.com/images/pdf/QM6015D.pdf" V 14550 1850 50  0001 L CNN
	1    14550 1850
	0    1    -1   0   
$EndComp
Connection ~ 15600 4000
Wire Wire Line
	14100 1750 13950 1750
$Comp
L Device:Fuse F?
U 1 1 600288DA
P 13400 1750
F 0 "F?" V 13200 1750 50  0000 C CNN
F 1 "8A F" V 13300 1750 50  0000 C CNN
F 2 "fuses:Fuseholder5x20_horiz_open_universal_Type-III" V 13330 1750 50  0001 C CNN
F 3 "~" H 13400 1750 50  0001 C CNN
	1    13400 1750
	0    1    1    0   
$EndComp
Connection ~ 15400 4000
Wire Wire Line
	15400 4000 15600 4000
Connection ~ 14250 2150
Wire Wire Line
	14250 2150 14250 2300
Wire Wire Line
	14250 2150 14100 2150
Wire Wire Line
	13750 2150 13750 2050
$Comp
L Device:R R?
U 1 1 5DF6DB2A
P 11950 1950
F 0 "R?" H 12100 2000 50  0000 C CNN
F 1 "100k" V 11950 1950 50  0000 C CNN
F 2 "Resistor_SMD:R_1206_3216Metric_Pad1.42x1.75mm_HandSolder" V 11880 1950 50  0001 C CNN
F 3 "~" H 11950 1950 50  0001 C CNN
	1    11950 1950
	1    0    0    1   
$EndComp
$Comp
L Device:Fuse F?
U 1 1 5DF6DB2C
P 12600 1750
F 0 "F?" V 12400 1800 50  0000 C CNN
F 1 "20A F" V 12500 1800 50  0000 C CNN
F 2 "fuses:Fuseholder5x20_horiz_open_universal_Type-III" V 12530 1750 50  0001 C CNN
F 3 "~" H 12600 1750 50  0001 C CNN
	1    12600 1750
	0    1    1    0   
$EndComp
Wire Wire Line
	12250 2150 12250 2050
$Comp
L Transistor_FET:QM6015D Q?
U 1 1 6096B5F9
P 12250 1850
F 0 "Q?" V 12650 1850 50  0000 C CNN
F 1 "AOD4185" V 12550 1850 50  0000 C CNN
F 2 "Package_TO_SOT_SMD:TO-252-2" H 12450 1775 50  0001 L CIN
F 3 "http://www.jaolen.com/images/pdf/QM6015D.pdf" V 12250 1850 50  0001 L CNN
	1    12250 1850
	0    1    -1   0   
$EndComp
$Comp
L Device:LED D?
U 1 1 6096B5EA
P 12400 2700
F 0 "D?" V 12450 2850 50  0000 R CNN
F 1 "LED" V 12350 2900 50  0000 R CNN
F 2 "Diode_SMD:D_1206_3216Metric_Pad1.42x1.75mm_HandSolder" H 12400 2700 50  0001 C CNN
F 3 "~" H 12400 2700 50  0001 C CNN
	1    12400 2700
	0    1    -1   0   
$EndComp
Wire Wire Line
	11500 2150 11500 2050
Wire Wire Line
	11700 1750 11800 1750
$Comp
L Transistor_FET:QM6015D Q?
U 1 1 6096B5B8
P 11500 1850
F 0 "Q?" V 11900 1850 50  0000 C CNN
F 1 "AOD4185" V 11800 1850 50  0000 C CNN
F 2 "Package_TO_SOT_SMD:TO-252-2" H 11700 1775 50  0001 L CIN
F 3 "http://www.jaolen.com/images/pdf/QM6015D.pdf" V 11500 1850 50  0001 L CNN
	1    11500 1850
	0    -1   -1   0   
$EndComp
Wire Wire Line
	13250 1750 13100 1750
Wire Wire Line
	15600 1750 15600 4000
Wire Wire Line
	11500 2150 11800 2150
$Comp
L Transistor_FET:QM6015D Q?
U 1 1 6081BE11
P 13750 1850
F 0 "Q?" V 14150 1850 50  0000 C CNN
F 1 "AOD4185" V 14050 1850 50  0000 C CNN
F 2 "Package_TO_SOT_SMD:TO-252-2" H 13950 1775 50  0001 L CIN
F 3 "http://www.jaolen.com/images/pdf/QM6015D.pdf" V 13750 1850 50  0001 L CNN
	1    13750 1850
	0    -1   -1   0   
$EndComp
$Comp
L Connector:Conn_01x01_Male J?
U 1 1 614CA92D
P 12350 4000
F 0 "J?" H 12450 3950 50  0000 R CNN
F 1 "24V" H 12300 4000 50  0000 R CNN
F 2 "Connector_Wire:SolderWirePad_1x01_Drill0.8mm" H 12350 4000 50  0001 C CNN
F 3 "~" H 12350 4000 50  0001 C CNN
	1    12350 4000
	1    0    0    -1  
$EndComp
$Comp
L Connector:Conn_01x01_Male J?
U 1 1 614CA933
P 12350 4150
F 0 "J?" H 12450 4100 50  0000 R CNN
F 1 "gnd" H 12300 4150 50  0000 R CNN
F 2 "Connector_Wire:SolderWirePad_1x01_Drill0.8mm" H 12350 4150 50  0001 C CNN
F 3 "~" H 12350 4150 50  0001 C CNN
	1    12350 4150
	1    0    0    -1  
$EndComp
Wire Wire Line
	12550 4000 12700 4000
Wire Wire Line
	12550 4150 12550 4800
Wire Wire Line
	13250 4300 13250 4450
Wire Wire Line
	5500 3350 6500 3350
Wire Wire Line
	6450 6200 6500 6200
Wire Wire Line
	6350 6100 6650 6100
Connection ~ 6350 6100
Wire Wire Line
	6700 6100 6700 6050
Connection ~ 6650 6100
Wire Wire Line
	6650 6100 6700 6100
Wire Wire Line
	6500 6200 6500 6500
$Comp
L Regulator_Linear:AP2127K-3.3 U?
U 1 1 5D7ED240
P 2100 6900
F 0 "U?" H 2100 7242 50  0000 C CNN
F 1 "AP2127K-3.3" H 2100 7151 50  0000 C CNN
F 2 "Package_TO_SOT_SMD:SOT-23-5" H 2100 7225 50  0001 C CNN
F 3 "https://www.diodes.com/assets/Datasheets/AP2127.pdf" H 2100 7000 50  0001 C CNN
	1    2100 6900
	1    0    0    -1  
$EndComp
$Comp
L power:+3.3V #PWR?
U 1 1 5D82D200
P 2650 6750
F 0 "#PWR?" H 2650 6600 50  0001 C CNN
F 1 "+3.3V" H 2650 6900 50  0000 C CNN
F 2 "" H 2650 6750 50  0001 C CNN
F 3 "" H 2650 6750 50  0001 C CNN
	1    2650 6750
	1    0    0    -1  
$EndComp
$Comp
L Device:C_Small C?
U 1 1 5D83D807
P 1550 6950
F 0 "C?" H 1650 7000 50  0000 C CNN
F 1 "1uF" H 1650 6850 50  0000 C CNN
F 2 "Resistor_SMD:R_1206_3216Metric_Pad1.42x1.75mm_HandSolder" H 1550 6950 50  0001 C CNN
F 3 "~" H 1550 6950 50  0001 C CNN
	1    1550 6950
	-1   0    0    -1  
$EndComp
$Comp
L power:GND #PWR?
U 1 1 5D83F765
P 2100 7350
F 0 "#PWR?" H 2100 7100 50  0001 C CNN
F 1 "GND" H 2200 7350 50  0000 C CNN
F 2 "" H 2100 7350 50  0001 C CNN
F 3 "" H 2100 7350 50  0001 C CNN
	1    2100 7350
	1    0    0    -1  
$EndComp
Wire Wire Line
	2100 7200 2100 7350
Wire Wire Line
	2100 7200 2500 7200
Connection ~ 2100 7200
Wire Wire Line
	1550 7200 1550 7050
Wire Wire Line
	1550 7200 2100 7200
Wire Wire Line
	2400 6800 2500 6800
Wire Wire Line
	2650 6800 2650 6750
Wire Wire Line
	2500 6800 2500 6850
Connection ~ 2500 6800
Wire Wire Line
	2500 6800 2650 6800
$Comp
L Device:CP_Small C?
U 1 1 5DF6DB22
P 9200 1950
F 0 "C?" V 9350 1800 50  0000 C CNN
F 1 "10uF" V 9250 1800 50  0000 C CNN
F 2 "Capacitor_SMD:CP_Elec_4x5.3" H 9200 1950 50  0001 C CNN
F 3 "~" H 9200 1950 50  0001 C CNN
	1    9200 1950
	0    -1   -1   0   
$EndComp
$Comp
L Device:C_Small C?
U 1 1 6011F79C
P 9200 2150
F 0 "C?" V 9150 2300 50  0000 C CNN
F 1 "100n" V 9250 2300 50  0000 C CNN
F 2 "Capacitor_SMD:C_1206_3216Metric_Pad1.42x1.75mm_HandSolder" H 9200 2150 50  0001 C CNN
F 3 "~" H 9200 2150 50  0001 C CNN
	1    9200 2150
	0    1    1    0   
$EndComp
Wire Wire Line
	9500 2150 9500 2200
Wire Wire Line
	9300 2150 9500 2150
$Comp
L power:GND #PWR?
U 1 1 5E3E8576
P 9850 2200
F 0 "#PWR?" H 9850 1950 50  0001 C CNN
F 1 "GND" H 9855 2027 50  0001 C CNN
F 2 "" H 9850 2200 50  0001 C CNN
F 3 "" H 9850 2200 50  0001 C CNN
	1    9850 2200
	1    0    0    -1  
$EndComp
Connection ~ 9500 2150
Wire Wire Line
	9850 2150 9850 2200
$Comp
L michal_lib:R_0 R?
U 1 1 5E6B1D5E
P 9700 2150
F 0 "R?" V 9600 2150 50  0000 C CNN
F 1 "0" V 9700 2150 50  0000 C CNN
F 2 "Resistor_SMD:R_1206_3216Metric" H 9700 2150 50  0001 C CNN
F 3 "~" H 9700 2150 50  0001 C CNN
	1    9700 2150
	0    1    1    0   
$EndComp
Wire Wire Line
	9850 2150 9800 2150
Wire Wire Line
	9500 2150 9600 2150
$Comp
L power:GNDA #PWR?
U 1 1 5E7DC067
P 9500 2200
F 0 "#PWR?" H 9500 1950 50  0001 C CNN
F 1 "GNDA" H 9500 2050 50  0000 C CNN
F 2 "" H 9500 2200 50  0001 C CNN
F 3 "" H 9500 2200 50  0001 C CNN
	1    9500 2200
	1    0    0    -1  
$EndComp
$Comp
L power:GNDA #PWR?
U 1 1 5E7E6552
P 9000 2800
F 0 "#PWR?" H 9000 2550 50  0001 C CNN
F 1 "GNDA" H 9005 2627 50  0000 C CNN
F 2 "" H 9000 2800 50  0001 C CNN
F 3 "" H 9000 2800 50  0001 C CNN
	1    9000 2800
	1    0    0    -1  
$EndComp
Wire Wire Line
	9850 1950 9850 2150
Wire Wire Line
	9300 1950 9850 1950
Connection ~ 9850 2150
Wire Wire Line
	1550 6850 1550 6800
Connection ~ 1550 6800
Wire Wire Line
	1800 6800 1700 6800
Wire Wire Line
	1800 6900 1700 6900
Wire Wire Line
	1700 6900 1700 6800
Connection ~ 1700 6800
Wire Wire Line
	1700 6800 1550 6800
Wire Wire Line
	900  10850 900  10950
Wire Wire Line
	900  10550 900  10500
$Comp
L Device:R R?
U 1 1 5F062E86
P 900 10700
F 0 "R?" V 800 10700 50  0000 C CNN
F 1 "0R" V 900 10700 50  0000 C CNN
F 2 "Resistor_SMD:R_1206_3216Metric_Pad1.42x1.75mm_HandSolder" V 830 10700 50  0001 C CNN
F 3 "~" H 900 10700 50  0001 C CNN
	1    900  10700
	1    0    0    -1  
$EndComp
$Comp
L power:+5C #PWR?
U 1 1 5F0CFCD2
P 6100 1850
F 0 "#PWR?" H 6100 1700 50  0001 C CNN
F 1 "+5C" H 6115 2023 50  0000 C CNN
F 2 "" H 6100 1850 50  0001 C CNN
F 3 "" H 6100 1850 50  0001 C CNN
	1    6100 1850
	1    0    0    -1  
$EndComp
$Comp
L power:+5C #PWR?
U 1 1 5F11565A
P 1550 6750
F 0 "#PWR?" H 1550 6600 50  0001 C CNN
F 1 "+5C" H 1565 6923 50  0000 C CNN
F 2 "" H 1550 6750 50  0001 C CNN
F 3 "" H 1550 6750 50  0001 C CNN
	1    1550 6750
	1    0    0    -1  
$EndComp
Wire Wire Line
	1550 6800 1550 6750
$Comp
L power:+5V #PWR?
U 1 1 5F184174
P 900 10500
F 0 "#PWR?" H 900 10350 50  0001 C CNN
F 1 "+5V" H 915 10673 50  0000 C CNN
F 2 "" H 900 10500 50  0001 C CNN
F 3 "" H 900 10500 50  0001 C CNN
	1    900  10500
	1    0    0    -1  
$EndComp
$Comp
L power:+5C #PWR?
U 1 1 5F35E15F
P 900 10950
F 0 "#PWR?" H 900 10800 50  0001 C CNN
F 1 "+5C" H 900 11100 50  0000 C CNN
F 2 "" H 900 10950 50  0001 C CNN
F 3 "" H 900 10950 50  0001 C CNN
	1    900  10950
	-1   0    0    1   
$EndComp
Wire Wire Line
	9100 1950 9100 2150
Connection ~ 9100 1950
$Comp
L power:+5F #PWR?
U 1 1 5DF6DB0C
P 9000 2150
F 0 "#PWR?" H 9000 2000 50  0001 C CNN
F 1 "+5F" H 8950 2250 50  0000 C CNN
F 2 "" H 9000 2150 50  0001 C CNN
F 3 "" H 9000 2150 50  0001 C CNN
	1    9000 2150
	1    0    0    -1  
$EndComp
Wire Wire Line
	1200 10850 1200 10950
Wire Wire Line
	1200 10550 1200 10500
$Comp
L Device:R R?
U 1 1 5F3DE524
P 1200 10700
F 0 "R?" V 1100 10700 50  0000 C CNN
F 1 "0R" V 1200 10700 50  0000 C CNN
F 2 "Resistor_SMD:R_1206_3216Metric_Pad1.42x1.75mm_HandSolder" V 1130 10700 50  0001 C CNN
F 3 "~" H 1200 10700 50  0001 C CNN
	1    1200 10700
	1    0    0    -1  
$EndComp
$Comp
L power:+5V #PWR?
U 1 1 5F3DE52A
P 1200 10500
F 0 "#PWR?" H 1200 10350 50  0001 C CNN
F 1 "+5V" H 1215 10673 50  0000 C CNN
F 2 "" H 1200 10500 50  0001 C CNN
F 3 "" H 1200 10500 50  0001 C CNN
	1    1200 10500
	1    0    0    -1  
$EndComp
$Comp
L power:+5F #PWR?
U 1 1 5F41B818
P 1200 10950
F 0 "#PWR?" H 1200 10800 50  0001 C CNN
F 1 "+5F" H 1200 11100 50  0000 C CNN
F 2 "" H 1200 10950 50  0001 C CNN
F 3 "" H 1200 10950 50  0001 C CNN
	1    1200 10950
	-1   0    0    1   
$EndComp
$Sheet
S 600  8600 1050 900 
U 5DD14837
F0 "driver with LCD" 50
F1 "driver_board.sch" 50
$EndSheet
Wire Wire Line
	2450 8300 2550 8300
Wire Wire Line
	2450 8450 2550 8450
$Comp
L Connector:Conn_01x01_Male J?
U 1 1 602B6E52
P 2250 8450
F 0 "J?" H 2350 8400 50  0000 R CNN
F 1 "scl" H 2200 8600 50  0000 R CNN
F 2 "Connector_Wire:SolderWirePad_1x01_Drill0.8mm" H 2250 8450 50  0001 C CNN
F 3 "~" H 2250 8450 50  0001 C CNN
	1    2250 8450
	1    0    0    -1  
$EndComp
$Comp
L Connector:Conn_01x01_Male J?
U 1 1 602AF3F2
P 2250 8300
F 0 "J?" H 2350 8250 50  0000 R CNN
F 1 "5v" H 2450 8350 50  0000 R CNN
F 2 "Connector_Wire:SolderWirePad_1x01_Drill0.8mm" H 2250 8300 50  0001 C CNN
F 3 "~" H 2250 8300 50  0001 C CNN
	1    2250 8300
	1    0    0    -1  
$EndComp
$Comp
L power:+5V #PWR?
U 1 1 5D9E2D63
P 2550 8300
F 0 "#PWR?" H 2550 8150 50  0001 C CNN
F 1 "+5V" V 2550 8500 50  0000 C CNN
F 2 "" H 2550 8300 50  0001 C CNN
F 3 "" H 2550 8300 50  0001 C CNN
	1    2550 8300
	0    1    1    0   
$EndComp
Text GLabel 2550 8450 2    50   Input ~ 0
I2C2_SCL
Text GLabel 2550 8550 2    50   Input ~ 0
I2C2_SDA
$Comp
L power:-5V #PWR?
U 1 1 5E32AC79
P 2550 8850
F 0 "#PWR?" H 2550 8950 50  0001 C CNN
F 1 "-5V" V 2565 8978 50  0000 L CNN
F 2 "" H 2550 8850 50  0001 C CNN
F 3 "" H 2550 8850 50  0001 C CNN
	1    2550 8850
	0    1    1    0   
$EndComp
$Comp
L power:GND #PWR?
U 1 1 5E339DD6
P 2550 8700
F 0 "#PWR?" H 2550 8450 50  0001 C CNN
F 1 "GND" V 2550 8450 50  0000 C CNN
F 2 "" H 2550 8700 50  0001 C CNN
F 3 "" H 2550 8700 50  0001 C CNN
	1    2550 8700
	0    -1   -1   0   
$EndComp
$Comp
L Connector:Conn_01x01_Male J?
U 1 1 602B71A8
P 2250 8550
F 0 "J?" H 2350 8500 50  0000 R CNN
F 1 "sda" H 2250 8550 50  0000 R CNN
F 2 "Connector_Wire:SolderWirePad_1x01_Drill0.8mm" H 2250 8550 50  0001 C CNN
F 3 "~" H 2250 8550 50  0001 C CNN
	1    2250 8550
	1    0    0    -1  
$EndComp
$Comp
L Connector:Conn_01x01_Male J?
U 1 1 602B74E6
P 2250 8700
F 0 "J?" H 2350 8650 50  0000 R CNN
F 1 "gnd" H 2250 8700 50  0000 R CNN
F 2 "Connector_Wire:SolderWirePad_1x01_Drill0.8mm" H 2250 8700 50  0001 C CNN
F 3 "~" H 2250 8700 50  0001 C CNN
	1    2250 8700
	1    0    0    -1  
$EndComp
$Comp
L Connector:Conn_01x01_Male J?
U 1 1 602B7792
P 2250 8850
F 0 "J?" H 2350 8800 50  0000 R CNN
F 1 "-5" H 2200 8850 50  0000 R CNN
F 2 "Connector_Wire:SolderWirePad_1x01_Drill0.8mm" H 2250 8850 50  0001 C CNN
F 3 "~" H 2250 8850 50  0001 C CNN
	1    2250 8850
	1    0    0    -1  
$EndComp
Wire Wire Line
	2450 8850 2550 8850
Wire Wire Line
	2450 8700 2550 8700
Wire Wire Line
	2450 8550 2550 8550
Wire Wire Line
	9400 5850 9550 5850
$Comp
L michal_lib:AD8630 U?
U 2 1 5D068AAE
P 9100 5850
F 0 "U?" H 9100 6217 50  0000 C CNN
F 1 "MCP6V74-E" H 9100 6126 50  0000 C CNN
F 2 "Package_SO:TSSOP-14_4.4x5mm_P0.65mm" H 9050 5950 50  0001 C CNN
F 3 "http://www.ti.com/lit/ds/symlink/tl081.pdf" H 9150 6050 50  0001 C CNN
	2    9100 5850
	1    0    0    -1  
$EndComp
Wire Wire Line
	8750 6150 8750 5950
Wire Wire Line
	8750 6150 9550 6150
Wire Wire Line
	8750 5950 8800 5950
Wire Wire Line
	6400 5400 5400 5400
Connection ~ 6400 5400
Connection ~ 5400 5400
Wire Notes Line
	1300 7450 2950 7450
Wire Notes Line
	2950 7450 2950 6500
Wire Notes Line
	2950 6500 1300 6500
Wire Notes Line
	1300 6500 1300 7450
Text Notes 1400 7400 0    50   ~ 0
3.3V reg\n
Wire Wire Line
	10400 5450 10700 5450
Wire Wire Line
	10000 5850 10400 5850
$Comp
L Device:R R?
U 1 1 5E55F7CC
P 9650 6800
F 0 "R?" V 9750 6800 50  0000 C CNN
F 1 "1M8" V 9650 6800 50  0000 C CNN
F 2 "Resistor_SMD:R_1206_3216Metric_Pad1.42x1.75mm_HandSolder" V 9580 6800 50  0001 C CNN
F 3 "~" H 9650 6800 50  0001 C CNN
	1    9650 6800
	-1   0    0    1   
$EndComp
$Comp
L power:-5V #PWR?
U 1 1 5DF6DAEA
P 9650 6600
F 0 "#PWR?" H 9650 6700 50  0001 C CNN
F 1 "-5V" H 9665 6773 50  0000 C CNN
F 2 "" H 9650 6600 50  0001 C CNN
F 3 "" H 9650 6600 50  0001 C CNN
	1    9650 6600
	1    0    0    -1  
$EndComp
Wire Wire Line
	9650 6600 9650 6650
Wire Wire Line
	10200 6300 10200 6600
Wire Wire Line
	9100 6300 9100 6700
Connection ~ 9100 6300
Wire Wire Line
	9100 6300 10200 6300
Wire Wire Line
	9650 6950 9650 7000
Connection ~ 9650 7000
Wire Wire Line
	9650 7000 9750 7000
$Comp
L Device:LED D?
U 1 1 5E819B00
P 4450 4100
F 0 "D?" V 4489 3983 50  0000 R CNN
F 1 "LED" V 4398 3983 50  0000 R CNN
F 2 "Diode_SMD:D_0805_2012Metric" H 4450 4100 50  0001 C CNN
F 3 "~" H 4450 4100 50  0001 C CNN
	1    4450 4100
	0    -1   -1   0   
$EndComp
$Comp
L Device:R R?
U 1 1 5E819B06
P 4000 3900
F 0 "R?" V 3900 3900 50  0000 C CNN
F 1 "680" V 4000 3900 50  0000 C CNN
F 2 "Resistor_SMD:R_0805_2012Metric" V 3930 3900 50  0001 C CNN
F 3 "~" H 4000 3900 50  0001 C CNN
	1    4000 3900
	0    1    1    0   
$EndComp
Wire Wire Line
	3700 3550 3700 3900
Wire Wire Line
	3700 3900 3850 3900
$Comp
L power:GND #PWR?
U 1 1 5E8F79C1
P 4450 4300
F 0 "#PWR?" H 4450 4050 50  0001 C CNN
F 1 "GND" H 4600 4250 50  0000 C CNN
F 2 "" H 4450 4300 50  0001 C CNN
F 3 "" H 4450 4300 50  0001 C CNN
	1    4450 4300
	1    0    0    -1  
$EndComp
Wire Wire Line
	4450 4300 4450 4250
$Comp
L power:GND #PWR?
U 1 1 5DF6DAC7
P 11400 7450
F 0 "#PWR?" H 11400 7200 50  0001 C CNN
F 1 "GND" H 11405 7277 50  0000 C CNN
F 2 "" H 11400 7450 50  0001 C CNN
F 3 "" H 11400 7450 50  0001 C CNN
	1    11400 7450
	1    0    0    -1  
$EndComp
$Comp
L michal_lib:XL4016 U?
U 1 1 5D6EB387
P 14400 4100
F 0 "U?" H 14350 4467 50  0000 C CNN
F 1 "XL4016" H 14350 4376 50  0000 C CNN
F 2 "Package_TO_SOT_THT:TO-220-5_Horizontal_TabUp" H 14400 3850 50  0001 L CIN
F 3 "http://www.ti.com/lit/ds/symlink/lm2576.pdf" H 14400 4100 50  0001 C CNN
	1    14400 4100
	1    0    0    -1  
$EndComp
Connection ~ 13250 4450
Wire Wire Line
	13250 4450 13250 4800
Wire Wire Line
	13900 4200 13900 4450
Wire Wire Line
	12900 4000 13250 4000
$Comp
L Device:C_Small C?
U 1 1 5DAC6891
P 12900 4300
F 0 "C?" V 12850 4400 50  0000 C CNN
F 1 "470u" V 12950 4450 50  0000 C CNN
F 2 "Capacitor_THT:CP_Radial_D10.0mm_P5.00mm" H 12900 4300 50  0001 C CNN
F 3 "~" H 12900 4300 50  0001 C CNN
	1    12900 4300
	-1   0    0    1   
$EndComp
Wire Wire Line
	12700 4400 12700 4800
Wire Wire Line
	12900 4400 12900 4800
Wire Wire Line
	12900 4200 12900 4000
Wire Wire Line
	12700 4200 12700 4000
Connection ~ 12700 4000
Wire Wire Line
	12700 4000 12900 4000
$Comp
L Amplifier_Operational:MC33172 U?
U 2 1 5DF6DAD6
P 13550 6500
F 0 "U?" H 13650 6750 50  0000 C CNN
F 1 "MC33172" H 13650 6650 50  0000 C CNN
F 2 "" H 13550 6500 50  0001 C CNN
F 3 "http://www.onsemi.com/pub/Collateral/MC33171-D.PDF" H 13550 6500 50  0001 C CNN
	2    13550 6500
	1    0    0    -1  
$EndComp
$Comp
L Amplifier_Operational:MC33172 U?
U 3 1 5DF6DAD7
P 13550 5550
F 0 "U?" H 13600 5450 50  0001 L CNN
F 1 "MC33172" H 13500 5350 50  0001 L CNN
F 2 "" H 13550 5550 50  0001 C CNN
F 3 "http://www.onsemi.com/pub/Collateral/MC33171-D.PDF" H 13550 5550 50  0001 C CNN
	3    13550 5550
	1    0    0    -1  
$EndComp
$Comp
L power:+5V #PWR?
U 1 1 5DF6DADA
P 13450 5200
F 0 "#PWR?" H 13450 5050 50  0001 C CNN
F 1 "+5V" H 13465 5373 50  0000 C CNN
F 2 "" H 13450 5200 50  0001 C CNN
F 3 "" H 13450 5200 50  0001 C CNN
	1    13450 5200
	1    0    0    -1  
$EndComp
Wire Wire Line
	13450 5200 13450 5250
$Comp
L power:GND #PWR?
U 1 1 5DD22BCB
P 13450 5850
F 0 "#PWR?" H 13450 5600 50  0001 C CNN
F 1 "GND" H 13550 5850 50  0000 C CNN
F 2 "" H 13450 5850 50  0001 C CNN
F 3 "" H 13450 5850 50  0001 C CNN
	1    13450 5850
	1    0    0    -1  
$EndComp
Wire Wire Line
	15600 4000 15600 4300
Wire Wire Line
	15400 4300 15400 4000
$Comp
L Device:C_Small C?
U 1 1 5E070C8C
P 15600 4400
F 0 "C?" V 15550 4500 50  0000 C CNN
F 1 "1000uF" V 15650 4550 50  0000 C CNN
F 2 "Capacitor_THT:CP_Radial_D10.0mm_P5.00mm" H 15600 4400 50  0001 C CNN
F 3 "~" H 15600 4400 50  0001 C CNN
	1    15600 4400
	-1   0    0    1   
$EndComp
$Comp
L Device:C_Small C?
U 1 1 5DF6DAE3
P 15400 4400
F 0 "C?" V 15350 4500 50  0000 C CNN
F 1 "1000uF" V 15450 4550 50  0000 C CNN
F 2 "Capacitor_THT:CP_Radial_D10.0mm_P5.00mm" H 15400 4400 50  0001 C CNN
F 3 "~" H 15400 4400 50  0001 C CNN
	1    15400 4400
	-1   0    0    1   
$EndComp
$Comp
L Device:D_Schottky_AKA D?
U 1 1 5DF4E760
P 15000 4350
F 0 "D?" H 14950 4450 50  0000 L CNN
F 1 "MBR20100CT" H 14800 4250 50  0000 L CNN
F 2 "Package_TO_SOT_THT:TO-220-3_Horizontal_TabUp" H 15000 4350 50  0001 C CNN
F 3 "~" H 15000 4350 50  0001 C CNN
	1    15000 4350
	0    1    1    0   
$EndComp
Wire Wire Line
	15100 4800 15000 4800
Connection ~ 15100 4800
Wire Wire Line
	15100 4550 15100 4800
Wire Wire Line
	15000 4800 14400 4800
Connection ~ 15000 4800
Wire Wire Line
	15000 4550 15000 4800
Wire Wire Line
	15400 4800 15100 4800
Connection ~ 15400 4800
Wire Wire Line
	15400 4500 15400 4800
$Comp
L power:GND #PWR?
U 1 1 5FCED1B2
P 14400 4950
F 0 "#PWR?" H 14400 4700 50  0001 C CNN
F 1 "GND" H 14500 4950 50  0000 C CNN
F 2 "" H 14400 4950 50  0001 C CNN
F 3 "" H 14400 4950 50  0001 C CNN
	1    14400 4950
	1    0    0    -1  
$EndComp
Wire Wire Line
	15600 4800 15400 4800
Wire Wire Line
	14400 4400 14400 4800
Connection ~ 14400 4800
Wire Wire Line
	14400 4800 14400 4950
Wire Wire Line
	15600 4500 15600 4800
Wire Wire Line
	15600 4000 15750 4000
Wire Wire Line
	15750 4000 15750 5050
Wire Wire Line
	15750 5050 14850 5050
$Comp
L Device:R_POT RV?
U 1 1 5E34F0CF
P 14850 5250
F 0 "RV?" H 14800 5250 50  0000 R CNN
F 1 "10k" V 14850 5300 50  0000 R CNN
F 2 "Potentiometer_SMD:Potentiometer_Bourns_3214J_Horizontal" H 14850 5250 50  0001 C CNN
F 3 "~" H 14850 5250 50  0001 C CNN
	1    14850 5250
	-1   0    0    -1  
$EndComp
Wire Wire Line
	14850 5050 14850 5100
Wire Wire Line
	14700 5250 14700 5450
Wire Wire Line
	14700 5450 14850 5450
Wire Wire Line
	14850 5450 14850 5400
$Comp
L Device:R R?
U 1 1 5DF6DAE7
P 14850 5750
F 0 "R?" H 14750 5750 50  0000 C CNN
F 1 "360" V 14850 5750 50  0000 C CNN
F 2 "Resistor_SMD:R_1206_3216Metric_Pad1.42x1.75mm_HandSolder" V 14780 5750 50  0001 C CNN
F 3 "~" H 14850 5750 50  0001 C CNN
	1    14850 5750
	-1   0    0    1   
$EndComp
Wire Wire Line
	14850 5450 14850 5550
Connection ~ 14850 5450
$Comp
L power:GND #PWR?
U 1 1 5E4126AD
P 14850 6050
F 0 "#PWR?" H 14850 5800 50  0001 C CNN
F 1 "GND" H 14950 6050 50  0000 C CNN
F 2 "" H 14850 6050 50  0001 C CNN
F 3 "" H 14850 6050 50  0001 C CNN
	1    14850 6050
	1    0    0    -1  
$EndComp
Wire Wire Line
	14850 5900 14850 6050
Wire Wire Line
	15400 4000 15350 4000
Wire Wire Line
	15050 4000 15000 4000
Wire Wire Line
	15000 4200 15000 4000
Connection ~ 15000 4000
Wire Wire Line
	15000 4000 14800 4000
Wire Wire Line
	14800 4200 14850 4200
Wire Wire Line
	14850 4200 14850 4600
Wire Wire Line
	14850 4600 14650 4600
Wire Wire Line
	14650 4600 14650 5550
Wire Wire Line
	14650 5550 14550 5550
Connection ~ 14850 5550
Wire Wire Line
	14850 5550 14850 5600
$Comp
L Transistor_FET:2N7002 Q?
U 1 1 5DF6DAEC
P 14300 6500
F 0 "Q?" H 14506 6546 50  0000 L CNN
F 1 "2N7002" H 14506 6455 50  0000 L CNN
F 2 "Package_TO_SOT_SMD:SOT-23" H 14500 6425 50  0001 L CIN
F 3 "https://www.fairchildsemi.com/datasheets/2N/2N7002.pdf" H 14300 6500 50  0001 L CNN
	1    14300 6500
	1    0    0    -1  
$EndComp
$Comp
L Device:R R?
U 1 1 5DF6DAEE
P 14100 5550
F 0 "R?" V 14000 5550 50  0000 C CNN
F 1 "100" V 14100 5550 50  0000 C CNN
F 2 "Resistor_SMD:R_1206_3216Metric_Pad1.42x1.75mm_HandSolder" V 14030 5550 50  0001 C CNN
F 3 "~" H 14100 5550 50  0001 C CNN
	1    14100 5550
	0    -1   -1   0   
$EndComp
Wire Wire Line
	13800 5550 13900 5550
$Comp
L Diode:1N4148WT D?
U 1 1 5DF6DAF5
P 14400 5550
F 0 "D?" H 14400 5333 50  0000 C CNN
F 1 "1N4148WT" H 14400 5424 50  0000 C CNN
F 2 "Diode_SMD:D_SOD-523" H 14400 5375 50  0001 C CNN
F 3 "https://www.diodes.com/assets/Datasheets/ds30396.pdf" H 14400 5550 50  0001 C CNN
	1    14400 5550
	-1   0    0    1   
$EndComp
Connection ~ 14650 5550
Wire Wire Line
	14650 5550 14850 5550
Wire Wire Line
	12550 4800 12700 4800
Wire Wire Line
	12900 4800 12700 4800
Connection ~ 12700 4800
Wire Wire Line
	12900 4800 13250 4800
Connection ~ 12900 4800
Wire Wire Line
	13250 4800 14400 4800
Connection ~ 13250 4800
Wire Wire Line
	13250 4450 13900 4450
Wire Wire Line
	13250 4000 13900 4000
$Comp
L power:+5V #PWR?
U 1 1 5E9E7EB7
P 12550 5200
F 0 "#PWR?" H 12550 5050 50  0001 C CNN
F 1 "+5V" H 12565 5373 50  0000 C CNN
F 2 "" H 12550 5200 50  0001 C CNN
F 3 "" H 12550 5200 50  0001 C CNN
	1    12550 5200
	1    0    0    -1  
$EndComp
$Comp
L Device:R R?
U 1 1 5E9EEA34
P 12550 5450
F 0 "R?" H 12650 5500 50  0000 C CNN
F 1 "2.2k" V 12550 5450 50  0000 C CNN
F 2 "Resistor_SMD:R_1206_3216Metric_Pad1.42x1.75mm_HandSolder" V 12480 5450 50  0001 C CNN
F 3 "~" H 12550 5450 50  0001 C CNN
	1    12550 5450
	1    0    0    -1  
$EndComp
Wire Wire Line
	12550 5200 12550 5300
Wire Wire Line
	12550 5600 12550 5700
$Comp
L Reference_Voltage:TL431DBZ U?
U 1 1 5EAB3FA8
P 12150 5950
F 0 "U?" H 12196 5880 50  0000 R CNN
F 1 "TL431DBZ" H 12300 5800 50  0000 R CNN
F 2 "Package_TO_SOT_SMD:SOT-23" H 12150 5800 50  0001 C CIN
F 3 "http://www.ti.com/lit/ds/symlink/tl431.pdf" H 12150 5950 50  0001 C CIN
	1    12150 5950
	0    -1   -1   0   
$EndComp
$Comp
L Device:R_POT RV?
U 1 1 5EA2E4A0
P 12550 5950
F 0 "RV?" H 12700 5800 50  0000 R CNN
F 1 "10k" V 12550 6000 50  0000 R CNN
F 2 "Potentiometer_SMD:Potentiometer_Bourns_3214J_Horizontal" H 12550 5950 50  0001 C CNN
F 3 "~" H 12550 5950 50  0001 C CNN
	1    12550 5950
	1    0    0    1   
$EndComp
Wire Wire Line
	12050 5950 12000 5950
Wire Wire Line
	12000 5950 12000 5700
Wire Wire Line
	12000 5700 12150 5700
Connection ~ 12550 5700
Wire Wire Line
	12550 5700 12550 5800
Wire Wire Line
	12150 5850 12150 5700
Connection ~ 12150 5700
Wire Wire Line
	12150 5700 12550 5700
Wire Wire Line
	12150 6050 12150 6850
Wire Wire Line
	12550 6100 12550 6850
$Comp
L power:GND #PWR?
U 1 1 5EC2F0E6
P 12550 7000
F 0 "#PWR?" H 12550 6750 50  0001 C CNN
F 1 "GND" H 12650 7000 50  0000 C CNN
F 2 "" H 12550 7000 50  0001 C CNN
F 3 "" H 12550 7000 50  0001 C CNN
	1    12550 7000
	1    0    0    -1  
$EndComp
Wire Wire Line
	12150 6850 12550 6850
Wire Wire Line
	12550 6850 12550 7000
Connection ~ 12550 6850
$Comp
L Device:C_Small C?
U 1 1 5DF6DB00
P 11900 6200
F 0 "C?" V 11850 6300 50  0000 C CNN
F 1 "100n" V 11950 6350 50  0000 C CNN
F 2 "Capacitor_SMD:C_1206_3216Metric" H 11900 6200 50  0001 C CNN
F 3 "~" H 11900 6200 50  0001 C CNN
	1    11900 6200
	-1   0    0    1   
$EndComp
Wire Wire Line
	12000 5700 11900 5700
Wire Wire Line
	11900 5700 11900 6100
Connection ~ 12000 5700
Wire Wire Line
	11900 6850 12150 6850
Wire Wire Line
	11900 6300 11900 6850
Connection ~ 12150 6850
Wire Wire Line
	12700 5950 12850 5950
Wire Wire Line
	12900 5950 12900 5650
$Comp
L Amplifier_Operational:MC33172 U?
U 1 1 5DF6DAD5
P 13500 5550
F 0 "U?" H 13650 5850 50  0000 C CNN
F 1 "MC33172" H 13650 5750 50  0000 C CNN
F 2 "Package_SO:SOIC-8_3.9x4.9mm_P1.27mm" H 13500 5550 50  0001 C CNN
F 3 "http://www.onsemi.com/pub/Collateral/MC33171-D.PDF" H 13500 5550 50  0001 C CNN
	1    13500 5550
	1    0    0    -1  
$EndComp
Wire Wire Line
	13200 5650 12900 5650
Wire Wire Line
	13200 5450 13150 5450
Wire Wire Line
	13150 5450 13150 6400
Wire Wire Line
	13150 6400 13250 6400
Wire Wire Line
	13150 6400 13150 6850
Connection ~ 13150 6400
$Comp
L Device:R R?
U 1 1 5DF6DB02
P 15950 4450
F 0 "R?" V 15850 4450 50  0000 C CNN
F 1 "0R01" V 15950 4450 50  0000 C CNN
F 2 "Resistor_SMD:R_2010_5025Metric" V 15880 4450 50  0001 C CNN
F 3 "~" H 15950 4450 50  0001 C CNN
	1    15950 4450
	1    0    0    -1  
$EndComp
Wire Wire Line
	15750 4000 15950 4000
Wire Wire Line
	15950 4000 15950 4300
Connection ~ 15750 4000
Wire Wire Line
	15950 4600 15950 4800
Wire Wire Line
	15950 4800 15600 4800
Connection ~ 15600 4800
Wire Wire Line
	13150 6850 13800 6850
Connection ~ 15750 5050
Wire Wire Line
	15750 5050 15750 6850
$Comp
L Device:R R?
U 1 1 5F069DCB
P 13950 6850
F 0 "R?" V 13850 6850 50  0000 C CNN
F 1 "10" V 13950 6850 50  0000 C CNN
F 2 "Resistor_SMD:R_1206_3216Metric_Pad1.42x1.75mm_HandSolder" V 13880 6850 50  0001 C CNN
F 3 "~" H 13950 6850 50  0001 C CNN
	1    13950 6850
	0    -1   -1   0   
$EndComp
Wire Wire Line
	14100 6850 14400 6850
$Comp
L Device:R R?
U 1 1 5F0720E8
P 12850 6200
F 0 "R?" H 12950 6250 50  0000 C CNN
F 1 "1M" V 12850 6200 50  0000 C CNN
F 2 "Resistor_SMD:R_1206_3216Metric_Pad1.42x1.75mm_HandSolder" V 12780 6200 50  0001 C CNN
F 3 "~" H 12850 6200 50  0001 C CNN
	1    12850 6200
	1    0    0    -1  
$EndComp
Wire Wire Line
	12850 5950 12850 6050
Connection ~ 12850 5950
Wire Wire Line
	12850 5950 12900 5950
$Comp
L Device:C_Small C?
U 1 1 5F0BD82E
P 12850 6650
F 0 "C?" H 12800 6750 50  0000 C CNN
F 1 "100n" V 12950 6650 50  0000 C CNN
F 2 "Capacitor_SMD:C_1206_3216Metric" H 12850 6650 50  0001 C CNN
F 3 "~" H 12850 6650 50  0001 C CNN
	1    12850 6650
	-1   0    0    1   
$EndComp
Wire Wire Line
	12850 6750 12850 6850
Wire Wire Line
	12850 6850 12550 6850
Wire Wire Line
	12850 6350 12850 6500
$Comp
L Device:R R?
U 1 1 5F214E56
P 13000 6650
F 0 "R?" H 13100 6700 50  0000 C CNN
F 1 "100k" V 13000 6650 50  0000 C CNN
F 2 "Resistor_SMD:R_1206_3216Metric_Pad1.42x1.75mm_HandSolder" V 12930 6650 50  0001 C CNN
F 3 "~" H 13000 6650 50  0001 C CNN
	1    13000 6650
	1    0    0    -1  
$EndComp
Wire Wire Line
	12850 6850 13000 6850
Wire Wire Line
	13000 6850 13000 6800
Connection ~ 12850 6850
Wire Wire Line
	13000 6850 13150 6850
Connection ~ 13000 6850
Connection ~ 13150 6850
Wire Wire Line
	12850 6500 13000 6500
Connection ~ 12850 6500
Wire Wire Line
	12850 6500 12850 6550
Wire Wire Line
	13000 6500 13200 6500
Wire Wire Line
	13200 6500 13200 6600
Wire Wire Line
	13200 6600 13250 6600
Connection ~ 13000 6500
$Comp
L Device:C_Small C?
U 1 1 5DF6DB09
P 13900 5250
F 0 "C?" H 13850 5350 50  0000 C CNN
F 1 "100n" V 14000 5250 50  0000 C CNN
F 2 "Capacitor_SMD:C_1206_3216Metric" H 13900 5250 50  0001 C CNN
F 3 "~" H 13900 5250 50  0001 C CNN
	1    13900 5250
	1    0    0    -1  
$EndComp
Wire Wire Line
	13900 5550 13900 5350
Connection ~ 13900 5550
Wire Wire Line
	13900 5550 13950 5550
Wire Wire Line
	13900 5150 13900 4950
Wire Wire Line
	13900 4950 12900 4950
Wire Wire Line
	12900 4950 12900 5650
Connection ~ 12900 5650
Wire Wire Line
	14100 6500 14050 6500
Wire Wire Line
	14400 6700 14400 6850
Connection ~ 14400 6850
Wire Wire Line
	14400 6850 15750 6850
$Comp
L Device:LED D?
U 1 1 5F529684
P 14050 6100
F 0 "D?" V 14089 5983 50  0000 R CNN
F 1 "LED" V 13998 5983 50  0000 R CNN
F 2 "Diode_SMD:D_0805_2012Metric" H 14050 6100 50  0001 C CNN
F 3 "~" H 14050 6100 50  0001 C CNN
	1    14050 6100
	0    -1   -1   0   
$EndComp
$Comp
L Device:LED D?
U 1 1 5F52F41C
P 14400 6100
F 0 "D?" V 14439 5983 50  0000 R CNN
F 1 "LED" V 14348 5983 50  0000 R CNN
F 2 "Diode_SMD:D_0805_2012Metric" H 14400 6100 50  0001 C CNN
F 3 "~" H 14400 6100 50  0001 C CNN
	1    14400 6100
	0    -1   -1   0   
$EndComp
Wire Wire Line
	14400 6250 14400 6300
Wire Wire Line
	14050 6250 14050 6500
Connection ~ 14050 6500
Wire Wire Line
	14050 6500 13850 6500
$Comp
L power:+5V #PWR?
U 1 1 5F64B57F
P 13850 5800
F 0 "#PWR?" H 13850 5650 50  0001 C CNN
F 1 "+5V" H 13865 5973 50  0000 C CNN
F 2 "" H 13850 5800 50  0001 C CNN
F 3 "" H 13850 5800 50  0001 C CNN
	1    13850 5800
	1    0    0    -1  
$EndComp
Wire Wire Line
	14050 5950 14050 5850
Wire Wire Line
	14050 5850 14250 5850
Wire Wire Line
	14250 5850 14250 5800
Wire Wire Line
	14250 5850 14400 5850
Wire Wire Line
	14400 5850 14400 5950
Connection ~ 14250 5850
$Comp
L Device:R R?
U 1 1 5DF6DB16
P 14000 5800
F 0 "R?" V 13900 5800 50  0000 C CNN
F 1 "2.2k" V 14000 5800 50  0000 C CNN
F 2 "Resistor_SMD:R_1206_3216Metric_Pad1.42x1.75mm_HandSolder" V 13930 5800 50  0001 C CNN
F 3 "~" H 14000 5800 50  0001 C CNN
	1    14000 5800
	0    -1   -1   0   
$EndComp
Wire Wire Line
	14150 5800 14250 5800
Connection ~ 12800 1750
Wire Wire Line
	12800 1750 12750 1750
Connection ~ 13100 1750
$Comp
L power:GND #PWR?
U 1 1 5D89445B
P 12950 2200
F 0 "#PWR?" H 12950 1950 50  0001 C CNN
F 1 "GND" H 12955 2027 50  0000 C CNN
F 2 "" H 12950 2200 50  0001 C CNN
F 3 "" H 12950 2200 50  0001 C CNN
	1    12950 2200
	1    0    0    -1  
$EndComp
Wire Wire Line
	13100 2050 13100 2150
Wire Wire Line
	13100 2150 12950 2150
Wire Wire Line
	12800 2050 12800 2150
Wire Wire Line
	12950 2200 12950 2150
Connection ~ 12950 2150
Wire Wire Line
	12950 2150 12800 2150
$Comp
L Device:R R?
U 1 1 5DF6DB23
P 14250 1950
F 0 "R?" V 14150 1950 50  0000 C CNN
F 1 "100k" V 14250 1950 50  0000 C CNN
F 2 "Resistor_SMD:R_1206_3216Metric_Pad1.42x1.75mm_HandSolder" V 14180 1950 50  0001 C CNN
F 3 "~" H 14250 1950 50  0001 C CNN
	1    14250 1950
	-1   0    0    1   
$EndComp
Wire Wire Line
	14750 1750 15600 1750
Wire Wire Line
	14100 2100 14100 2150
Connection ~ 14100 2150
Wire Wire Line
	14100 2150 13750 2150
Wire Wire Line
	14100 1800 14100 1750
Wire Wire Line
	14100 1750 14250 1750
Connection ~ 14100 1750
Text GLabel 13300 2500 3    50   Input ~ 0
stm_charge_sw
$Comp
L Device:LED D?
U 1 1 5DF6DB27
P 13650 2700
F 0 "D?" V 13700 2900 50  0000 R CNN
F 1 "LED" V 13600 2900 50  0000 R CNN
F 2 "Diode_SMD:D_1206_3216Metric_Pad1.42x1.75mm_HandSolder" H 13650 2700 50  0001 C CNN
F 3 "~" H 13650 2700 50  0001 C CNN
	1    13650 2700
	0    -1   -1   0   
$EndComp
Text Notes 12000 2400 0    50   ~ 0
H=off, L=on
Wire Wire Line
	12400 3250 12400 3200
Wire Wire Line
	12400 2900 12400 2850
Wire Wire Line
	12400 2550 12400 2500
Wire Wire Line
	13650 3250 13650 3200
Wire Wire Line
	13650 2550 13650 2500
Connection ~ 13650 2500
Wire Wire Line
	11950 2100 11950 2150
Connection ~ 11950 2150
Wire Wire Line
	11950 2150 12250 2150
Wire Wire Line
	12400 2500 12700 2500
Wire Wire Line
	13300 2500 13650 2500
Wire Wire Line
	14250 2700 14250 2800
Text GLabel 12700 2500 3    50   Input ~ 0
stm_load_sw
Connection ~ 12950 1750
Wire Wire Line
	12950 1750 12800 1750
Wire Wire Line
	13100 1750 12950 1750
Wire Notes Line
	12800 1250 13350 1250
Text Notes 13000 900  0    50   ~ 0
battery
$Comp
L power:GND #PWR?
U 1 1 600F6F3B
P 13200 1300
F 0 "#PWR?" H 13200 1050 50  0001 C CNN
F 1 "GND" H 13300 1300 50  0000 C CNN
F 2 "" H 13200 1300 50  0001 C CNN
F 3 "" H 13200 1300 50  0001 C CNN
	1    13200 1300
	1    0    0    -1  
$EndComp
Wire Notes Line
	13350 950  12800 950 
Wire Notes Line
	13350 1250 13350 950 
Wire Notes Line
	12800 950  12800 1250
$Comp
L Connector:Conn_01x01_Male J?
U 1 1 5DF6DAC9
P 13200 1000
F 0 "J?" H 13300 950 50  0000 R CNN
F 1 "wej -" H 13400 1050 50  0000 R CNN
F 2 "Connector_Wire:SolderWirePad_1x01_Drill1.5mm" H 13200 1000 50  0001 C CNN
F 3 "~" H 13200 1000 50  0001 C CNN
	1    13200 1000
	0    1    1    0   
$EndComp
$Comp
L Connector:Conn_01x01_Male J?
U 1 1 5DF6DACA
P 12950 1000
F 0 "J?" H 13050 950 50  0000 R CNN
F 1 "wej +" H 13150 1050 50  0000 R CNN
F 2 "Connector_Wire:SolderWirePad_1x01_Drill1.5mm" H 12950 1000 50  0001 C CNN
F 3 "~" H 12950 1000 50  0001 C CNN
	1    12950 1000
	0    1    1    0   
$EndComp
Wire Wire Line
	12950 1200 12950 1750
Wire Wire Line
	13200 1300 13200 1200
Wire Wire Line
	10100 1750 11300 1750
Text Notes 13200 2400 0    50   ~ 0
H=off, L=on
$Comp
L Device:R R?
U 1 1 5DF6DB26
P 13650 3050
F 0 "R?" V 13550 3050 50  0000 C CNN
F 1 "330" V 13650 3050 50  0000 C CNN
F 2 "Resistor_SMD:R_1206_3216Metric_Pad1.42x1.75mm_HandSolder" V 13580 3050 50  0001 C CNN
F 3 "~" H 13650 3050 50  0001 C CNN
	1    13650 3050
	1    0    0    -1  
$EndComp
$Comp
L Device:D_Zener D?
U 1 1 5F053C98
P 11800 1950
F 0 "D?" V 11800 1800 50  0000 L CNN
F 1 "10V" V 11900 1750 50  0000 L CNN
F 2 "Package_TO_SOT_SMD:SOT-23" H 11800 1950 50  0001 C CNN
F 3 "~" H 11800 1950 50  0001 C CNN
	1    11800 1950
	0    1    1    0   
$EndComp
Wire Wire Line
	11800 1800 11800 1750
Connection ~ 11800 1750
Wire Wire Line
	11800 1750 11950 1750
Wire Wire Line
	11950 1800 11950 1750
Connection ~ 11950 1750
Wire Wire Line
	11950 1750 12050 1750
Wire Wire Line
	11800 2100 11800 2150
Connection ~ 11800 2150
Wire Wire Line
	11800 2150 11950 2150
$Comp
L power:-5V #PWR?
U 1 1 5F136B4A
P 11800 3350
F 0 "#PWR?" H 11800 3450 50  0001 C CNN
F 1 "-5V" H 11815 3523 50  0000 C CNN
F 2 "" H 11800 3350 50  0001 C CNN
F 3 "" H 11800 3350 50  0001 C CNN
	1    11800 3350
	-1   0    0    1   
$EndComp
Wire Wire Line
	11800 3250 11800 3350
Wire Wire Line
	11800 3250 12200 3250
$Comp
L Device:R R?
U 1 1 5DF6DB2B
P 12400 3050
F 0 "R?" V 12300 3050 50  0000 C CNN
F 1 "330" V 12400 3050 50  0000 C CNN
F 2 "Resistor_SMD:R_1206_3216Metric_Pad1.42x1.75mm_HandSolder" V 12330 3050 50  0001 C CNN
F 3 "~" H 12400 3050 50  0001 C CNN
	1    12400 3050
	-1   0    0    -1  
$EndComp
Wire Wire Line
	12100 2500 12200 2500
Connection ~ 12400 2500
$Comp
L Device:R R?
U 1 1 5F21FB97
P 12200 2850
F 0 "R?" H 12100 2850 50  0000 C CNN
F 1 "300k" V 12200 2850 50  0000 C CNN
F 2 "Resistor_SMD:R_1206_3216Metric_Pad1.42x1.75mm_HandSolder" V 12130 2850 50  0001 C CNN
F 3 "~" H 12200 2850 50  0001 C CNN
	1    12200 2850
	1    0    0    1   
$EndComp
$Comp
L Device:R R?
U 1 1 5F220B6A
P 11800 2950
F 0 "R?" H 11900 2950 50  0000 C CNN
F 1 "10k" V 11800 2950 50  0000 C CNN
F 2 "Resistor_SMD:R_1206_3216Metric_Pad1.42x1.75mm_HandSolder" V 11730 2950 50  0001 C CNN
F 3 "~" H 11800 2950 50  0001 C CNN
	1    11800 2950
	1    0    0    1   
$EndComp
Wire Wire Line
	11800 2800 11800 2700
Wire Wire Line
	11800 3100 11800 3250
Connection ~ 11800 3250
Wire Wire Line
	12200 3000 12200 3250
Connection ~ 12200 3250
Wire Wire Line
	12200 3250 12400 3250
Wire Wire Line
	12200 2700 12200 2500
Connection ~ 12200 2500
Wire Wire Line
	12200 2500 12400 2500
Wire Wire Line
	11800 2300 11800 2150
$Comp
L Transistor_FET:2N7002 Q?
U 1 1 5DF6DB0B
P 11900 2500
F 0 "Q?" H 12100 2750 50  0000 L CNN
F 1 "2N7002" H 12000 2650 50  0000 L CNN
F 2 "Package_TO_SOT_SMD:SOT-23" H 12100 2425 50  0001 L CIN
F 3 "https://www.fairchildsemi.com/datasheets/2N/2N7002.pdf" H 11900 2500 50  0001 L CNN
	1    11900 2500
	-1   0    0    -1  
$EndComp
Wire Wire Line
	13650 3250 13850 3250
Wire Wire Line
	13650 2500 13850 2500
Wire Wire Line
	14550 2150 14550 2050
Wire Wire Line
	14250 1750 14250 1800
Connection ~ 14250 1750
Wire Wire Line
	14250 1750 14350 1750
Wire Wire Line
	14250 2100 14250 2150
Wire Wire Line
	14250 2150 14550 2150
$Comp
L power:-5V #PWR?
U 1 1 5F64A10C
P 14250 3350
F 0 "#PWR?" H 14250 3450 50  0001 C CNN
F 1 "-5V" H 14265 3523 50  0000 C CNN
F 2 "" H 14250 3350 50  0001 C CNN
F 3 "" H 14250 3350 50  0001 C CNN
	1    14250 3350
	-1   0    0    1   
$EndComp
Wire Wire Line
	14250 3350 14250 3250
Connection ~ 14250 3250
$Comp
L Device:R R?
U 1 1 5F6A14D6
P 13850 2850
F 0 "R?" H 13950 2900 50  0000 C CNN
F 1 "300k" V 13850 2850 50  0000 C CNN
F 2 "Resistor_SMD:R_1206_3216Metric_Pad1.42x1.75mm_HandSolder" V 13780 2850 50  0001 C CNN
F 3 "~" H 13850 2850 50  0001 C CNN
	1    13850 2850
	1    0    0    1   
$EndComp
Wire Wire Line
	13850 2700 13850 2500
Connection ~ 13850 2500
Wire Wire Line
	13850 2500 13950 2500
Wire Wire Line
	13850 3000 13850 3250
Connection ~ 13850 3250
Wire Wire Line
	13850 3250 14250 3250
$Comp
L Device:R R?
U 1 1 5DF6DB17
P 14250 2950
F 0 "R?" H 14350 2950 50  0000 C CNN
F 1 "10k" V 14250 2950 50  0000 C CNN
F 2 "Resistor_SMD:R_1206_3216Metric_Pad1.42x1.75mm_HandSolder" V 14180 2950 50  0001 C CNN
F 3 "~" H 14250 2950 50  0001 C CNN
	1    14250 2950
	1    0    0    1   
$EndComp
Wire Wire Line
	14250 3100 14250 3250
Wire Wire Line
	13650 2900 13650 2850
$Comp
L Device:D_Zener D?
U 1 1 5F51FD1B
P 14100 1950
F 0 "D?" V 14100 1800 50  0000 L CNN
F 1 "10V" V 14200 1750 50  0000 L CNN
F 2 "Package_TO_SOT_SMD:SOT-23" H 14100 1950 50  0001 C CNN
F 3 "~" H 14100 1950 50  0001 C CNN
	1    14100 1950
	0    1    1    0   
$EndComp
$Comp
L Transistor_FET:2N7002 Q?
U 1 1 5DF6DB18
P 14150 2500
F 0 "Q?" H 14450 2750 50  0000 L CNN
F 1 "2N7002" H 14350 2650 50  0000 L CNN
F 2 "Package_TO_SOT_SMD:SOT-23" H 14350 2425 50  0001 L CIN
F 3 "https://www.fairchildsemi.com/datasheets/2N/2N7002.pdf" H 14150 2500 50  0001 L CNN
	1    14150 2500
	1    0    0    -1  
$EndComp
$Comp
L max6070:MAX6070 U?
U 1 1 602B892A
P 5200 2400
F 0 "U?" H 5200 2987 60  0000 C CNN
F 1 "MAX6070" H 5200 2881 60  0000 C CNN
F 2 "" H 5050 2850 60  0001 C CNN
F 3 "" H 5050 2850 60  0001 C CNN
	1    5200 2400
	-1   0    0    -1  
$EndComp
Connection ~ 5200 2900
$Comp
L power:+3.3VADC #PWR?
U 1 1 6061CAAF
P 4300 2050
F 0 "#PWR?" H 4450 2000 50  0001 C CNN
F 1 "+3.3VADC" H 4320 2193 50  0000 C CNN
F 2 "" H 4300 2050 50  0001 C CNN
F 3 "" H 4300 2050 50  0001 C CNN
	1    4300 2050
	1    0    0    -1  
$EndComp
Wire Wire Line
	4300 2250 4300 2050
$Comp
L power:+3.3VADC #PWR?
U 1 1 60666897
P 3200 1550
F 0 "#PWR?" H 3350 1500 50  0001 C CNN
F 1 "+3.3VADC" H 3220 1693 50  0000 C CNN
F 2 "" H 3200 1550 50  0001 C CNN
F 3 "" H 3200 1550 50  0001 C CNN
	1    3200 1550
	1    0    0    -1  
$EndComp
$Comp
L power:+3.3VADC #PWR?
U 1 1 5DF6DB28
P 6700 5700
F 0 "#PWR?" H 6850 5650 50  0001 C CNN
F 1 "+3.3VADC" H 6720 5843 50  0000 C CNN
F 2 "" H 6700 5700 50  0001 C CNN
F 3 "" H 6700 5700 50  0001 C CNN
	1    6700 5700
	1    0    0    -1  
$EndComp
Wire Wire Line
	6700 5750 6700 5700
Wire Wire Line
	5650 2700 5700 2700
Wire Wire Line
	5700 2700 5700 2100
Wire Wire Line
	5700 2100 5650 2100
Connection ~ 5700 2100
$Comp
L Device:C C?
U 1 1 60841CC6
P 5800 2650
F 0 "C?" H 5900 2650 50  0000 L CNN
F 1 "100nF" H 5850 2550 50  0000 L CNN
F 2 "Capacitor_SMD:C_1206_3216Metric_Pad1.42x1.75mm_HandSolde" H 5838 2500 50  0001 C CNN
F 3 "~" H 5800 2650 50  0001 C CNN
	1    5800 2650
	1    0    0    -1  
$EndComp
Wire Notes Line width 8
	6200 1600 6200 3100
Wire Wire Line
	6100 1850 6100 2100
Wire Wire Line
	5200 2900 5800 2900
Wire Wire Line
	5650 2400 5800 2400
Wire Wire Line
	5800 2400 5800 2500
Wire Wire Line
	5800 2800 5800 2900
Connection ~ 5800 2900
Wire Wire Line
	5800 2900 6100 2900
Wire Wire Line
	5700 2100 6100 2100
Connection ~ 6100 2100
Wire Wire Line
	6100 2100 6100 2150
Wire Wire Line
	4550 2100 4550 2250
Wire Wire Line
	4550 2250 4750 2250
Connection ~ 4550 2550
Wire Wire Line
	4550 2250 4550 2550
Wire Wire Line
	4550 2900 5200 2900
$Comp
L Device:C C?
U 1 1 60AA59F5
P 4550 2750
F 0 "C?" H 4650 2750 50  0000 L CNN
F 1 "100nF" H 4600 2650 50  0000 L CNN
F 2 "Capacitor_SMD:C_1206_3216Metric_Pad1.42x1.75mm_HandSolde" H 4588 2600 50  0001 C CNN
F 3 "~" H 4550 2750 50  0001 C CNN
	1    4550 2750
	-1   0    0    -1  
$EndComp
Wire Wire Line
	4750 2550 4550 2550
Wire Wire Line
	4550 2550 4550 2600
Text Notes 4050 2350 0    39   ~ 0
OUTS close to microcontroller\n
$Comp
L power:+3.3VADC #PWR?
U 1 1 60DFA880
P 8900 6600
F 0 "#PWR?" H 9050 6550 50  0001 C CNN
F 1 "+3.3VADC" H 8920 6743 50  0000 C CNN
F 2 "" H 8900 6600 50  0001 C CNN
F 3 "" H 8900 6600 50  0001 C CNN
	1    8900 6600
	1    0    0    -1  
$EndComp
Wire Wire Line
	8900 6700 8900 6600
NoConn ~ 2300 2850
NoConn ~ 2300 2950
NoConn ~ 2300 3050
NoConn ~ 2300 3250
NoConn ~ 2300 3350
NoConn ~ 2300 3450
NoConn ~ 2300 3550
NoConn ~ 2300 3650
NoConn ~ 2300 3750
Connection ~ 3600 4650
Wire Wire Line
	3600 4650 4250 4650
Wire Wire Line
	3600 3550 3700 3550
Wire Wire Line
	4000 3450 3600 3450
Wire Wire Line
	4050 3350 3600 3350
Wire Wire Line
	4100 3250 3600 3250
$Comp
L MCU_ST_STM32F3:STM32F301C8Tx U?
U 1 1 5D7474C0
P 3000 3450
F 0 "U?" H 2950 2700 50  0000 C CNN
F 1 "STM32F301C8Tx" H 2950 2800 50  0000 C CNN
F 2 "Package_QFP:LQFP-48_7x7mm_P0.5mm" H 2400 2050 50  0001 R CNN
F 3 "http://www.st.com/st-web-ui/static/active/en/resource/technical/document/datasheet/DM00093332.pdf" H 3000 3450 50  0001 C CNN
	1    3000 3450
	1    0    0    -1  
$EndComp
NoConn ~ 2300 3850
NoConn ~ 2300 3950
NoConn ~ 2300 4050
NoConn ~ 2300 4150
NoConn ~ 2300 4250
NoConn ~ 2300 4350
NoConn ~ 2300 4450
NoConn ~ 2300 4550
NoConn ~ 2300 4650
NoConn ~ 2300 4750
NoConn ~ 3600 4750
NoConn ~ 3600 4450
NoConn ~ 3600 4350
NoConn ~ 3600 4250
NoConn ~ 3600 3950
NoConn ~ 3600 3850
NoConn ~ 3600 3750
NoConn ~ 3600 3650
NoConn ~ 2800 1950
NoConn ~ 6200 7200
NoConn ~ 6200 7300
NoConn ~ 6200 7500
NoConn ~ 6200 7600
NoConn ~ 6200 7700
NoConn ~ 6200 7800
NoConn ~ 6800 7700
NoConn ~ 6800 7600
NoConn ~ 6800 7100
Text GLabel 3650 4150 2    50   Input ~ 0
stm_load_sw
Text GLabel 3650 4050 2    50   Input ~ 0
stm_charge_sw
Wire Wire Line
	3600 4050 3650 4050
Wire Wire Line
	3650 4150 3600 4150
Wire Wire Line
	4150 3900 4450 3900
Wire Wire Line
	4450 3900 4450 3950
Wire Wire Line
	4950 3950 4950 4100
Connection ~ 4950 3550
Wire Wire Line
	4950 3550 6500 3550
$Comp
L Transistor_FET:2N7002 Q?
U 1 1 6214ADD2
P 7250 7550
F 0 "Q?" H 7550 7550 50  0000 L CNN
F 1 "2N7002" H 7450 7450 50  0000 L CNN
F 2 "Package_TO_SOT_SMD:SOT-23" H 7450 7475 50  0001 L CIN
F 3 "https://www.fairchildsemi.com/datasheets/2N/2N7002.pdf" H 7250 7550 50  0001 L CNN
	1    7250 7550
	1    0    0    -1  
$EndComp
Connection ~ 7350 7350
$EndSCHEMATC
