module gitlab.com/investio/backend/api

go 1.15

require (
	github.com/gin-contrib/cors v1.3.1
	github.com/gin-gonic/gin v1.6.3
	github.com/go-playground/assert/v2 v2.0.1
	github.com/gorilla/websocket v1.4.2 // indirect
	github.com/influxdata/influxdb-client-go/v2 v2.2.1
	github.com/joho/godotenv v1.3.0
	github.com/rs/zerolog v1.28.0
	github.com/shopspring/decimal v1.2.0
	gopkg.in/olahol/melody.v1 v1.0.0-20170518105555-d52139073376
	gorm.io/driver/mysql v1.0.4
	gorm.io/gorm v1.20.12
)
