{
  "packages": [
    {
      "websiteURL": "https://invector.se",
      "tools": [
        {
          "name": "CMSIS",
          "version": "5.4.0",
          "systems": [
            {
              "host": "i686-mingw32",
              "url": "https://github.com/ARM-software/CMSIS_5/archive/5.4.0.tar.gz",
              "archiveFileName": "CMSIS_5-5.4.0-invector.tar.gz",
              "checksum": "SHA-256:93d09907ceb23a520ef65e6b5014d2e866efa6b7f5fe5d8828b29bbc54dec697",
              "size": "153772853"
            },
            {
              "host": "x86_64-apple-darwin",
              "url": "https://github.com/ARM-software/CMSIS_5/archive/5.4.0.tar.gz",
              "archiveFileName": "CMSIS_5-5.4.0-invector.tar.gz",
              "checksum": "SHA-256:93d09907ceb23a520ef65e6b5014d2e866efa6b7f5fe5d8828b29bbc54dec697",
              "size": "153772853"
            },
            {
              "host": "x86_64-pc-linux-gnu",
              "url": "https://github.com/ARM-software/CMSIS_5/archive/5.4.0.tar.gz",
              "archiveFileName": "CMSIS_5-5.4.0-invector.tar.gz",
              "checksum": "SHA-256:93d09907ceb23a520ef65e6b5014d2e866efa6b7f5fe5d8828b29bbc54dec697",
              "size": "153772853"
            },
            {
              "host": "i686-pc-linux-gnu",
              "url": "https://github.com/ARM-software/CMSIS_5/archive/5.4.0.tar.gz",
              "archiveFileName": "CMSIS_5-5.4.0-invector.tar.gz",
              "checksum": "SHA-256:93d09907ceb23a520ef65e6b5014d2e866efa6b7f5fe5d8828b29bbc54dec697",
              "size": "153772853"
            },
            {
              "host": "arm-linux-gnueabihf",
              "url": "https://github.com/ARM-software/CMSIS_5/archive/5.4.0.tar.gz",
              "archiveFileName": "CMSIS_5-5.4.0-invector.tar.gz",
              "checksum": "SHA-256:93d09907ceb23a520ef65e6b5014d2e866efa6b7f5fe5d8828b29bbc54dec697",
              "size": "153772853"
            },
            {
              "host": "aarch64-linux-gnu",
              "url": "https://github.com/ARM-software/CMSIS_5/archive/5.4.0.tar.gz",
              "archiveFileName": "CMSIS_5-5.4.0-invector.tar.gz",
              "checksum": "SHA-256:93d09907ceb23a520ef65e6b5014d2e866efa6b7f5fe5d8828b29bbc54dec697",
              "size": "153772853"
            },
            {
              "host": "all",
              "url": "https://github.com/ARM-software/CMSIS_5/archive/5.4.0.tar.gz",
              "archiveFileName": "CMSIS_5-5.4.0-invector.tar.gz",
              "checksum": "SHA-256:93d09907ceb23a520ef65e6b5014d2e866efa6b7f5fe5d8828b29bbc54dec697",
              "size": "153772853"
            }
          ]
        },
        {
          "name": "arm-none-eabi-gcc",
          "version": "9-2019q4",
          "systems": [
            {
              "host": "arm-linux-gnueabihf",
              "url": "http://downloads.arduino.cc/tools/gcc-arm-none-eabi-7-2019-q4-major-linuxarm.tar.bz2",
              "archiveFileName": "gcc-arm-none-eabi-7-2019-q4-major-linuxarm.tar.bz2",
              "checksum": "SHA-256:34180943d95f759c66444a40b032f7dd9159a562670fc334f049567de140c51b",
              "size": "96613739"
            },
            {
              "host": "aarch64-linux-gnu",
              "url": "https://developer.arm.com/-/media/Files/downloads/gnu-rm/9-2019q4/gcc-arm-none-eabi-9-2019-q4-major-aarch64-linux.tar.bz2",
              "archiveFileName": "gcc-arm-none-eabi-9-2019-q4-major-aarch64-linux.tar.bz2",
              "checksum": "MD5:0dfa059aae18fcf7d842e30c525076a4",
              "size": "128670769"
            },
            {
              "host": "i686-mingw32",
              "url": "https://github.com/adafruit/arduino-board-index/releases/download/build-tools/gcc-arm-none-eabi-9-2019-q4-major-win32.zip",
              "archiveFileName": "gcc-arm-none-eabi-9-2019-q4-major-win32.zip",
              "checksum": "MD5:9d60cbb0e358ab6a9d3c9e5dc3624dd2",
              "size": "153520070"
            },
            {
              "host": "x86_64-apple-darwin",
              "url": "https://developer.arm.com/-/media/Files/downloads/gnu-rm/9-2019q4/gcc-arm-none-eabi-9-2019-q4-major-mac.tar.bz2",
              "archiveFileName": "gcc-arm-none-eabi-9-2019-q4-major-mac.tar.bz2",
              "checksum": "MD5:241b64f0578db2cf146034fc5bcee3d4",
              "size": "116770520"
            },
            {
              "host": "x86_64-pc-linux-gnu",
              "url": "https://developer.arm.com/-/media/Files/downloads/gnu-rm/9-2019q4/gcc-arm-none-eabi-9-2019-q4-major-x86_64-linux.tar.bz2",
              "archiveFileName": "gcc-arm-none-eabi-9-2019-q4-major-x86_64-linux.tar.bz2",
              "checksum": "MD5:fe0029de4f4ec43cf7008944e34ff8cc",
              "size": "116802378"
            },
            {
              "host": "i686-pc-linux-gnu",
              "url": "http://downloads.arduino.cc/tools/gcc-arm-none-eabi-7-2018-q2-update-linux32.tar.bz2",
              "archiveFileName": "gcc-arm-none-eabi-7-2018-q2-update-linux32.tar.bz2",
              "checksum": "SHA-256:090a0bc2b1956bc49392dff924a6c30fa57c88130097b1972204d67a45ce3cf3",
              "size": "97427309"
            }
          ]
        },
        {
          "systems": [
            {
              "host": "i386-apple-darwin11",
              "checksum": "MD5:603bcce8e59683ac27054b3197a53254",
              "size": "96372129",
              "archiveFileName": "gcc-arm-none-eabi-5_2-2015q4-20151219-mac.tar.bz2",
              "url": "https://github.com/adafruit/Adafruit_nRF52_Arduino/releases/download/gcc-5_2-2015q4/gcc-arm-none-eabi-5_2-2015q4-20151219-mac.tar.bz2"
            },
            {
              "host": "i686-linux-gnu",
              "checksum": "MD5:f88caac80b4444a17344f57ccb760b90",
              "size": "92811866",
              "archiveFileName": "gcc-arm-none-eabi-5_2-2015q4-20151219-linux.tar.bz2",
              "url": "https://github.com/adafruit/Adafruit_nRF52_Arduino/releases/download/gcc-5_2-2015q4/gcc-arm-none-eabi-5_2-2015q4-20151219-linux.tar.bz2"
            },
            {
              "host": "x86_64-pc-linux-gnu",
              "checksum": "MD5:f88caac80b4444a17344f57ccb760b90",
              "size": "92811866",
              "archiveFileName": "gcc-arm-none-eabi-5_2-2015q4-20151219-linux.tar.bz2",
              "url": "https://github.com/adafruit/Adafruit_nRF52_Arduino/releases/download/gcc-5_2-2015q4/gcc-arm-none-eabi-5_2-2015q4-20151219-linux.tar.bz2"
            },
            {
              "host": "i686-mingw32",
              "checksum": "MD5:32d950225b6c7c886f6225c1fc578934",
              "size": "102981732",
              "archiveFileName": "gcc-arm-none-eabi-5_2-2015q4-20151219-win32.tar.bz2",
              "url": "https://github.com/adafruit/Adafruit_nRF52_Arduino/releases/download/gcc-5_2-2015q4/gcc-arm-none-eabi-5_2-2015q4-20151219-win32.tar.bz2"
            }
          ],
          "name": "gcc-arm-none-eabi",
          "version": "5_2-2015q4"
        }
      ],
      "name": "invector",
      "email": "info@invector.se",
      "help": {
        "online": "https://discord.com/channels/731576543050203147/733664452892950570"
      },
      "maintainer": "Invector",
      "platforms": [
        {
          "name": "Invector SAMD Boards",
          "architecture": "samd",
          "version": "1.0.0",
          "category": "Invector",
          "url": "http://invector.se/files/invector-samd-boards-1.0.0.tar.bz2",
          "archiveFileName": "invector-samd-boards-1.0.0.tar.bz2",
          "checksum": "SHA-256:dc47e83e5bc2c877975e220b53e1456266dc2f7a93b278a4f9c87fe81e6da5ad",
          "size": "1140416",
          "help": {
            "online": "https://discord.com/channels/731576543050203147/733664452892950570"
          },
          "boards": [
            {
              "name": "Invector Challenger M0 WiFi"
            }
          ],
          "toolsDependencies": [
            {
              "packager": "invector",
              "name": "arm-none-eabi-gcc",
              "version": "9-2019q4"
            },
            {
              "packager": "invector",
              "name": "CMSIS",
              "version": "5.4.0"
            },
            {
              "packager": "arduino",
              "name": "bossac",
              "version": "1.7.0-arduino3"
            },
            {
              "packager": "arduino",
              "name": "bossac",
              "version": "1.8.0-48-gb176eee"
            },
            {
              "packager": "arduino",
              "name": "openocd",
              "version": "0.10.0-arduino7"
            },
            {
              "packager": "arduino",
              "name": "CMSIS-Atmel",
              "version": "1.2.0"
            },
            {
              "packager": "arduino",
              "name": "arduinoOTA",
              "version": "1.2.1"
            }
          ]
        }
      ]
    }
  ]
}
