<svg width="14" height="14" viewBox="0 0 14 14" fill="none" xmlns="http://www.w3.org/2000/svg">
<path fill-rule="evenodd" clip-rule="evenodd" d="M7.67805 12.7902L12.2402 2.25L1.70001 6.81218H7.67805V12.7902Z" fill="black"/>
</svg>
