{
  "annotations": {
    "changelogDate": "20240701113555"
  },
  "applications": "*",
  "fields": [
    {
      "fieldName": "name",
      "fieldType": "String",
      "fieldValidateRules": ["required"]
    },
    {
      "fieldName": "desc",
      "fieldType": "String"
    },
    {
      "fieldName": "discountRate",
      "fieldType": "Float",
      "fieldValidateRules": ["required", "min", "max"],
      "fieldValidateRulesMax": "1",
      "fieldValidateRulesMin": "0"
    },
    {
      "fieldName": "startDate",
      "fieldType": "Instant",
      "fieldValidateRules": ["required"]
    },
    {
      "fieldName": "endDate",
      "fieldType": "Instant",
      "fieldValidateRules": ["required"]
    },
    {
      "fieldName": "isDeleted",
      "fieldType": "Boolean"
    }
  ],
  "name": "Discount",
  "pagination": "pagination",
  "relationships": [
    {
      "otherEntityName": "product",
      "otherEntityRelationshipName": "discount",
      "relationshipName": "product",
      "relationshipSide": "left",
      "relationshipType": "one-to-many"
    }
  ],
  "searchEngine": "no",
  "service": "serviceClass"
}
