id;name;price_modifier;unit;is_deleted
1;rarely;5523.76;absent within;false
2;anchovy duh an;7433.33;supposing fluffy consequently;false
3;what what;27409.34;if amidst;true
4;freely;10138.53;stamp;true
5;hmph yoga athwart;3834.28;wholly upon spur;false
6;cloud;5195.53;untidy meanwhile;true
7;drown detail;20210.74;bay tan courageously;true
8;circa carp;10954.94;punctually knowledgeably bah;true
9;zowie;23806.63;forenenst ack;true
10;where;16378.29;aside;false
