{
  "annotations": {
    "changelogDate": "20240701113558"
  },
  "applications": "*",
  "fields": [
    {
      "fieldName": "quantity",
      "fieldType": "Integer"
    },
    {
      "fieldName": "unitPrice",
      "fieldType": "Float"
    },
    {
      "fieldName": "transactionDate",
      "fieldType": "Instant"
    },
    {
      "fieldName": "note",
      "fieldType": "byte[]",
      "fieldTypeBlobContent": "text"
    },
    {
      "fieldName": "isDeleted",
      "fieldType": "Boolean"
    }
  ],
  "name": "InventoryTransactions",
  "pagination": "pagination",
  "relationships": [
    {
      "otherEntityName": "user",
      "relationshipName": "user",
      "relationshipSide": "left",
      "relationshipType": "many-to-one",
      "relationshipWithBuiltInEntity": true
    },
    {
      "otherEntityName": "supplier",
      "relationshipName": "supplier",
      "relationshipSide": "right",
      "relationshipType": "many-to-one"
    },
    {
      "otherEntityName": "product",
      "relationshipName": "product",
      "relationshipSide": "right",
      "relationshipType": "many-to-one"
    }
  ],
  "searchEngine": "no",
  "service": "serviceClass"
}
