[
  {
    "groupId": "io.netty",
    "artifactId": "netty",
    "type": "jar",
    "classifier": null,
    "version": "3.9.1.Final",
    "scope": "compile",
    "transitive": false,
    "parents": [],
    "optional": false,
    "requirement": "3.9.1.Final"
  },
  {
    "groupId": "junit",
    "artifactId": "junit",
    "type": "jar",
    "classifier": null,
    "version": "3.8",
    "scope": "test",
    "transitive": false,
    "parents": [],
    "optional": false,
    "requirement": "3.8"
  }
]