Tipo: static. Carga: 20
[19, 0, 20.00000000000146]

Tipo: incremental. Carga: 20
[881, 816, 20.00000000000146]

Tipo: dinamic. Carga: 20
[474, 82, 20.00000000000146]

Tipo: static. Carga: 50
[49, 0, 50.00099999997417]

Tipo: incremental. Carga: 50
[26528, 26463, 50.00099999997417]

Tipo: dinamic. Carga: 50
[26024, 19778, 50.00099999997417]

Tipo: static. Carga: 80
[78, 13, 80.00000000001793]

Tipo: incremental. Carga: 80
[59204, 59139, 80.00000000001793]

Tipo: dinamic. Carga: 80
[53829, 39866, 80.00000000001793]



[[19, 0, 20.00000000000146], [881, 816, 20.00000000000146], [474, 82, 20.00000000000146], [49, 0, 50.00099999997417], [26528, 26463, 50.00099999997417], [26024, 19778, 50.00099999997417], [78, 13, 80.00000000001793], [59204, 59139, 80.00000000001793], [53829, 39866, 80.00000000001793]]