{
  "General": [
    {"PriceOfPurchaseRequisition": 300000, "Tier": 1, "MinimumFollowers": 1000000},
    {"PriceOfPurchaseRequisition": 150000, "Tier": 2, "MinimumFollowers": 100000},
    {"PriceOfPurchaseRequisition": 85000, "Tier": 3, "MinimumFollowers":   99999 }
  ],
  "Business": [
    {"PriceOfPurchaseRequisition": 300000, "Tier": 1, "MinimumFollowers": 100000},
    {"PriceOfPurchaseRequisition": 150000, "Tier": 2, "MinimumFollowers": 50000},
    {"PriceOfPurchaseRequisition": 85000, "Tier": 3, "MinimumFollowers":   49000 }
  ],
  "Real Estate+Infra": [
    {"PriceOfPurchaseRequisition": 300000, "Tier": 1, "MinimumFollowers": 100000},
    {"PriceOfPurchaseRequisition": 150000, "Tier": 2, "MinimumFollowers": 50000},
    {"PriceOfPurchaseRequisition": 85000, "Tier": 3, "MinimumFollowers":   49000 }],
  "Stock & Investment": [
    {"PriceOfPurchaseRequisition": 300000, "Tier": 1, "MinimumFollowers": 100000},
    {"PriceOfPurchaseRequisition": 150000, "Tier": 2, "MinimumFollowers": 50000},
    {"PriceOfPurchaseRequisition": 85000, "Tier": 3, "MinimumFollowers":   49000 }],
  "Automotive": [
    {"PriceOfPurchaseRequisition": 300000, "Tier": 1, "MinimumFollowers": 100000},
    {"PriceOfPurchaseRequisition": 150000, "Tier": 2, "MinimumFollowers": 10000},
    {"PriceOfPurchaseRequisition": 85000, "Tier": 3, "MinimumFollowers":  9999 }
  ],
  "Industry-Energy": [
    {"PriceOfPurchaseRequisition": 300000, "Tier": 1, "MinimumFollowers": 10000},
    {"PriceOfPurchaseRequisition": 150000, "Tier": 2, "MinimumFollowers": 9999}
  ],
  "Tech-Innovation": [
    {"PriceOfPurchaseRequisition": 300000, "Tier": 1, "MinimumFollowers": 100000},
    {"PriceOfPurchaseRequisition": 150000, "Tier": 2, "MinimumFollowers": 50000},
    {"PriceOfPurchaseRequisition": 85000, "Tier": 3, "MinimumFollowers":   49000 }
  ],
  "CSR-ESG": [
    {"PriceOfPurchaseRequisition": 300000, "Tier": 1, "MinimumFollowers": 10000},
    {"PriceOfPurchaseRequisition": 150000, "Tier": 2, "MinimumFollowers": 9999}
  ],
  "Education": [
    {"PriceOfPurchaseRequisition": 300000, "Tier": 1, "MinimumFollowers": 50000},
    {"PriceOfPurchaseRequisition": 150000, "Tier": 2, "MinimumFollowers": 49999}
  ],
  "SMEs": [
    {"PriceOfPurchaseRequisition": 300000, "Tier": 1, "MinimumFollowers": 100000},
    {"PriceOfPurchaseRequisition": 150000, "Tier": 2, "MinimumFollowers": 99999}
  ],
  "Lifestyle": [
    {"PriceOfPurchaseRequisition": 300000, "Tier": 1, "MinimumFollowers": 100000},
    {"PriceOfPurchaseRequisition": 150000, "Tier": 2, "MinimumFollowers": 10000},
    {"PriceOfPurchaseRequisition": 85000, "Tier": 3, "MinimumFollowers":  9999 }
  ],
  "Design, Art, Culture": [
    {"PriceOfPurchaseRequisition": 300000, "Tier": 1, "MinimumFollowers": 50000},
    {"PriceOfPurchaseRequisition": 150000, "Tier": 2, "MinimumFollowers": 49999}
  ],
  "Life & Medical": [],
  "Entertainment": [
    {"PriceOfPurchaseRequisition": 300000, "Tier": 1, "MinimumFollowers": 100000},
    {"PriceOfPurchaseRequisition": 150000, "Tier": 2, "MinimumFollowers": 10000},
    {"PriceOfPurchaseRequisition": 85000, "Tier": 3, "MinimumFollowers":  9999 }
  ],
  "Agriculture": [
    {"PriceOfPurchaseRequisition": 300000, "Tier": 1, "MinimumFollowers": 30000},
    {"PriceOfPurchaseRequisition": 150000, "Tier": 2, "MinimumFollowers": 29999}
  ],
  "Local Media": [],
  "Sports": [
    {"PriceOfPurchaseRequisition": 300000, "Tier": 1, "MinimumFollowers": 100000},
    {"PriceOfPurchaseRequisition": 150000, "Tier": 2, "MinimumFollowers": 99999}
  ],
  "International": []
}