{
    "id": "7d22d0d9-32e0-41c1-b1e8-11069a7e314a",
    "clientId": "tuency_client",
    "name": "tuency_client",
    "description": "Service Account MGMT.",
    "rootUrl": "http://tuency_client",
    "adminUrl": "http://tuency_client",
    "baseUrl": "",
    "surrogateAuthRequired": false,
    "enabled": true,
    "alwaysDisplayInConsole": false,
    "clientAuthenticatorType": "client-secret",
    "secret": "NoeuGCLFUpUezxlp7VMvptyE3WL0ILgQ",
    "redirectUris": [
      "http://tuency_client/*"
    ],
    "webOrigins": [
      "http://tuency_client"
    ],
    "notBefore": 0,
    "bearerOnly": false,
    "consentRequired": false,
    "standardFlowEnabled": false,
    "implicitFlowEnabled": false,
    "directAccessGrantsEnabled": false,
    "serviceAccountsEnabled": true,
    "authorizationServicesEnabled": true,
    "publicClient": false,
    "frontchannelLogout": false,
    "protocol": "openid-connect",
    "attributes": {
      "saml.assertion.signature": "false",
      "client.secret.creation.time": "1708086849",
      "saml.force.post.binding": "false",
      "saml.multivalued.roles": "false",
      "saml.encrypt": "false",
      "oauth2.device.authorization.grant.enabled": "false",
      "saml.server.signature": "false",
      "backchannel.logout.revoke.offline.tokens": "false",
      "saml.server.signature.keyinfo.ext": "false",
      "exclude.session.state.from.auth.response": "false",
      "oidc.ciba.grant.enabled": "false",
      "backchannel.logout.session.required": "true",
      "saml_force_name_id_format": "false",
      "saml.client.signature": "false",
      "tls.client.certificate.bound.access.tokens": "false",
      "saml.authnstatement": "false",
      "display.on.consent.screen": "false",
      "saml.onetimeuse.condition": "false"
    },
    "authenticationFlowBindingOverrides": {},
    "fullScopeAllowed": true,
    "nodeReRegistrationTimeout": -1,
    "protocolMappers": [
      {
        "name": "client roles",
        "protocol": "openid-connect",
        "protocolMapper": "oidc-usermodel-client-role-mapper",
        "consentRequired": false,
        "config": {
          "multivalued": "true",
          "userinfo.token.claim": "true",
          "user.attribute": "foo",
          "id.token.claim": "true",
          "access.token.claim": "true",
          "claim.name": "clientroles",
          "jsonType.label": "String",
          "usermodel.clientRoleMapping.clientId": "tuency_client"
        }
      },
      {
        "name": "username",
        "protocol": "openid-connect",
        "protocolMapper": "oidc-usermodel-property-mapper",
        "consentRequired": false,
        "config": {
          "userinfo.token.claim": "true",
          "user.attribute": "username",
          "id.token.claim": "true",
          "access.token.claim": "true",
          "claim.name": "username",
          "jsonType.label": "String"
        }
      }
    ],
    "defaultClientScopes": [
      "web-origins",
      "roles",
      "profile",
      "basic",
      "email"
    ],
    "optionalClientScopes": [
      "address",
      "phone",
      "offline_access",
      "microprofile-jwt"
    ],
    "access": {
      "view": true,
      "configure": true,
      "manage": true
    }
  }