{
    "client": {
        "pageMainTitle": "Tuency Two"
    },
    "keycloak": {
        "url": "http://keycloak.tuency.localhost",
        "realm": "tuency",
        "clientId": "tuencytwo"
    }
}