{
    "client": {
        "pageMainTitle": "Tuency Three"
    },
    "keycloak": {
        "url": "http://keycloak.tuency.localhost",
        "realm": "tuency",
        "clientId": "tuencythree"
    }
}