{
    "cert_mrk": {
        "tenantId": 1,
        "name": "cert.mrk"
    },
    "h20cert_mrk": {
        "tenantId": 2,
        "name": "h20cert.mrk"
    },
    "windcert_mrk": {
        "tenantId": 3,
        "name": "windcert.mrk"
    }
}