<?xml version="1.0" encoding="UTF-8" standalone="no"?>
<!-- Created with Inkscape (http://www.inkscape.org/) -->

<svg
   xmlns:dc="http://purl.org/dc/elements/1.1/"
   xmlns:cc="http://creativecommons.org/ns#"
   xmlns:rdf="http://www.w3.org/1999/02/22-rdf-syntax-ns#"
   xmlns:svg="http://www.w3.org/2000/svg"
   xmlns="http://www.w3.org/2000/svg"
   xmlns:sodipodi="http://sodipodi.sourceforge.net/DTD/sodipodi-0.dtd"
   xmlns:inkscape="http://www.inkscape.org/namespaces/inkscape"
   width="4.196125mm"
   height="4.2333331mm"
   viewBox="0 0 4.196125 4.2333331"
   version="1.1"
   id="svg8"
   inkscape:version="0.92.5 (2060ec1f9f, 2020-04-08)"
   sodipodi:docname="logo-h2o.svg">
  <defs
     id="defs2" />
  <sodipodi:namedview
     id="base"
     pagecolor="#ffffff"
     bordercolor="#666666"
     borderopacity="1.0"
     inkscape:pageopacity="0.0"
     inkscape:pageshadow="2"
     inkscape:zoom="1.4142135"
     inkscape:cx="173.42296"
     inkscape:cy="-77.941784"
     inkscape:document-units="px"
     inkscape:current-layer="layer1"
     showgrid="true"
     showborder="true"
     inkscape:window-width="2560"
     inkscape:window-height="1370"
     inkscape:window-x="1920"
     inkscape:window-y="34"
     inkscape:window-maximized="1"
     inkscape:snap-path-clip="true"
     objecttolerance="20"
     inkscape:snap-global="true">
    <inkscape:grid
       type="xygrid"
       id="grid4528"
       spacingx="0.26458333"
       empspacing="4"
       snapvisiblegridlinesonly="false"
       originx="-24.359753"
       originy="-195.79171"
       enabled="true"
       visible="true" />
  </sodipodi:namedview>
  <metadata
     id="metadata5">
    <rdf:RDF>
      <cc:Work
         rdf:about="">
        <dc:format>image/svg+xml</dc:format>
        <dc:type
           rdf:resource="http://purl.org/dc/dcmitype/StillImage" />
        <dc:title></dc:title>
      </cc:Work>
    </rdf:RDF>
  </metadata>
  <g
     inkscape:label="Layer 1"
     inkscape:groupmode="layer"
     id="layer1"
     transform="translate(-24.359753,-96.974958)">
    <rect
       style="fill:#c73928;fill-opacity:0;stroke-width:0.52916664;stroke-miterlimit:4;stroke-dasharray:none"
       id="rect5025"
       width="4.2333331"
       height="4.2333331"
       x="24.341667"
       y="96.974998" />
    <path
       style="fill:#c73928;fill-opacity:1;stroke-width:1.99999988;stroke-miterlimit:4;stroke-dasharray:none"
       d="M 1.9316406,2 V 6.3242188 C 2.5353679,6.2135986 3.2010865,6.1269531 3.9355469,6.1269531 c 2.5354356,0 4.3261719,0.9804688 4.3261719,0.9804688 0,0 1.3370191,0.7304687 3.3730472,0.7304687 0.876215,0 1.655423,-0.146631 2.296875,-0.3085937 V 2 Z"
       id="path4967"
       transform="matrix(0.26458333,0,0,0.26458333,24.359753,96.974958)" />
    <path
       style="fill:#3ca4ab;fill-opacity:1;stroke-width:1.99999988;stroke-miterlimit:4;stroke-dasharray:none"
       d="m 13.931641,9.5839844 c -0.672292,0.1403242 -1.437262,0.2558594 -2.296875,0.2558594 -2.5354133,0 -4.3339848,-0.9824219 -4.3339848,-0.9824219 0,0 -1.3291801,-0.7304688 -3.3652343,-0.7304688 -0.7531336,0 -1.4170915,0.1105739 -2.0039063,0.2402344 V 14 H 13.931641 Z"
       id="path4963"
       transform="matrix(0.26458333,0,0,0.26458333,24.359753,96.974958)" />
  </g>
</svg>
