{
  "Servers": {
    "1": {
      "Name": "bds",
      "Group": "Servers",
      "Host": "sedaq-db-postgres",
      "Port": 5432,
      "MaintenanceDB": "postgres",
      "Username": "postgres",
      "SSLMode": "prefer",
	  "PassFile": "/pgpass"
    }
  }
}